nixbot

builds

failed nodejs-slim-26.9.0 checks.x86_64-linux.pkgs-test-vm · build #181 · raw

1structuredAttrs is enabled
unpackPhase
2unpacking source archive /nix/store/7ajvk1c4mspigbdgf21bn9d7f7p9kmgk-node-v26.9.0.tar.xz3source root is node-v26.9.04setting SOURCE_DATE_EPOCH to timestamp 1789550914 of file "node-v26.9.0/tools/nix/v8.nix"
patchPhase
5applying patch /nix/store/j4p9lc7z8hi4g40cpqpj3qxb9a7bvanp-configure-armv6-vfpv2.patch6patching file configure.py7Hunk #1 succeeded at 49 with fuzz 1 (offset -1 lines).8applying patch /nix/store/igz0qnjkvwi4f2mn7i13h3ndxl9n5ryi-node-npm-build-npm-package-logic.patch9patching file deps/npm/node_modules/@npmcli/run-script/lib/set-path.js10Hunk #1 succeeded at 13 with fuzz 2 (offset 1 line).11Hunk #2 succeeded at 37 (offset 8 lines).12patching file deps/npm/node_modules/pacote/lib/git.js13Hunk #1 succeeded at 186 (offset -2 lines).14patching file deps/npm/node_modules/@npmcli/arborist/lib/arborist/build-ideal-tree.js15Hunk #1 succeeded at 802 (offset 62 lines).16patching file deps/npm/node_modules/@npmcli/arborist/lib/arborist/load-actual.js17Hunk #1 succeeded at 121 with fuzz 1 (offset -26 lines).18applying patch /nix/store/57n0csr7hpdd0y91ljxpiwlfw7fsx3kl-use-correct-env-in-tests.patch19patching file test/parallel/test-child-process-default-options.js20patching file test/parallel/test-child-process-env.js21patching file test/parallel/test-child-process-exec-env.js22applying patch /nix/store/p2mhv95s89kaqmdynhz6y6asalf8y4dh-bin-sh-node-run-v22.patch23patching file test/fixtures/run-script/node_modules/.bin/positional-args24Hunk #1 succeeded at 1 with fuzz 1.25applying patch /nix/store/3za8p3x3hjfr1a9b1lc3z4aapp9sm2ja-use-nix-codesign.patch26patching file test/parallel/test-macos-app-sandbox.js27applying patch /nix/store/6whc7i794ygkcwjwrprw7y9aglfl238g-fix-temporal-integration-with-shared-icu.patch28patching file deps/v8/src/objects/js-temporal-zoneinfo64.cc29patching file tools/v8_gypfiles/v8.gyp30Hunk #1 succeeded at 1398 (offset 19 lines).31Hunk #2 succeeded at 2051 (offset 93 lines).
updateAutotoolsGnuConfigScriptsPhase
32Updating Autotools / GNU config script to a newer upstream version: ./deps/libffi/config.sub33Updating Autotools / GNU config script to a newer upstream version: ./deps/ngtcp2/ngtcp2/third-party/libev/config.sub34Updating Autotools / GNU config script to a newer upstream version: ./deps/cares/config/config.sub35Updating Autotools / GNU config script to a newer upstream version: ./deps/libffi/config.guess36Updating Autotools / GNU config script to a newer upstream version: ./deps/ngtcp2/ngtcp2/third-party/libev/config.guess37Updating Autotools / GNU config script to a newer upstream version: ./deps/cares/config/config.guess
configurePhase
38fixing libtool script ./deps/libffi/ltmain.sh39fixing libtool script ./deps/ngtcp2/ngtcp2/third-party/libev/ltmain.sh40fixing libtool script ./deps/cares/config/ltmain.sh41./deps/libffi/configure42./deps/ngtcp2/ngtcp2/third-party/libev/configure43./deps/cares/configure44configure flags: --prefix=/nix/store/mn8r5sjblqmigxv5lg89q4wcj5zqb16n-nodejs-slim-26.9.0 --ninja --with-intl=system-icu --openssl-use-def-ca-store --no-cross-compiling --dest-os=linux --dest-cpu=x64 --v8-enable-temporal-support --use-prefix-to-find-headers --shared-abseil --shared-abseil-libpath=/nix/store/iqvb7h1ykhm12304qwx17xbncrhhy1g4-abseil-cpp-20260107.1/lib --shared-ada --shared-ada-libpath=/nix/store/vk3yq4nzlrdvq1qxgy3764qaycanr0mc-ada-4.0.0/lib --shared-brotli --shared-brotli-libpath=/nix/store/xhgd6rb4h8ssid9yw8nvw74cwq69md5y-brotli-1.2.0-lib/lib --shared-cares --shared-cares-libpath=/nix/store/68syfccdbv3hlz7imlc9xl9fzyz4v8gx-c-ares-1.34.8/lib --shared-ffi --shared-ffi-libpath=/nix/store/3r5wfb1dl3sfknvy1yringvmap0hxj4r-libffi-3.8.0/lib --shared-gtest --shared-gtest-libpath=/nix/store/5sdsmm8s00hck28yp95fk993rg42mqsp-gtest-1.18.0/lib --shared-hdr-histogram --shared-hdr-histogram-libpath=/nix/store/9g532g9jf92xy9xh68p99ml815q11zs0-hdrhistogram_c-0.11.10/lib --shared-highway --shared-highway-libpath=/nix/store/xs1jbkdzxs4ym0rh89nx8xfwj387x3aj-libhwy-1.4.0/lib --shared-http-parser --shared-http-parser-libpath=/nix/store/1lw7d9jsv7qb6nvc4fmvvqsyphaacqcs-llhttp-9.4.3/lib --shared-libuv --shared-libuv-libpath=/nix/store/68b1blnvl4scgdq48d4p7h4lw4pm5w0w-libuv-1.52.1/lib --shared-lief --shared-lief-libpath=/nix/store/nx4g3j20wvgq36b406q6rysvqzzrxaci-lief-0.17.6/lib --shared-merve --shared-merve-libpath=/nix/store/2gj58j8rd88kaan7bsqhl9fjxxp11qqi-merve-1.2.2/lib --shared-nbytes --shared-nbytes-libpath=/nix/store/zf8c839ahp1fn736lih7ai2y14rrx2gn-nbytes-0.1.4/lib --shared-nghttp2 --shared-nghttp2-libpath=/nix/store/6avzrsm02jh7q48ym3hgznj3ypc2shc2-nghttp2-1.70.0-lib/lib --shared-nghttp3 --shared-nghttp3-libpath=/nix/store/dki4fkk75v2x4aqkszmi257wxq6rkkyr-nghttp3-1.16.0/lib --shared-ngtcp2 --shared-ngtcp2-libpath=/nix/store/2hc131frgdz45bjbajmpvlrj185lah7p-ngtcp2-1.23.0/lib --shared-openssl --shared-openssl-libpath=/nix/store/yj34vymbqf7mf4lmffipy8jqc4kwr1mc-openssl-3.6.4/lib --shared-simdjson --shared-simdjson-libpath=/nix/store/129shchmqszagbb0m8kk7ddzb7nnklxv-simdjson-4.6.8/lib --shared-simdutf --shared-simdutf-libpath=/nix/store/dw6xlar7m4qfrhbk63zhcc5pmixa1ga1-simdutf-9.1.0/lib --shared-sqlite --shared-sqlite-libpath=/nix/store/7a0nx1a0rdc5s07vxrsdhplqnzncl5z9-sqlite-3.53.3/lib --shared-temporal_capi --shared-temporal_capi-libpath=/nix/store/7hrx4vyx67h46xxwqj3zw4nafa1m8d04-temporal_capi-0.2.6/lib --shared-uvwasi --shared-uvwasi-libpath=/nix/store/qnbgx63w8yya5330xcxyixja3ah6gfzm-uvwasi-0.0.23/lib --shared-zlib --shared-zlib-libpath=/nix/store/lw86vj9kfwgvlivg3p8qg2nibpmhmsl9-zlib-1.3.2/lib --shared-zstd --shared-zstd-libpath=/nix/store/8ik1d1r4l2jzm9mjh6bc0a13yczx62wg-zstd-1.5.7/lib45INFO: configure completed successfully
buildPhase
46build flags: -j32 SHELL=/nix/store/svx59425zxp552p2b8gm11qj5r09b56i-bash-5.3p15/bin/bash47TERM=dumb ninja -C out/Release -j3248ninja: Entering directory `out/Release'49[1/1871] CXX obj/deps/v8/src/base/v8_libbase.abort-mode.o50[2/1871] CXX obj/deps/v8/src/base/v8_libbase.fpu.o51[3/1871] CXX obj/deps/v8/src/base/v8_libbase.once.o52[4/1871] CXX obj/deps/v8/src/base/v8_libbase.sys-info.o53[5/1871] CXX obj/deps/v8/src/base/v8_libbase.bits.o54[6/1871] CXX obj/deps/v8/src/base/v8_libbase.division-by-constant.o55[7/1871] CXX obj/deps/v8/src/base/v8_libbase.cpu.o56[8/1871] CXX obj/deps/v8/src/base/debug/v8_libbase.stack_trace.o57[9/1871] CXX obj/deps/v8/src/base/numbers/v8_libbase.diy-fp.o58[10/1871] CXX obj/deps/v8/src/base/numbers/v8_libbase.cached-powers.o59[11/1871] CXX obj/deps/v8/src/base/platform/v8_libbase.semaphore.o60[12/1871] CXX obj/deps/v8/src/base/platform/v8_libbase.platform.o61[13/1871] CXX obj/deps/v8/src/base/v8_libbase.file-utils.o62[14/1871] CXX obj/deps/v8/src/base/platform/v8_libbase.memory-protection-key.o63[15/1871] CXX obj/deps/v8/src/base/numbers/v8_libbase.dtoa.o64[16/1871] CXX obj/deps/v8/src/base/v8_libbase.strings.o65[17/1871] CXX obj/deps/v8/src/base/v8_libbase.page-allocator.o66[18/1871] CXX obj/deps/v8/src/base/numbers/v8_libbase.bignum-dtoa.o67[19/1871] CXX obj/deps/v8/src/base/sanitizer/v8_libbase.lsan-page-allocator.o68[20/1871] CXX obj/deps/v8/src/base/v8_libbase.region-allocator.o69[21/1871] CXX obj/deps/v8/src/base/sanitizer/v8_libbase.lsan-virtual-address-space.o70[22/1871] CXX obj/deps/v8/src/base/numbers/v8_libbase.strtod.o71[23/1871] CXX obj/deps/v8/src/base/numbers/v8_libbase.bignum.o72[24/1871] CXX obj/deps/v8/src/base/numbers/v8_libbase.fixed-dtoa.o73[25/1871] CXX obj/deps/v8/src/base/numbers/v8_libbase.fast-dtoa.o74[26/1871] CXX obj/deps/v8/src/base/v8_libbase.ieee754.o75[27/1871] CXX obj/deps/v8/src/base/v8_libbase.vlq-base64.o76[28/1871] CXX obj/deps/v8/src/base/platform/v8_libbase.condition-variable.o77[29/1871] CXX obj/deps/v8/src/base/v8_libbase.logging.o78[30/1871] CXX obj/deps/v8/src/base/platform/v8_libbase.platform-posix-time.o79[31/1871] CXX obj/deps/v8/src/base/platform/v8_libbase.mutex.o80[32/1871] CXX obj/deps/v8/src/base/platform/v8_libbase.time.o81[33/1871] CXX obj/deps/v8/src/base/v8_libbase.emulated-virtual-address-subspace.o82[34/1871] CXX obj/deps/v8/src/base/v8_libbase.bounded-page-allocator.o83[35/1871] CXX obj/deps/v8/src/base/platform/v8_libbase.platform-linux.o84[36/1871] CXX obj/deps/v8/src/base/debug/v8_libbase.stack_trace_posix.o85[37/1871] CXX obj/deps/v8/src/base/v8_libbase.virtual-address-space-page-allocator.o86[38/1871] CXX obj/deps/v8/src/base/utils/v8_libbase.random-number-generator.o87[39/1871] CXX obj/deps/v8/src/torque/torque_base.source-positions.o88[40/1871] ACTION Checking inspector protocol compatibility89[41/1871] CXX obj/deps/v8/src/base/v8_libbase.virtual-address-space.o90[42/1871] ACTION Generating temporal zoneinfo static data91[43/1871] CC obj/deps/v8/third_party/zlib/v8_zlib.compress.o92cc1: warning: command-line option '-fvisibility-inlines-hidden' is valid for C++/ObjC++ but not for C93[44/1871] CC obj/deps/v8/third_party/zlib/v8_zlib.adler32.o94cc1: warning: command-line option '-fvisibility-inlines-hidden' is valid for C++/ObjC++ but not for C95[45/1871] CC obj/deps/v8/third_party/zlib/v8_zlib.cpu_features.o96cc1: warning: command-line option '-fvisibility-inlines-hidden' is valid for C++/ObjC++ but not for C97[46/1871] CXX obj/deps/v8/src/base/platform/v8_libbase.platform-posix.o98[47/1871] AR obj/tools/v8_gypfiles/libv8_libbase.a99[48/1871] STAMP obj/tools/v8_gypfiles/v8_flags.actions_depends.stamp100[49/1871] CC obj/deps/v8/third_party/zlib/v8_zlib.gzclose.o101cc1: warning: command-line option '-fvisibility-inlines-hidden' is valid for C++/ObjC++ but not for C102[50/1871] ACTION Generating inspector protocol sources from protocol json103[51/1871] STAMP obj/tools/v8_gypfiles/v8_inspector_headers.actions_rules_copies.stamp104[52/1871] CC obj/deps/v8/third_party/zlib/v8_zlib.crc32.o105cc1: warning: command-line option '-fvisibility-inlines-hidden' is valid for C++/ObjC++ but not for C106[53/1871] CXX obj/deps/v8/src/torque/torque_base.cpp-builder.o107[54/1871] CC obj/deps/v8/third_party/zlib/v8_zlib.gzlib.o108cc1: warning: command-line option '-fvisibility-inlines-hidden' is valid for C++/ObjC++ but not for C109[55/1871] CXX obj/deps/v8/src/interpreter/bytecode_builtins_list_generator.bytecode-operands.o110[56/1871] CC obj/deps/v8/third_party/zlib/v8_zlib.gzread.o111cc1: warning: command-line option '-fvisibility-inlines-hidden' is valid for C++/ObjC++ but not for C112[57/1871] CC obj/deps/v8/third_party/zlib/v8_zlib.gzwrite.o113cc1: warning: command-line option '-fvisibility-inlines-hidden' is valid for C++/ObjC++ but not for C114[58/1871] CC obj/deps/v8/third_party/zlib/v8_zlib.inffast.o115cc1: warning: command-line option '-fvisibility-inlines-hidden' is valid for C++/ObjC++ but not for C116[59/1871] CC obj/deps/v8/third_party/zlib/v8_zlib.inftrees.o117cc1: warning: command-line option '-fvisibility-inlines-hidden' is valid for C++/ObjC++ but not for C118[60/1871] CC obj/deps/v8/third_party/zlib/v8_zlib.infback.o119cc1: warning: command-line option '-fvisibility-inlines-hidden' is valid for C++/ObjC++ but not for C120[61/1871] CC obj/deps/v8/third_party/zlib/v8_zlib.uncompr.o121cc1: warning: command-line option '-fvisibility-inlines-hidden' is valid for C++/ObjC++ but not for C122[62/1871] CC obj/deps/v8/third_party/zlib/v8_zlib.zutil.o123cc1: warning: command-line option '-fvisibility-inlines-hidden' is valid for C++/ObjC++ but not for C124[63/1871] CXX obj/deps/v8/src/builtins/bytecode_builtins_list_generator.generate-bytecodes-builtins-list.o125[64/1871] CC obj/deps/v8/third_party/zlib/v8_zlib.deflate.o126cc1: warning: command-line option '-fvisibility-inlines-hidden' is valid for C++/ObjC++ but not for C127[65/1871] CXX obj/deps/v8/third_party/zlib/google/v8_zlib.compression_utils_portable.o128[66/1871] CXX obj/deps/v8/src/regexp/gen-regexp-special-case.gen-regexp-special-case.o129[67/1871] CXX obj/deps/v8/src/interpreter/bytecode_builtins_list_generator.bytecodes.o130[68/1871] CXX obj/deps/v8/src/torque/torque_base.global-context.o131[69/1871] CC obj/deps/v8/third_party/zlib/v8_zlib.trees.o132cc1: warning: command-line option '-fvisibility-inlines-hidden' is valid for C++/ObjC++ but not for C133[70/1871] CXX obj/deps/v8/src/torque/torque_base.torque-code-generator.o134[71/1871] CXX obj/deps/v8/src/torque/torque_base.declarable.o135[72/1871] CC obj/deps/v8/third_party/zlib/v8_zlib.inflate.o136cc1: warning: command-line option '-fvisibility-inlines-hidden' is valid for C++/ObjC++ but not for C137[73/1871] LINK bytecode_builtins_list_generator138[74/1871] ACTION generate_bytecode_builtins_list: generate_bytecode_builtins_list_action_73a03d1964edbe79fc19deb968fa21d5c456544c3d095b62158c8959ed2aeed1139[75/1871] CXX obj/deps/v8/src/torque/torque_base.earley-parser.o140[76/1871] LINK gen-regexp-special-case141[77/1871] ACTION run_gen-regexp-special-case: run_gen-regexp-special-case_action_72d03329d19e24c609ee6e65eeeb110034e9261c37b8a8d83522628d574e9fa7142[78/1871] CXX obj/deps/v8/src/torque/torque_base.server-data.o143[79/1871] CXX obj/deps/v8/src/torque/torque_base.type-inference.o144[80/1871] CXX obj/deps/v8/src/torque/torque_base.type-oracle.o145[81/1871] CXX obj/deps/v8/src/torque/torque_base.kythe-data.o146[82/1871] CXX obj/deps/v8/src/libplatform/v8_libplatform.default-thread-isolated-allocator.o147[83/1871] AR obj/tools/v8_gypfiles/libv8_zlib.a148[84/1871] CXX obj/deps/v8/src/torque/torque_base.utils.o149[85/1871] CXX obj/src/node_js2c.embedded_data.o150[86/1871] CXX obj/deps/v8/src/libplatform/tracing/v8_libplatform.trace-object.o151[87/1871] CXX obj/deps/v8/src/libplatform/tracing/v8_libplatform.trace-config.o152[88/1871] CXX obj/src/node_js2c.builtin_info.o153[89/1871] CXX obj/deps/v8/src/torque/torque_base.cfg.o154[90/1871] CXX obj/deps/v8/src/libplatform/tracing/v8_libplatform.trace-writer.o155[91/1871] CXX obj/deps/v8/src/libplatform/v8_libplatform.default-worker-threads-task-runner.o156[92/1871] CXX obj/deps/v8/src/libplatform/v8_libplatform.default-job.o157[93/1871] CXX obj/deps/v8/src/libplatform/tracing/v8_libplatform.trace-buffer.o158[94/1871] CXX obj/deps/v8/src/libplatform/v8_libplatform.delayed-task-queue.o159[95/1871] CXX obj/deps/inspector_protocol/crdtp/crdtp.error_support.o160[96/1871] CXX obj/deps/v8/src/libplatform/v8_libplatform.task-queue.o161[97/1871] CXX obj/deps/ncrypto/ncrypto_engine.engine.o162[98/1871] AR obj/deps/ncrypto/libncrypto_engine.a163[99/1871] CC obj/test/nop/nop.nop.o164[100/1871] CC obj/test/overlapped-checker/overlapped-checker.main_unix.o165[101/1871] CXX obj/deps/v8/src/torque/torque_base.cc-generator.o166[102/1871] CXX obj/deps/inspector_protocol/crdtp/crdtp.json_platform.o167[103/1871] CXX obj/deps/v8/src/libplatform/v8_libplatform.worker-thread.o168[104/1871] CXX obj/deps/v8/src/torque/torque_base.instance-type-generator.o169[105/1871] LINK nop170[106/1871] CXX obj/deps/v8/src/torque/torque_base.class-debug-reader-generator.o171[107/1871] CXX obj/deps/v8/src/libplatform/tracing/v8_libplatform.tracing-controller.o172[108/1871] CXX obj/deps/inspector_protocol/crdtp/crdtp.span.o173[109/1871] CXX obj/deps/v8/src/libplatform/v8_libplatform.default-foreground-task-runner.o174[110/1871] CXX obj/deps/inspector_protocol/crdtp/crdtp.serializable.o175[111/1871] LINK overlapped-checker176[112/1871] CXX obj/deps/v8/src/torque/torque.torque.o177[113/1871] CXX obj/deps/inspector_protocol/crdtp/crdtp.status.o178[114/1871] CXX obj/deps/v8/src/libplatform/v8_libplatform.default-platform.o179[115/1871] AR obj/tools/v8_gypfiles/libv8_libplatform.a180[116/1871] CXX obj/deps/v8/src/torque/torque_base.declarations.o181[117/1871] CXX obj/deps/inspector_protocol/crdtp/crdtp.protocol_core.o182[118/1871] CXX obj/deps/v8/src/torque/torque_base.csa-generator.o183[119/1871] CXX obj/deps/inspector_protocol/crdtp/crdtp.cbor.o184[120/1871] CXX obj/deps/v8/src/torque/torque_base.instructions.o185[121/1871] CXX obj/deps/v8/src/torque/torque_base.declaration-visitor.o186[122/1871] CXX obj/deps/inspector_protocol/crdtp/crdtp.dispatch.o187[123/1871] CXX obj/deps/v8/src/torque/torque_base.torque-compiler.o188[124/1871] CXX obj/deps/v8/src/torque/torque_base.type-visitor.o189[125/1871] CXX obj/tools/node_js2c.js2c.o190[126/1871] LINK node_js2c191[127/1871] STAMP obj/node_base.actions_depends.stamp192[128/1871] ACTION node_base: convert_node_protocol_to_json_f26a10641803f604d1307d23f68bde8b450ad8f073bd43313642df31e7a3478c193[129/1871] ACTION node_base: node_js2c_f26a10641803f604d1307d23f68bde8b450ad8f073bd43313642df31e7a3478c194[130/1871] ACTION node_base: concatenate_protocols_f26a10641803f604d1307d23f68bde8b450ad8f073bd43313642df31e7a3478c195[131/1871] ACTION node_base: v8_inspector_compress_protocol_json_f26a10641803f604d1307d23f68bde8b450ad8f073bd43313642df31e7a3478c196[132/1871] CXX obj/deps/inspector_protocol/crdtp/crdtp.json.o197[133/1871] AR obj/deps/inspector_protocol/libcrdtp.a198[134/1871] ACTION Generating node protocol sources from protocol json199[135/1871] STAMP obj/node_base.actions_rules_copies.stamp200[136/1871] CXX obj/src/node_base.builtin_info.o201[137/1871] CXX obj/deps/v8/src/torque/torque_base.types.o202[138/1871] CXX obj/src/api/node_base.utils.o203[139/1871] CXX obj/src/node_base.embedded_data.o204[140/1871] CXX obj/deps/ncrypto/ncrypto.ncrypto.o205[141/1871] CXX obj/src/node_base.cleanup_queue.o206In file included from ../../src/memory_tracker.h:6,207 from ../../src/cleanup_queue.h:11,208 from ../../src/cleanup_queue.cc:1:209../../deps/v8/include/v8-profiler.h: In constructor 'v8::HeapProfiler::HeapSnapshotOptions::HeapSnapshotOptions()':210../../deps/v8/include/v8-profiler.h:1128:27: warning: 'v8::HeapProfiler::HeapSnapshotOptions::global_object_name_resolver' is deprecated: Use context_name_resolver callback instead. [-Wdeprecated-declarations]211 1128 | HeapSnapshotOptions() {}212 | ^213../../deps/v8/include/v8-profiler.h:1142:25: note: declared here214 1142 | ObjectNameResolver* global_object_name_resolver = nullptr;215 | ^~~~~~~~~~~~~~~~~~~~~~~~~~~216../../deps/v8/include/v8-profiler.h:1128:27: warning: 'v8::HeapProfiler::HeapSnapshotOptions::global_object_name_resolver' is deprecated: Use context_name_resolver callback instead. [-Wdeprecated-declarations]217 1128 | HeapSnapshotOptions() {}218 | ^219../../deps/v8/include/v8-profiler.h:1142:25: note: declared here220 1142 | ObjectNameResolver* global_object_name_resolver = nullptr;221 | ^~~~~~~~~~~~~~~~~~~~~~~~~~~222[142/1871] CXX obj/gen/src/node/inspector/protocol/node_base.IO.o223In file included from ../../src/util.h:29,224 from ../../src/inspector/node_string.h:10,225 from gen/src/node/inspector/protocol/Forward.h:19,226 from gen/src/node/inspector/protocol/Protocol.h:18,227 from gen/src/node/inspector/protocol/IO.h:10,228 from gen/src/node/inspector/protocol/IO.cpp:7:229../../deps/v8/include/v8-profiler.h: In constructor 'v8::HeapProfiler::HeapSnapshotOptions::HeapSnapshotOptions()':230../../deps/v8/include/v8-profiler.h:1128:27: warning: 'v8::HeapProfiler::HeapSnapshotOptions::global_object_name_resolver' is deprecated: Use context_name_resolver callback instead. [-Wdeprecated-declarations]231 1128 | HeapSnapshotOptions() {}232 | ^233../../deps/v8/include/v8-profiler.h:1142:25: note: declared here234 1142 | ObjectNameResolver* global_object_name_resolver = nullptr;235 | ^~~~~~~~~~~~~~~~~~~~~~~~~~~236../../deps/v8/include/v8-profiler.h:1128:27: warning: 'v8::HeapProfiler::HeapSnapshotOptions::global_object_name_resolver' is deprecated: Use context_name_resolver callback instead. [-Wdeprecated-declarations]237 1128 | HeapSnapshotOptions() {}238 | ^239../../deps/v8/include/v8-profiler.h:1142:25: note: declared here240 1142 | ObjectNameResolver* global_object_name_resolver = nullptr;241 | ^~~~~~~~~~~~~~~~~~~~~~~~~~~242[143/1871] CXX obj/gen/src/node/inspector/protocol/node_base.NodeRuntime.o243In file included from ../../src/util.h:29,244 from ../../src/inspector/node_string.h:10,245 from gen/src/node/inspector/protocol/Forward.h:19,246 from gen/src/node/inspector/protocol/Protocol.h:18,247 from gen/src/node/inspector/protocol/NodeRuntime.h:10,248 from gen/src/node/inspector/protocol/NodeRuntime.cpp:7:249../../deps/v8/include/v8-profiler.h: In constructor 'v8::HeapProfiler::HeapSnapshotOptions::HeapSnapshotOptions()':250../../deps/v8/include/v8-profiler.h:1128:27: warning: 'v8::HeapProfiler::HeapSnapshotOptions::global_object_name_resolver' is deprecated: Use context_name_resolver callback instead. [-Wdeprecated-declarations]251 1128 | HeapSnapshotOptions() {}252 | ^253../../deps/v8/include/v8-profiler.h:1142:25: note: declared here254 1142 | ObjectNameResolver* global_object_name_resolver = nullptr;255 | ^~~~~~~~~~~~~~~~~~~~~~~~~~~256../../deps/v8/include/v8-profiler.h:1128:27: warning: 'v8::HeapProfiler::HeapSnapshotOptions::global_object_name_resolver' is deprecated: Use context_name_resolver callback instead. [-Wdeprecated-declarations]257 1128 | HeapSnapshotOptions() {}258 | ^259../../deps/v8/include/v8-profiler.h:1142:25: note: declared here260 1142 | ObjectNameResolver* global_object_name_resolver = nullptr;261 | ^~~~~~~~~~~~~~~~~~~~~~~~~~~262[144/1871] CXX obj/gen/src/node/inspector/protocol/node_base.Target.o263In file included from ../../src/util.h:29,264 from ../../src/inspector/node_string.h:10,265 from gen/src/node/inspector/protocol/Forward.h:19,266 from gen/src/node/inspector/protocol/Protocol.h:18,267 from gen/src/node/inspector/protocol/Target.h:10,268 from gen/src/node/inspector/protocol/Target.cpp:7:269../../deps/v8/include/v8-profiler.h: In constructor 'v8::HeapProfiler::HeapSnapshotOptions::HeapSnapshotOptions()':270../../deps/v8/include/v8-profiler.h:1128:27: warning: 'v8::HeapProfiler::HeapSnapshotOptions::global_object_name_resolver' is deprecated: Use context_name_resolver callback instead. [-Wdeprecated-declarations]271 1128 | HeapSnapshotOptions() {}272 | ^273../../deps/v8/include/v8-profiler.h:1142:25: note: declared here274 1142 | ObjectNameResolver* global_object_name_resolver = nullptr;275 | ^~~~~~~~~~~~~~~~~~~~~~~~~~~276../../deps/v8/include/v8-profiler.h:1128:27: warning: 'v8::HeapProfiler::HeapSnapshotOptions::global_object_name_resolver' is deprecated: Use context_name_resolver callback instead. [-Wdeprecated-declarations]277 1128 | HeapSnapshotOptions() {}278 | ^279../../deps/v8/include/v8-profiler.h:1142:25: note: declared here280 1142 | ObjectNameResolver* global_object_name_resolver = nullptr;281 | ^~~~~~~~~~~~~~~~~~~~~~~~~~~282[145/1871] CXX obj/gen/src/node/inspector/protocol/node_base.Storage.o283In file included from ../../src/util.h:29,284 from ../../src/inspector/node_string.h:10,285 from gen/src/node/inspector/protocol/Forward.h:19,286 from gen/src/node/inspector/protocol/Protocol.h:18,287 from gen/src/node/inspector/protocol/Storage.h:10,288 from gen/src/node/inspector/protocol/Storage.cpp:7:289../../deps/v8/include/v8-profiler.h: In constructor 'v8::HeapProfiler::HeapSnapshotOptions::HeapSnapshotOptions()':290../../deps/v8/include/v8-profiler.h:1128:27: warning: 'v8::HeapProfiler::HeapSnapshotOptions::global_object_name_resolver' is deprecated: Use context_name_resolver callback instead. [-Wdeprecated-declarations]291 1128 | HeapSnapshotOptions() {}292 | ^293../../deps/v8/include/v8-profiler.h:1142:25: note: declared here294 1142 | ObjectNameResolver* global_object_name_resolver = nullptr;295 | ^~~~~~~~~~~~~~~~~~~~~~~~~~~296../../deps/v8/include/v8-profiler.h:1128:27: warning: 'v8::HeapProfiler::HeapSnapshotOptions::global_object_name_resolver' is deprecated: Use context_name_resolver callback instead. [-Wdeprecated-declarations]297 1128 | HeapSnapshotOptions() {}298 | ^299../../deps/v8/include/v8-profiler.h:1142:25: note: declared here300 1142 | ObjectNameResolver* global_object_name_resolver = nullptr;301 | ^~~~~~~~~~~~~~~~~~~~~~~~~~~302[146/1871] CXX obj/gen/src/node/inspector/protocol/node_base.NodeWorker.o303In file included from ../../src/util.h:29,304 from ../../src/inspector/node_string.h:10,305 from gen/src/node/inspector/protocol/Forward.h:19,306 from gen/src/node/inspector/protocol/Protocol.h:18,307 from gen/src/node/inspector/protocol/NodeWorker.h:10,308 from gen/src/node/inspector/protocol/NodeWorker.cpp:7:309../../deps/v8/include/v8-profiler.h: In constructor 'v8::HeapProfiler::HeapSnapshotOptions::HeapSnapshotOptions()':310../../deps/v8/include/v8-profiler.h:1128:27: warning: 'v8::HeapProfiler::HeapSnapshotOptions::global_object_name_resolver' is deprecated: Use context_name_resolver callback instead. [-Wdeprecated-declarations]311 1128 | HeapSnapshotOptions() {}312 | ^313../../deps/v8/include/v8-profiler.h:1142:25: note: declared here314 1142 | ObjectNameResolver* global_object_name_resolver = nullptr;315 | ^~~~~~~~~~~~~~~~~~~~~~~~~~~316../../deps/v8/include/v8-profiler.h:1128:27: warning: 'v8::HeapProfiler::HeapSnapshotOptions::global_object_name_resolver' is deprecated: Use context_name_resolver callback instead. [-Wdeprecated-declarations]317 1128 | HeapSnapshotOptions() {}318 | ^319../../deps/v8/include/v8-profiler.h:1142:25: note: declared here320 1142 | ObjectNameResolver* global_object_name_resolver = nullptr;321 | ^~~~~~~~~~~~~~~~~~~~~~~~~~~322[147/1871] CXX obj/gen/src/node/inspector/protocol/node_base.NodeTracing.o323In file included from ../../src/util.h:29,324 from ../../src/inspector/node_string.h:10,325 from gen/src/node/inspector/protocol/Forward.h:19,326 from gen/src/node/inspector/protocol/Protocol.h:18,327 from gen/src/node/inspector/protocol/NodeTracing.h:10,328 from gen/src/node/inspector/protocol/NodeTracing.cpp:7:329../../deps/v8/include/v8-profiler.h: In constructor 'v8::HeapProfiler::HeapSnapshotOptions::HeapSnapshotOptions()':330../../deps/v8/include/v8-profiler.h:1128:27: warning: 'v8::HeapProfiler::HeapSnapshotOptions::global_object_name_resolver' is deprecated: Use context_name_resolver callback instead. [-Wdeprecated-declarations]331 1128 | HeapSnapshotOptions() {}332 | ^333../../deps/v8/include/v8-profiler.h:1142:25: note: declared here334 1142 | ObjectNameResolver* global_object_name_resolver = nullptr;335 | ^~~~~~~~~~~~~~~~~~~~~~~~~~~336../../deps/v8/include/v8-profiler.h:1128:27: warning: 'v8::HeapProfiler::HeapSnapshotOptions::global_object_name_resolver' is deprecated: Use context_name_resolver callback instead. [-Wdeprecated-declarations]337 1128 | HeapSnapshotOptions() {}338 | ^339../../deps/v8/include/v8-profiler.h:1142:25: note: declared here340 1142 | ObjectNameResolver* global_object_name_resolver = nullptr;341 | ^~~~~~~~~~~~~~~~~~~~~~~~~~~342[148/1871] CXX obj/gen/src/node/inspector/protocol/node_base.DOMStorage.o343In file included from ../../src/util.h:29,344 from ../../src/inspector/node_string.h:10,345 from gen/src/node/inspector/protocol/Forward.h:19,346 from gen/src/node/inspector/protocol/Protocol.h:18,347 from gen/src/node/inspector/protocol/DOMStorage.h:10,348 from gen/src/node/inspector/protocol/DOMStorage.cpp:7:349../../deps/v8/include/v8-profiler.h: In constructor 'v8::HeapProfiler::HeapSnapshotOptions::HeapSnapshotOptions()':350../../deps/v8/include/v8-profiler.h:1128:27: warning: 'v8::HeapProfiler::HeapSnapshotOptions::global_object_name_resolver' is deprecated: Use context_name_resolver callback instead. [-Wdeprecated-declarations]351 1128 | HeapSnapshotOptions() {}352 | ^353../../deps/v8/include/v8-profiler.h:1142:25: note: declared here354 1142 | ObjectNameResolver* global_object_name_resolver = nullptr;355 | ^~~~~~~~~~~~~~~~~~~~~~~~~~~356../../deps/v8/include/v8-profiler.h:1128:27: warning: 'v8::HeapProfiler::HeapSnapshotOptions::global_object_name_resolver' is deprecated: Use context_name_resolver callback instead. [-Wdeprecated-declarations]357 1128 | HeapSnapshotOptions() {}358 | ^359../../deps/v8/include/v8-profiler.h:1142:25: note: declared here360 1142 | ObjectNameResolver* global_object_name_resolver = nullptr;361 | ^~~~~~~~~~~~~~~~~~~~~~~~~~~362[149/1871] CXX obj/gen/src/node/inspector/protocol/node_base.Network.o363In file included from ../../src/util.h:29,364 from ../../src/inspector/node_string.h:10,365 from gen/src/node/inspector/protocol/Forward.h:19,366 from gen/src/node/inspector/protocol/Protocol.h:18,367 from gen/src/node/inspector/protocol/Network.h:10,368 from gen/src/node/inspector/protocol/Network.cpp:7:369../../deps/v8/include/v8-profiler.h: In constructor 'v8::HeapProfiler::HeapSnapshotOptions::HeapSnapshotOptions()':370../../deps/v8/include/v8-profiler.h:1128:27: warning: 'v8::HeapProfiler::HeapSnapshotOptions::global_object_name_resolver' is deprecated: Use context_name_resolver callback instead. [-Wdeprecated-declarations]371 1128 | HeapSnapshotOptions() {}372 | ^373../../deps/v8/include/v8-profiler.h:1142:25: note: declared here374 1142 | ObjectNameResolver* global_object_name_resolver = nullptr;375 | ^~~~~~~~~~~~~~~~~~~~~~~~~~~376../../deps/v8/include/v8-profiler.h:1128:27: warning: 'v8::HeapProfiler::HeapSnapshotOptions::global_object_name_resolver' is deprecated: Use context_name_resolver callback instead. [-Wdeprecated-declarations]377 1128 | HeapSnapshotOptions() {}378 | ^379../../deps/v8/include/v8-profiler.h:1142:25: note: declared here380 1142 | ObjectNameResolver* global_object_name_resolver = nullptr;381 | ^~~~~~~~~~~~~~~~~~~~~~~~~~~382[150/1871] CXX obj/gen/src/node/inspector/protocol/node_base.Protocol.o383In file included from ../../src/util.h:29,384 from ../../src/inspector/node_string.h:10,385 from gen/src/node/inspector/protocol/Forward.h:19,386 from gen/src/node/inspector/protocol/Protocol.h:18,387 from gen/src/node/inspector/protocol/Protocol.cpp:7:388../../deps/v8/include/v8-profiler.h: In constructor 'v8::HeapProfiler::HeapSnapshotOptions::HeapSnapshotOptions()':389../../deps/v8/include/v8-profiler.h:1128:27: warning: 'v8::HeapProfiler::HeapSnapshotOptions::global_object_name_resolver' is deprecated: Use context_name_resolver callback instead. [-Wdeprecated-declarations]390 1128 | HeapSnapshotOptions() {}391 | ^392../../deps/v8/include/v8-profiler.h:1142:25: note: declared here393 1142 | ObjectNameResolver* global_object_name_resolver = nullptr;394 | ^~~~~~~~~~~~~~~~~~~~~~~~~~~395../../deps/v8/include/v8-profiler.h:1128:27: warning: 'v8::HeapProfiler::HeapSnapshotOptions::global_object_name_resolver' is deprecated: Use context_name_resolver callback instead. [-Wdeprecated-declarations]396 1128 | HeapSnapshotOptions() {}397 | ^398../../deps/v8/include/v8-profiler.h:1142:25: note: declared here399 1142 | ObjectNameResolver* global_object_name_resolver = nullptr;400 | ^~~~~~~~~~~~~~~~~~~~~~~~~~~401[151/1871] CXX obj/src/node_base.internal_only_v8.o402In file included from ../../src/util.h:29,403 from ../../src/util-inl.h:33,404 from ../../src/internal_only_v8.cc:3:405../../deps/v8/include/v8-profiler.h: In constructor 'v8::HeapProfiler::HeapSnapshotOptions::HeapSnapshotOptions()':406../../deps/v8/include/v8-profiler.h:1128:27: warning: 'v8::HeapProfiler::HeapSnapshotOptions::global_object_name_resolver' is deprecated: Use context_name_resolver callback instead. [-Wdeprecated-declarations]407 1128 | HeapSnapshotOptions() {}408 | ^409../../deps/v8/include/v8-profiler.h:1142:25: note: declared here410 1142 | ObjectNameResolver* global_object_name_resolver = nullptr;411 | ^~~~~~~~~~~~~~~~~~~~~~~~~~~412../../deps/v8/include/v8-profiler.h:1128:27: warning: 'v8::HeapProfiler::HeapSnapshotOptions::global_object_name_resolver' is deprecated: Use context_name_resolver callback instead. [-Wdeprecated-declarations]413 1128 | HeapSnapshotOptions() {}414 | ^415../../deps/v8/include/v8-profiler.h:1142:25: note: declared here416 1142 | ObjectNameResolver* global_object_name_resolver = nullptr;417 | ^~~~~~~~~~~~~~~~~~~~~~~~~~~418[152/1871] CXX obj/src/node_base.json_utils.o419[153/1871] CXX obj/src/api/node_base.exceptions.o420In file included from ../../src/memory_tracker.h:6,421 from ../../src/aliased_buffer.h:7,422 from ../../src/aliased_buffer-inl.h:6,423 from ../../src/env-inl.h:27,424 from ../../src/api/exceptions.cc:3:425../../deps/v8/include/v8-profiler.h: In constructor 'v8::HeapProfiler::HeapSnapshotOptions::HeapSnapshotOptions()':426../../deps/v8/include/v8-profiler.h:1128:27: warning: 'v8::HeapProfiler::HeapSnapshotOptions::global_object_name_resolver' is deprecated: Use context_name_resolver callback instead. [-Wdeprecated-declarations]427 1128 | HeapSnapshotOptions() {}428 | ^429../../deps/v8/include/v8-profiler.h:1142:25: note: declared here430 1142 | ObjectNameResolver* global_object_name_resolver = nullptr;431 | ^~~~~~~~~~~~~~~~~~~~~~~~~~~432../../deps/v8/include/v8-profiler.h:1128:27: warning: 'v8::HeapProfiler::HeapSnapshotOptions::global_object_name_resolver' is deprecated: Use context_name_resolver callback instead. [-Wdeprecated-declarations]433 1128 | HeapSnapshotOptions() {}434 | ^435../../deps/v8/include/v8-profiler.h:1142:25: note: declared here436 1142 | ObjectNameResolver* global_object_name_resolver = nullptr;437 | ^~~~~~~~~~~~~~~~~~~~~~~~~~~438[154/1871] CXX obj/src/api/node_base.callback.o439In file included from ../../src/memory_tracker.h:6,440 from ../../src/base_object.h:29,441 from ../../src/async_context_frame.h:6,442 from ../../src/api/callback.cc:1:443../../deps/v8/include/v8-profiler.h: In constructor 'v8::HeapProfiler::HeapSnapshotOptions::HeapSnapshotOptions()':444../../deps/v8/include/v8-profiler.h:1128:27: warning: 'v8::HeapProfiler::HeapSnapshotOptions::global_object_name_resolver' is deprecated: Use context_name_resolver callback instead. [-Wdeprecated-declarations]445 1128 | HeapSnapshotOptions() {}446 | ^447../../deps/v8/include/v8-profiler.h:1142:25: note: declared here448 1142 | ObjectNameResolver* global_object_name_resolver = nullptr;449 | ^~~~~~~~~~~~~~~~~~~~~~~~~~~450../../deps/v8/include/v8-profiler.h:1128:27: warning: 'v8::HeapProfiler::HeapSnapshotOptions::global_object_name_resolver' is deprecated: Use context_name_resolver callback instead. [-Wdeprecated-declarations]451 1128 | HeapSnapshotOptions() {}452 | ^453../../deps/v8/include/v8-profiler.h:1142:25: note: declared here454 1142 | ObjectNameResolver* global_object_name_resolver = nullptr;455 | ^~~~~~~~~~~~~~~~~~~~~~~~~~~456[155/1871] CXX obj/src/api/node_base.embed_helpers.o457In file included from ../../src/memory_tracker.h:6,458 from ../../src/base_object.h:29,459 from ../../src/async_wrap.h:27,460 from ../../src/debug_utils.h:6,461 from ../../src/debug_utils-inl.h:6,462 from ../../src/api/embed_helpers.cc:1:463../../deps/v8/include/v8-profiler.h: In constructor 'v8::HeapProfiler::HeapSnapshotOptions::HeapSnapshotOptions()':464../../deps/v8/include/v8-profiler.h:1128:27: warning: 'v8::HeapProfiler::HeapSnapshotOptions::global_object_name_resolver' is deprecated: Use context_name_resolver callback instead. [-Wdeprecated-declarations]465 1128 | HeapSnapshotOptions() {}466 | ^467../../deps/v8/include/v8-profiler.h:1142:25: note: declared here468 1142 | ObjectNameResolver* global_object_name_resolver = nullptr;469 | ^~~~~~~~~~~~~~~~~~~~~~~~~~~470../../deps/v8/include/v8-profiler.h:1128:27: warning: 'v8::HeapProfiler::HeapSnapshotOptions::global_object_name_resolver' is deprecated: Use context_name_resolver callback instead. [-Wdeprecated-declarations]471 1128 | HeapSnapshotOptions() {}472 | ^473../../deps/v8/include/v8-profiler.h:1142:25: note: declared here474 1142 | ObjectNameResolver* global_object_name_resolver = nullptr;475 | ^~~~~~~~~~~~~~~~~~~~~~~~~~~476[156/1871] CXX obj/src/node_base.base_object.o477In file included from ../../src/memory_tracker.h:6,478 from ../../src/base_object.h:29,479 from ../../src/base_object.cc:1:480../../deps/v8/include/v8-profiler.h: In constructor 'v8::HeapProfiler::HeapSnapshotOptions::HeapSnapshotOptions()':481../../deps/v8/include/v8-profiler.h:1128:27: warning: 'v8::HeapProfiler::HeapSnapshotOptions::global_object_name_resolver' is deprecated: Use context_name_resolver callback instead. [-Wdeprecated-declarations]482 1128 | HeapSnapshotOptions() {}483 | ^484../../deps/v8/include/v8-profiler.h:1142:25: note: declared here485 1142 | ObjectNameResolver* global_object_name_resolver = nullptr;486 | ^~~~~~~~~~~~~~~~~~~~~~~~~~~487../../deps/v8/include/v8-profiler.h:1128:27: warning: 'v8::HeapProfiler::HeapSnapshotOptions::global_object_name_resolver' is deprecated: Use context_name_resolver callback instead. [-Wdeprecated-declarations]488 1128 | HeapSnapshotOptions() {}489 | ^490../../deps/v8/include/v8-profiler.h:1142:25: note: declared here491 1142 | ObjectNameResolver* global_object_name_resolver = nullptr;492 | ^~~~~~~~~~~~~~~~~~~~~~~~~~~493[157/1871] CXX obj/src/api/node_base.async_resource.o494In file included from ../../src/memory_tracker.h:6,495 from ../../src/base_object.h:29,496 from ../../src/async_context_frame.h:6,497 from ../../src/api/async_resource.cc:1:498../../deps/v8/include/v8-profiler.h: In constructor 'v8::HeapProfiler::HeapSnapshotOptions::HeapSnapshotOptions()':499../../deps/v8/include/v8-profiler.h:1128:27: warning: 'v8::HeapProfiler::HeapSnapshotOptions::global_object_name_resolver' is deprecated: Use context_name_resolver callback instead. [-Wdeprecated-declarations]500 1128 | HeapSnapshotOptions() {}501 | ^502../../deps/v8/include/v8-profiler.h:1142:25: note: declared here503 1142 | ObjectNameResolver* global_object_name_resolver = nullptr;504 | ^~~~~~~~~~~~~~~~~~~~~~~~~~~505../../deps/v8/include/v8-profiler.h:1128:27: warning: 'v8::HeapProfiler::HeapSnapshotOptions::global_object_name_resolver' is deprecated: Use context_name_resolver callback instead. [-Wdeprecated-declarations]506 1128 | HeapSnapshotOptions() {}507 | ^508../../deps/v8/include/v8-profiler.h:1142:25: note: declared here509 1142 | ObjectNameResolver* global_object_name_resolver = nullptr;510 | ^~~~~~~~~~~~~~~~~~~~~~~~~~~511[158/1871] CXX obj/src/api/node_base.hooks.o512In file included from ../../src/memory_tracker.h:6,513 from ../../src/aliased_buffer.h:7,514 from ../../src/aliased_buffer-inl.h:6,515 from ../../src/env-inl.h:27,516 from ../../src/api/hooks.cc:1:517../../deps/v8/include/v8-profiler.h: In constructor 'v8::HeapProfiler::HeapSnapshotOptions::HeapSnapshotOptions()':518../../deps/v8/include/v8-profiler.h:1128:27: warning: 'v8::HeapProfiler::HeapSnapshotOptions::global_object_name_resolver' is deprecated: Use context_name_resolver callback instead. [-Wdeprecated-declarations]519 1128 | HeapSnapshotOptions() {}520 | ^521../../deps/v8/include/v8-profiler.h:1142:25: note: declared here522 1142 | ObjectNameResolver* global_object_name_resolver = nullptr;523 | ^~~~~~~~~~~~~~~~~~~~~~~~~~~524../../deps/v8/include/v8-profiler.h:1128:27: warning: 'v8::HeapProfiler::HeapSnapshotOptions::global_object_name_resolver' is deprecated: Use context_name_resolver callback instead. [-Wdeprecated-declarations]525 1128 | HeapSnapshotOptions() {}526 | ^527../../deps/v8/include/v8-profiler.h:1142:25: note: declared here528 1142 | ObjectNameResolver* global_object_name_resolver = nullptr;529 | ^~~~~~~~~~~~~~~~~~~~~~~~~~~530[159/1871] CXX obj/src/api/node_base.encoding.o531In file included from ../../src/memory_tracker.h:6,532 from ../../src/aliased_buffer.h:7,533 from ../../src/aliased_buffer-inl.h:6,534 from ../../src/env-inl.h:27,535 from ../../src/string_bytes.h:30,536 from ../../src/api/encoding.cc:2:537../../deps/v8/include/v8-profiler.h: In constructor 'v8::HeapProfiler::HeapSnapshotOptions::HeapSnapshotOptions()':538../../deps/v8/include/v8-profiler.h:1128:27: warning: 'v8::HeapProfiler::HeapSnapshotOptions::global_object_name_resolver' is deprecated: Use context_name_resolver callback instead. [-Wdeprecated-declarations]539 1128 | HeapSnapshotOptions() {}540 | ^541../../deps/v8/include/v8-profiler.h:1142:25: note: declared here542 1142 | ObjectNameResolver* global_object_name_resolver = nullptr;543 | ^~~~~~~~~~~~~~~~~~~~~~~~~~~544../../deps/v8/include/v8-profiler.h:1128:27: warning: 'v8::HeapProfiler::HeapSnapshotOptions::global_object_name_resolver' is deprecated: Use context_name_resolver callback instead. [-Wdeprecated-declarations]545 1128 | HeapSnapshotOptions() {}546 | ^547../../deps/v8/include/v8-profiler.h:1142:25: note: declared here548 1142 | ObjectNameResolver* global_object_name_resolver = nullptr;549 | ^~~~~~~~~~~~~~~~~~~~~~~~~~~550[160/1871] CXX obj/src/node_base.async_context_frame.o551In file included from ../../src/memory_tracker.h:6,552 from ../../src/base_object.h:29,553 from ../../src/async_context_frame.h:6,554 from ../../src/async_context_frame.cc:1:555../../deps/v8/include/v8-profiler.h: In constructor 'v8::HeapProfiler::HeapSnapshotOptions::HeapSnapshotOptions()':556../../deps/v8/include/v8-profiler.h:1128:27: warning: 'v8::HeapProfiler::HeapSnapshotOptions::global_object_name_resolver' is deprecated: Use context_name_resolver callback instead. [-Wdeprecated-declarations]557 1128 | HeapSnapshotOptions() {}558 | ^559../../deps/v8/include/v8-profiler.h:1142:25: note: declared here560 1142 | ObjectNameResolver* global_object_name_resolver = nullptr;561 | ^~~~~~~~~~~~~~~~~~~~~~~~~~~562../../deps/v8/include/v8-profiler.h:1128:27: warning: 'v8::HeapProfiler::HeapSnapshotOptions::global_object_name_resolver' is deprecated: Use context_name_resolver callback instead. [-Wdeprecated-declarations]563 1128 | HeapSnapshotOptions() {}564 | ^565../../deps/v8/include/v8-profiler.h:1142:25: note: declared here566 1142 | ObjectNameResolver* global_object_name_resolver = nullptr;567 | ^~~~~~~~~~~~~~~~~~~~~~~~~~~568[161/1871] CXX obj/src/node_base.connect_wrap.o569In file included from ../../src/memory_tracker.h:6,570 from ../../src/base_object.h:29,571 from ../../src/async_wrap.h:27,572 from ../../src/req_wrap.h:6,573 from ../../src/req_wrap-inl.h:6,574 from ../../src/connect_wrap.h:6,575 from ../../src/connect_wrap.cc:1:576../../deps/v8/include/v8-profiler.h: In constructor 'v8::HeapProfiler::HeapSnapshotOptions::HeapSnapshotOptions()':577../../deps/v8/include/v8-profiler.h:1128:27: warning: 'v8::HeapProfiler::HeapSnapshotOptions::global_object_name_resolver' is deprecated: Use context_name_resolver callback instead. [-Wdeprecated-declarations]578 1128 | HeapSnapshotOptions() {}579 | ^580../../deps/v8/include/v8-profiler.h:1142:25: note: declared here581 1142 | ObjectNameResolver* global_object_name_resolver = nullptr;582 | ^~~~~~~~~~~~~~~~~~~~~~~~~~~583../../deps/v8/include/v8-profiler.h:1128:27: warning: 'v8::HeapProfiler::HeapSnapshotOptions::global_object_name_resolver' is deprecated: Use context_name_resolver callback instead. [-Wdeprecated-declarations]584 1128 | HeapSnapshotOptions() {}585 | ^586../../deps/v8/include/v8-profiler.h:1142:25: note: declared here587 1142 | ObjectNameResolver* global_object_name_resolver = nullptr;588 | ^~~~~~~~~~~~~~~~~~~~~~~~~~~589[162/1871] CXX obj/src/node_base.connection_wrap.o590In file included from ../../src/memory_tracker.h:6,591 from ../../src/aliased_buffer.h:7,592 from ../../src/env.h:27,593 from ../../src/stream_base.h:6,594 from ../../src/stream_wrap.h:27,595 from ../../src/connection_wrap.h:6,596 from ../../src/connection_wrap.cc:1:597../../deps/v8/include/v8-profiler.h: In constructor 'v8::HeapProfiler::HeapSnapshotOptions::HeapSnapshotOptions()':598../../deps/v8/include/v8-profiler.h:1128:27: warning: 'v8::HeapProfiler::HeapSnapshotOptions::global_object_name_resolver' is deprecated: Use context_name_resolver callback instead. [-Wdeprecated-declarations]599 1128 | HeapSnapshotOptions() {}600 | ^601../../deps/v8/include/v8-profiler.h:1142:25: note: declared here602 1142 | ObjectNameResolver* global_object_name_resolver = nullptr;603 | ^~~~~~~~~~~~~~~~~~~~~~~~~~~604../../deps/v8/include/v8-profiler.h:1128:27: warning: 'v8::HeapProfiler::HeapSnapshotOptions::global_object_name_resolver' is deprecated: Use context_name_resolver callback instead. [-Wdeprecated-declarations]605 1128 | HeapSnapshotOptions() {}606 | ^607../../deps/v8/include/v8-profiler.h:1142:25: note: declared here608 1142 | ObjectNameResolver* global_object_name_resolver = nullptr;609 | ^~~~~~~~~~~~~~~~~~~~~~~~~~~610[163/1871] CXX obj/src/node_base.debug_utils.o611In file included from ../../src/memory_tracker.h:6,612 from ../../src/base_object.h:29,613 from ../../src/async_wrap.h:27,614 from ../../src/debug_utils.h:6,615 from ../../src/debug_utils-inl.h:6,616 from ../../src/debug_utils.cc:1:617../../deps/v8/include/v8-profiler.h: In constructor 'v8::HeapProfiler::HeapSnapshotOptions::HeapSnapshotOptions()':618../../deps/v8/include/v8-profiler.h:1128:27: warning: 'v8::HeapProfiler::HeapSnapshotOptions::global_object_name_resolver' is deprecated: Use context_name_resolver callback instead. [-Wdeprecated-declarations]619 1128 | HeapSnapshotOptions() {}620 | ^621../../deps/v8/include/v8-profiler.h:1142:25: note: declared here622 1142 | ObjectNameResolver* global_object_name_resolver = nullptr;623 | ^~~~~~~~~~~~~~~~~~~~~~~~~~~624../../deps/v8/include/v8-profiler.h:1128:27: warning: 'v8::HeapProfiler::HeapSnapshotOptions::global_object_name_resolver' is deprecated: Use context_name_resolver callback instead. [-Wdeprecated-declarations]625 1128 | HeapSnapshotOptions() {}626 | ^627../../deps/v8/include/v8-profiler.h:1142:25: note: declared here628 1142 | ObjectNameResolver* global_object_name_resolver = nullptr;629 | ^~~~~~~~~~~~~~~~~~~~~~~~~~~630[164/1871] CXX obj/src/node_base.node_debug.o631[165/1871] CXX obj/src/node_base.compile_cache.o632In file included from ../../src/memory_tracker.h:6,633 from ../../src/base_object.h:29,634 from ../../src/async_wrap.h:27,635 from ../../src/debug_utils.h:6,636 from ../../src/debug_utils-inl.h:6,637 from ../../src/compile_cache.cc:3:638../../deps/v8/include/v8-profiler.h: In constructor 'v8::HeapProfiler::HeapSnapshotOptions::HeapSnapshotOptions()':639../../deps/v8/include/v8-profiler.h:1128:27: warning: 'v8::HeapProfiler::HeapSnapshotOptions::global_object_name_resolver' is deprecated: Use context_name_resolver callback instead. [-Wdeprecated-declarations]640 1128 | HeapSnapshotOptions() {}641 | ^642../../deps/v8/include/v8-profiler.h:1142:25: note: declared here643 1142 | ObjectNameResolver* global_object_name_resolver = nullptr;644 | ^~~~~~~~~~~~~~~~~~~~~~~~~~~645../../deps/v8/include/v8-profiler.h:1128:27: warning: 'v8::HeapProfiler::HeapSnapshotOptions::global_object_name_resolver' is deprecated: Use context_name_resolver callback instead. [-Wdeprecated-declarations]646 1128 | HeapSnapshotOptions() {}647 | ^648../../deps/v8/include/v8-profiler.h:1142:25: note: declared here649 1142 | ObjectNameResolver* global_object_name_resolver = nullptr;650 | ^~~~~~~~~~~~~~~~~~~~~~~~~~~651[166/1871] CXX obj/src/api/node_base.environment.o652In file included from ../../src/memory_tracker.h:6,653 from ../../src/base_object.h:29,654 from ../../src/async_wrap.h:27,655 from ../../src/crypto/crypto_util.h:6,656 from ../../src/api/environment.cc:3:657../../deps/v8/include/v8-profiler.h: In constructor 'v8::HeapProfiler::HeapSnapshotOptions::HeapSnapshotOptions()':658../../deps/v8/include/v8-profiler.h:1128:27: warning: 'v8::HeapProfiler::HeapSnapshotOptions::global_object_name_resolver' is deprecated: Use context_name_resolver callback instead. [-Wdeprecated-declarations]659 1128 | HeapSnapshotOptions() {}660 | ^661../../deps/v8/include/v8-profiler.h:1142:25: note: declared here662 1142 | ObjectNameResolver* global_object_name_resolver = nullptr;663 | ^~~~~~~~~~~~~~~~~~~~~~~~~~~664../../deps/v8/include/v8-profiler.h:1128:27: warning: 'v8::HeapProfiler::HeapSnapshotOptions::global_object_name_resolver' is deprecated: Use context_name_resolver callback instead. [-Wdeprecated-declarations]665 1128 | HeapSnapshotOptions() {}666 | ^667../../deps/v8/include/v8-profiler.h:1142:25: note: declared here668 1142 | ObjectNameResolver* global_object_name_resolver = nullptr;669 | ^~~~~~~~~~~~~~~~~~~~~~~~~~~670[167/1871] CXX obj/src/node_base.handle_wrap.o671In file included from ../../src/memory_tracker.h:6,672 from ../../src/base_object.h:29,673 from ../../src/async_wrap.h:27,674 from ../../src/handle_wrap.h:27,675 from ../../src/handle_wrap.cc:22:676../../deps/v8/include/v8-profiler.h: In constructor 'v8::HeapProfiler::HeapSnapshotOptions::HeapSnapshotOptions()':677../../deps/v8/include/v8-profiler.h:1128:27: warning: 'v8::HeapProfiler::HeapSnapshotOptions::global_object_name_resolver' is deprecated: Use context_name_resolver callback instead. [-Wdeprecated-declarations]678 1128 | HeapSnapshotOptions() {}679 | ^680../../deps/v8/include/v8-profiler.h:1142:25: note: declared here681 1142 | ObjectNameResolver* global_object_name_resolver = nullptr;682 | ^~~~~~~~~~~~~~~~~~~~~~~~~~~683../../deps/v8/include/v8-profiler.h:1128:27: warning: 'v8::HeapProfiler::HeapSnapshotOptions::global_object_name_resolver' is deprecated: Use context_name_resolver callback instead. [-Wdeprecated-declarations]684 1128 | HeapSnapshotOptions() {}685 | ^686../../deps/v8/include/v8-profiler.h:1142:25: note: declared here687 1142 | ObjectNameResolver* global_object_name_resolver = nullptr;688 | ^~~~~~~~~~~~~~~~~~~~~~~~~~~689[168/1871] CXX obj/src/node_base.async_wrap.o690In file included from ../../src/memory_tracker.h:6,691 from ../../src/base_object.h:29,692 from ../../src/async_wrap.h:27,693 from ../../src/async_wrap.cc:22:694../../deps/v8/include/v8-profiler.h: In constructor 'v8::HeapProfiler::HeapSnapshotOptions::HeapSnapshotOptions()':695../../deps/v8/include/v8-profiler.h:1128:27: warning: 'v8::HeapProfiler::HeapSnapshotOptions::global_object_name_resolver' is deprecated: Use context_name_resolver callback instead. [-Wdeprecated-declarations]696 1128 | HeapSnapshotOptions() {}697 | ^698../../deps/v8/include/v8-profiler.h:1142:25: note: declared here699 1142 | ObjectNameResolver* global_object_name_resolver = nullptr;700 | ^~~~~~~~~~~~~~~~~~~~~~~~~~~701../../deps/v8/include/v8-profiler.h:1128:27: warning: 'v8::HeapProfiler::HeapSnapshotOptions::global_object_name_resolver' is deprecated: Use context_name_resolver callback instead. [-Wdeprecated-declarations]702 1128 | HeapSnapshotOptions() {}703 | ^704../../deps/v8/include/v8-profiler.h:1142:25: note: declared here705 1142 | ObjectNameResolver* global_object_name_resolver = nullptr;706 | ^~~~~~~~~~~~~~~~~~~~~~~~~~~707[169/1871] CXX obj/src/node_base.fs_event_wrap.o708In file included from ../../src/memory_tracker.h:6,709 from ../../src/base_object.h:29,710 from ../../src/async_wrap.h:27,711 from ../../src/async_wrap-inl.h:27,712 from ../../src/fs_event_wrap.cc:22:713../../deps/v8/include/v8-profiler.h: In constructor 'v8::HeapProfiler::HeapSnapshotOptions::HeapSnapshotOptions()':714../../deps/v8/include/v8-profiler.h:1128:27: warning: 'v8::HeapProfiler::HeapSnapshotOptions::global_object_name_resolver' is deprecated: Use context_name_resolver callback instead. [-Wdeprecated-declarations]715 1128 | HeapSnapshotOptions() {}716 | ^717../../deps/v8/include/v8-profiler.h:1142:25: note: declared here718 1142 | ObjectNameResolver* global_object_name_resolver = nullptr;719 | ^~~~~~~~~~~~~~~~~~~~~~~~~~~720../../deps/v8/include/v8-profiler.h:1128:27: warning: 'v8::HeapProfiler::HeapSnapshotOptions::global_object_name_resolver' is deprecated: Use context_name_resolver callback instead. [-Wdeprecated-declarations]721 1128 | HeapSnapshotOptions() {}722 | ^723../../deps/v8/include/v8-profiler.h:1142:25: note: declared here724 1142 | ObjectNameResolver* global_object_name_resolver = nullptr;725 | ^~~~~~~~~~~~~~~~~~~~~~~~~~~726[170/1871] CXX obj/src/node_base.heap_utils.o727In file included from ../../src/memory_tracker.h:6,728 from ../../src/aliased_buffer.h:7,729 from ../../src/env.h:27,730 from ../../src/node_internals.h:27,731 from ../../src/diagnosticfilename-inl.h:6,732 from ../../src/heap_utils.cc:1:733../../deps/v8/include/v8-profiler.h: In constructor 'v8::HeapProfiler::HeapSnapshotOptions::HeapSnapshotOptions()':734../../deps/v8/include/v8-profiler.h:1128:27: warning: 'v8::HeapProfiler::HeapSnapshotOptions::global_object_name_resolver' is deprecated: Use context_name_resolver callback instead. [-Wdeprecated-declarations]735 1128 | HeapSnapshotOptions() {}736 | ^737../../deps/v8/include/v8-profiler.h:1142:25: note: declared here738 1142 | ObjectNameResolver* global_object_name_resolver = nullptr;739 | ^~~~~~~~~~~~~~~~~~~~~~~~~~~740../../deps/v8/include/v8-profiler.h:1128:27: warning: 'v8::HeapProfiler::HeapSnapshotOptions::global_object_name_resolver' is deprecated: Use context_name_resolver callback instead. [-Wdeprecated-declarations]741 1128 | HeapSnapshotOptions() {}742 | ^743../../deps/v8/include/v8-profiler.h:1142:25: note: declared here744 1142 | ObjectNameResolver* global_object_name_resolver = nullptr;745 | ^~~~~~~~~~~~~~~~~~~~~~~~~~~746[171/1871] CXX obj/src/node_base.js_udp_wrap.o747In file included from ../../src/memory_tracker.h:6,748 from ../../src/base_object.h:29,749 from ../../src/async_wrap.h:27,750 from ../../src/handle_wrap.h:27,751 from ../../src/udp_wrap.h:27,752 from ../../src/js_udp_wrap.cc:1:753../../deps/v8/include/v8-profiler.h: In constructor 'v8::HeapProfiler::HeapSnapshotOptions::HeapSnapshotOptions()':754../../deps/v8/include/v8-profiler.h:1128:27: warning: 'v8::HeapProfiler::HeapSnapshotOptions::global_object_name_resolver' is deprecated: Use context_name_resolver callback instead. [-Wdeprecated-declarations]755 1128 | HeapSnapshotOptions() {}756 | ^757../../deps/v8/include/v8-profiler.h:1142:25: note: declared here758 1142 | ObjectNameResolver* global_object_name_resolver = nullptr;759 | ^~~~~~~~~~~~~~~~~~~~~~~~~~~760../../deps/v8/include/v8-profiler.h:1128:27: warning: 'v8::HeapProfiler::HeapSnapshotOptions::global_object_name_resolver' is deprecated: Use context_name_resolver callback instead. [-Wdeprecated-declarations]761 1128 | HeapSnapshotOptions() {}762 | ^763../../deps/v8/include/v8-profiler.h:1142:25: note: declared here764 1142 | ObjectNameResolver* global_object_name_resolver = nullptr;765 | ^~~~~~~~~~~~~~~~~~~~~~~~~~~766[172/1871] CXX obj/src/dataqueue/node_base.queue.o767In file included from ../../src/memory_tracker.h:6,768 from ../../src/base_object.h:29,769 from ../../src/dataqueue/queue.h:5,770 from ../../src/dataqueue/queue.cc:1:771../../deps/v8/include/v8-profiler.h: In constructor 'v8::HeapProfiler::HeapSnapshotOptions::HeapSnapshotOptions()':772../../deps/v8/include/v8-profiler.h:1128:27: warning: 'v8::HeapProfiler::HeapSnapshotOptions::global_object_name_resolver' is deprecated: Use context_name_resolver callback instead. [-Wdeprecated-declarations]773 1128 | HeapSnapshotOptions() {}774 | ^775../../deps/v8/include/v8-profiler.h:1142:25: note: declared here776 1142 | ObjectNameResolver* global_object_name_resolver = nullptr;777 | ^~~~~~~~~~~~~~~~~~~~~~~~~~~778../../deps/v8/include/v8-profiler.h:1128:27: warning: 'v8::HeapProfiler::HeapSnapshotOptions::global_object_name_resolver' is deprecated: Use context_name_resolver callback instead. [-Wdeprecated-declarations]779 1128 | HeapSnapshotOptions() {}780 | ^781../../deps/v8/include/v8-profiler.h:1142:25: note: declared here782 1142 | ObjectNameResolver* global_object_name_resolver = nullptr;783 | ^~~~~~~~~~~~~~~~~~~~~~~~~~~784[173/1871] CXX obj/src/node_base.js_stream.o785In file included from ../../src/memory_tracker.h:6,786 from ../../src/base_object.h:29,787 from ../../src/async_wrap.h:27,788 from ../../src/js_stream.h:6,789 from ../../src/js_stream.cc:1:790../../deps/v8/include/v8-profiler.h: In constructor 'v8::HeapProfiler::HeapSnapshotOptions::HeapSnapshotOptions()':791../../deps/v8/include/v8-profiler.h:1128:27: warning: 'v8::HeapProfiler::HeapSnapshotOptions::global_object_name_resolver' is deprecated: Use context_name_resolver callback instead. [-Wdeprecated-declarations]792 1128 | HeapSnapshotOptions() {}793 | ^794../../deps/v8/include/v8-profiler.h:1142:25: note: declared here795 1142 | ObjectNameResolver* global_object_name_resolver = nullptr;796 | ^~~~~~~~~~~~~~~~~~~~~~~~~~~797../../deps/v8/include/v8-profiler.h:1128:27: warning: 'v8::HeapProfiler::HeapSnapshotOptions::global_object_name_resolver' is deprecated: Use context_name_resolver callback instead. [-Wdeprecated-declarations]798 1128 | HeapSnapshotOptions() {}799 | ^800../../deps/v8/include/v8-profiler.h:1142:25: note: declared here801 1142 | ObjectNameResolver* global_object_name_resolver = nullptr;802 | ^~~~~~~~~~~~~~~~~~~~~~~~~~~803[174/1871] CXX obj/src/node_base.encoding_binding.o804In file included from ../../src/memory_tracker.h:6,805 from ../../src/aliased_buffer.h:7,806 from ../../src/encoding_binding.h:7,807 from ../../src/encoding_binding.cc:1:808../../deps/v8/include/v8-profiler.h: In constructor 'v8::HeapProfiler::HeapSnapshotOptions::HeapSnapshotOptions()':809../../deps/v8/include/v8-profiler.h:1128:27: warning: 'v8::HeapProfiler::HeapSnapshotOptions::global_object_name_resolver' is deprecated: Use context_name_resolver callback instead. [-Wdeprecated-declarations]810 1128 | HeapSnapshotOptions() {}811 | ^812../../deps/v8/include/v8-profiler.h:1142:25: note: declared here813 1142 | ObjectNameResolver* global_object_name_resolver = nullptr;814 | ^~~~~~~~~~~~~~~~~~~~~~~~~~~815../../deps/v8/include/v8-profiler.h:1128:27: warning: 'v8::HeapProfiler::HeapSnapshotOptions::global_object_name_resolver' is deprecated: Use context_name_resolver callback instead. [-Wdeprecated-declarations]816 1128 | HeapSnapshotOptions() {}817 | ^818../../deps/v8/include/v8-profiler.h:1142:25: note: declared here819 1142 | ObjectNameResolver* global_object_name_resolver = nullptr;820 | ^~~~~~~~~~~~~~~~~~~~~~~~~~~821[175/1871] CXX obj/src/node_base.histogram.o822In file included from ../../src/memory_tracker.h:6,823 from ../../src/base_object.h:29,824 from ../../src/histogram.h:7,825 from ../../src/histogram.cc:1:826../../deps/v8/include/v8-profiler.h: In constructor 'v8::HeapProfiler::HeapSnapshotOptions::HeapSnapshotOptions()':827../../deps/v8/include/v8-profiler.h:1128:27: warning: 'v8::HeapProfiler::HeapSnapshotOptions::global_object_name_resolver' is deprecated: Use context_name_resolver callback instead. [-Wdeprecated-declarations]828 1128 | HeapSnapshotOptions() {}829 | ^830../../deps/v8/include/v8-profiler.h:1142:25: note: declared here831 1142 | ObjectNameResolver* global_object_name_resolver = nullptr;832 | ^~~~~~~~~~~~~~~~~~~~~~~~~~~833../../deps/v8/include/v8-profiler.h:1128:27: warning: 'v8::HeapProfiler::HeapSnapshotOptions::global_object_name_resolver' is deprecated: Use context_name_resolver callback instead. [-Wdeprecated-declarations]834 1128 | HeapSnapshotOptions() {}835 | ^836../../deps/v8/include/v8-profiler.h:1142:25: note: declared here837 1142 | ObjectNameResolver* global_object_name_resolver = nullptr;838 | ^~~~~~~~~~~~~~~~~~~~~~~~~~~839[176/1871] CXX obj/src/node_base.node_file_utils.o840In file included from ../../src/util.h:29,841 from ../../src/util-inl.h:33,842 from ../../src/node_file_utils.cc:10:843../../deps/v8/include/v8-profiler.h: In constructor 'v8::HeapProfiler::HeapSnapshotOptions::HeapSnapshotOptions()':844../../deps/v8/include/v8-profiler.h:1128:27: warning: 'v8::HeapProfiler::HeapSnapshotOptions::global_object_name_resolver' is deprecated: Use context_name_resolver callback instead. [-Wdeprecated-declarations]845 1128 | HeapSnapshotOptions() {}846 | ^847../../deps/v8/include/v8-profiler.h:1142:25: note: declared here848 1142 | ObjectNameResolver* global_object_name_resolver = nullptr;849 | ^~~~~~~~~~~~~~~~~~~~~~~~~~~850../../deps/v8/include/v8-profiler.h:1128:27: warning: 'v8::HeapProfiler::HeapSnapshotOptions::global_object_name_resolver' is deprecated: Use context_name_resolver callback instead. [-Wdeprecated-declarations]851 1128 | HeapSnapshotOptions() {}852 | ^853../../deps/v8/include/v8-profiler.h:1142:25: note: declared here854 1142 | ObjectNameResolver* global_object_name_resolver = nullptr;855 | ^~~~~~~~~~~~~~~~~~~~~~~~~~~856../../src/node_file_utils.cc: In function 'int node::WriteFileSync(const char*, uv_buf_t*, size_t)':857../../src/node_file_utils.cc:62:32: warning: enumerated and non-enumerated type in conditional expression [-Wextra]858 62 | int err = req.result < 0 ? req.result : UV_EIO;859 | ~~~~~~~~~~~~~~~^~~~~~~~~~~~~~~~~~~~~860[177/1871] CXX obj/src/node_base.js_native_api_v8.o861In file included from ../../src/memory_tracker.h:6,862 from ../../src/aliased_buffer.h:7,863 from ../../src/aliased_buffer-inl.h:6,864 from ../../src/env-inl.h:27,865 from ../../src/js_native_api_v8.cc:7:866../../deps/v8/include/v8-profiler.h: In constructor 'v8::HeapProfiler::HeapSnapshotOptions::HeapSnapshotOptions()':867../../deps/v8/include/v8-profiler.h:1128:27: warning: 'v8::HeapProfiler::HeapSnapshotOptions::global_object_name_resolver' is deprecated: Use context_name_resolver callback instead. [-Wdeprecated-declarations]868 1128 | HeapSnapshotOptions() {}869 | ^870../../deps/v8/include/v8-profiler.h:1142:25: note: declared here871 1142 | ObjectNameResolver* global_object_name_resolver = nullptr;872 | ^~~~~~~~~~~~~~~~~~~~~~~~~~~873../../deps/v8/include/v8-profiler.h:1128:27: warning: 'v8::HeapProfiler::HeapSnapshotOptions::global_object_name_resolver' is deprecated: Use context_name_resolver callback instead. [-Wdeprecated-declarations]874 1128 | HeapSnapshotOptions() {}875 | ^876../../deps/v8/include/v8-profiler.h:1142:25: note: declared here877 1142 | ObjectNameResolver* global_object_name_resolver = nullptr;878 | ^~~~~~~~~~~~~~~~~~~~~~~~~~~879[178/1871] CXX obj/src/node_base.node_api.o880In file included from ../../src/memory_tracker.h:6,881 from ../../src/base_object.h:29,882 from ../../src/async_context_frame.h:6,883 from ../../src/node_api.cc:1:884../../deps/v8/include/v8-profiler.h: In constructor 'v8::HeapProfiler::HeapSnapshotOptions::HeapSnapshotOptions()':885../../deps/v8/include/v8-profiler.h:1128:27: warning: 'v8::HeapProfiler::HeapSnapshotOptions::global_object_name_resolver' is deprecated: Use context_name_resolver callback instead. [-Wdeprecated-declarations]886 1128 | HeapSnapshotOptions() {}887 | ^888../../deps/v8/include/v8-profiler.h:1142:25: note: declared here889 1142 | ObjectNameResolver* global_object_name_resolver = nullptr;890 | ^~~~~~~~~~~~~~~~~~~~~~~~~~~891../../deps/v8/include/v8-profiler.h:1128:27: warning: 'v8::HeapProfiler::HeapSnapshotOptions::global_object_name_resolver' is deprecated: Use context_name_resolver callback instead. [-Wdeprecated-declarations]892 1128 | HeapSnapshotOptions() {}893 | ^894../../deps/v8/include/v8-profiler.h:1142:25: note: declared here895 1142 | ObjectNameResolver* global_object_name_resolver = nullptr;896 | ^~~~~~~~~~~~~~~~~~~~~~~~~~~897[179/1871] CXX obj/src/node_base.node.o898In file included from ../../src/memory_tracker.h:6,899 from ../../src/aliased_buffer.h:7,900 from ../../src/env.h:27,901 from ../../src/node_internals.h:27,902 from ../../src/node_config_file.h:12,903 from ../../src/node.cc:23:904../../deps/v8/include/v8-profiler.h: In constructor 'v8::HeapProfiler::HeapSnapshotOptions::HeapSnapshotOptions()':905../../deps/v8/include/v8-profiler.h:1128:27: warning: 'v8::HeapProfiler::HeapSnapshotOptions::global_object_name_resolver' is deprecated: Use context_name_resolver callback instead. [-Wdeprecated-declarations]906 1128 | HeapSnapshotOptions() {}907 | ^908../../deps/v8/include/v8-profiler.h:1142:25: note: declared here909 1142 | ObjectNameResolver* global_object_name_resolver = nullptr;910 | ^~~~~~~~~~~~~~~~~~~~~~~~~~~911../../deps/v8/include/v8-profiler.h:1128:27: warning: 'v8::HeapProfiler::HeapSnapshotOptions::global_object_name_resolver' is deprecated: Use context_name_resolver callback instead. [-Wdeprecated-declarations]912 1128 | HeapSnapshotOptions() {}913 | ^914../../deps/v8/include/v8-profiler.h:1142:25: note: declared here915 1142 | ObjectNameResolver* global_object_name_resolver = nullptr;916 | ^~~~~~~~~~~~~~~~~~~~~~~~~~~917[180/1871] CXX obj/src/node_base.module_wrap.o918In file included from ../../src/memory_tracker.h:6,919 from ../../src/base_object.h:29,920 from ../../src/module_wrap.h:10,921 from ../../src/module_wrap.cc:1:922../../deps/v8/include/v8-profiler.h: In constructor 'v8::HeapProfiler::HeapSnapshotOptions::HeapSnapshotOptions()':923../../deps/v8/include/v8-profiler.h:1128:27: warning: 'v8::HeapProfiler::HeapSnapshotOptions::global_object_name_resolver' is deprecated: Use context_name_resolver callback instead. [-Wdeprecated-declarations]924 1128 | HeapSnapshotOptions() {}925 | ^926../../deps/v8/include/v8-profiler.h:1142:25: note: declared here927 1142 | ObjectNameResolver* global_object_name_resolver = nullptr;928 | ^~~~~~~~~~~~~~~~~~~~~~~~~~~929../../deps/v8/include/v8-profiler.h:1128:27: warning: 'v8::HeapProfiler::HeapSnapshotOptions::global_object_name_resolver' is deprecated: Use context_name_resolver callback instead. [-Wdeprecated-declarations]930 1128 | HeapSnapshotOptions() {}931 | ^932../../deps/v8/include/v8-profiler.h:1142:25: note: declared here933 1142 | ObjectNameResolver* global_object_name_resolver = nullptr;934 | ^~~~~~~~~~~~~~~~~~~~~~~~~~~935[181/1871] CXX obj/gen/node_base.node_javascript.o936In file included from ../../src/memory_tracker.h:6,937 from ../../src/aliased_buffer.h:7,938 from ../../src/aliased_buffer-inl.h:6,939 from ../../src/env-inl.h:27,940 from gen/node_javascript.cc:2:941../../deps/v8/include/v8-profiler.h: In constructor 'v8::HeapProfiler::HeapSnapshotOptions::HeapSnapshotOptions()':942../../deps/v8/include/v8-profiler.h:1128:27: warning: 'v8::HeapProfiler::HeapSnapshotOptions::global_object_name_resolver' is deprecated: Use context_name_resolver callback instead. [-Wdeprecated-declarations]943 1128 | HeapSnapshotOptions() {}944 | ^945../../deps/v8/include/v8-profiler.h:1142:25: note: declared here946 1142 | ObjectNameResolver* global_object_name_resolver = nullptr;947 | ^~~~~~~~~~~~~~~~~~~~~~~~~~~948../../deps/v8/include/v8-profiler.h:1128:27: warning: 'v8::HeapProfiler::HeapSnapshotOptions::global_object_name_resolver' is deprecated: Use context_name_resolver callback instead. [-Wdeprecated-declarations]949 1128 | HeapSnapshotOptions() {}950 | ^951../../deps/v8/include/v8-profiler.h:1142:25: note: declared here952 1142 | ObjectNameResolver* global_object_name_resolver = nullptr;953 | ^~~~~~~~~~~~~~~~~~~~~~~~~~~954[182/1871] CXX obj/src/node_base.node_config.o955In file included from ../../src/memory_tracker.h:6,956 from ../../src/aliased_buffer.h:7,957 from ../../src/aliased_buffer-inl.h:6,958 from ../../src/env-inl.h:27,959 from ../../src/node_config.cc:1:960../../deps/v8/include/v8-profiler.h: In constructor 'v8::HeapProfiler::HeapSnapshotOptions::HeapSnapshotOptions()':961../../deps/v8/include/v8-profiler.h:1128:27: warning: 'v8::HeapProfiler::HeapSnapshotOptions::global_object_name_resolver' is deprecated: Use context_name_resolver callback instead. [-Wdeprecated-declarations]962 1128 | HeapSnapshotOptions() {}963 | ^964../../deps/v8/include/v8-profiler.h:1142:25: note: declared here965 1142 | ObjectNameResolver* global_object_name_resolver = nullptr;966 | ^~~~~~~~~~~~~~~~~~~~~~~~~~~967../../deps/v8/include/v8-profiler.h:1128:27: warning: 'v8::HeapProfiler::HeapSnapshotOptions::global_object_name_resolver' is deprecated: Use context_name_resolver callback instead. [-Wdeprecated-declarations]968 1128 | HeapSnapshotOptions() {}969 | ^970../../deps/v8/include/v8-profiler.h:1142:25: note: declared here971 1142 | ObjectNameResolver* global_object_name_resolver = nullptr;972 | ^~~~~~~~~~~~~~~~~~~~~~~~~~~973[183/1871] CXX obj/src/node_base.node_cjs_lexer.o974In file included from ../../src/memory_tracker.h:6,975 from ../../src/aliased_buffer.h:7,976 from ../../src/aliased_buffer-inl.h:6,977 from ../../src/env-inl.h:27,978 from ../../src/node_cjs_lexer.cc:1:979../../deps/v8/include/v8-profiler.h: In constructor 'v8::HeapProfiler::HeapSnapshotOptions::HeapSnapshotOptions()':980../../deps/v8/include/v8-profiler.h:1128:27: warning: 'v8::HeapProfiler::HeapSnapshotOptions::global_object_name_resolver' is deprecated: Use context_name_resolver callback instead. [-Wdeprecated-declarations]981 1128 | HeapSnapshotOptions() {}982 | ^983../../deps/v8/include/v8-profiler.h:1142:25: note: declared here984 1142 | ObjectNameResolver* global_object_name_resolver = nullptr;985 | ^~~~~~~~~~~~~~~~~~~~~~~~~~~986../../deps/v8/include/v8-profiler.h:1128:27: warning: 'v8::HeapProfiler::HeapSnapshotOptions::global_object_name_resolver' is deprecated: Use context_name_resolver callback instead. [-Wdeprecated-declarations]987 1128 | HeapSnapshotOptions() {}988 | ^989../../deps/v8/include/v8-profiler.h:1142:25: note: declared here990 1142 | ObjectNameResolver* global_object_name_resolver = nullptr;991 | ^~~~~~~~~~~~~~~~~~~~~~~~~~~992[184/1871] CXX obj/src/node_base.cares_wrap.o993In file included from ../../src/memory_tracker.h:6,994 from ../../src/base_object.h:29,995 from ../../src/async_wrap.h:27,996 from ../../src/cares_wrap.h:8,997 from ../../src/cares_wrap.cc:22:998../../deps/v8/include/v8-profiler.h: In constructor 'v8::HeapProfiler::HeapSnapshotOptions::HeapSnapshotOptions()':999../../deps/v8/include/v8-profiler.h:1128:27: warning: 'v8::HeapProfiler::HeapSnapshotOptions::global_object_name_resolver' is deprecated: Use context_name_resolver callback instead. [-Wdeprecated-declarations]1000 1128 | HeapSnapshotOptions() {}1001 | ^1002../../deps/v8/include/v8-profiler.h:1142:25: note: declared here1003 1142 | ObjectNameResolver* global_object_name_resolver = nullptr;1004 | ^~~~~~~~~~~~~~~~~~~~~~~~~~~1005../../deps/v8/include/v8-profiler.h:1128:27: warning: 'v8::HeapProfiler::HeapSnapshotOptions::global_object_name_resolver' is deprecated: Use context_name_resolver callback instead. [-Wdeprecated-declarations]1006 1128 | HeapSnapshotOptions() {}1007 | ^1008../../deps/v8/include/v8-profiler.h:1142:25: note: declared here1009 1142 | ObjectNameResolver* global_object_name_resolver = nullptr;1010 | ^~~~~~~~~~~~~~~~~~~~~~~~~~~1011../../src/cares_wrap.cc: In function 'v8::Maybe<int> node::cares_wrap::{anonymous}::ParseGeneralReply(node::Environment*, const unsigned char*, int, int*, v8::Local<v8::Array>, void*, int*)':1012../../src/cares_wrap.cc:244:34: warning: 'int ares_parse_a_reply(const unsigned char*, int, hostent**, ares_addrttl*, int*)' is deprecated: Use ares_dns_parse instead [-Wdeprecated-declarations]1013 244 | status = ares_parse_a_reply(buf,1014 | ~~~~~~~~~~~~~~~~~~^~~~~1015 245 | len,1016 | ~~~~1017 246 | &host,1018 | ~~~~~~1019 247 | static_cast<ares_addrttl*>(addrttls),1020 | ~~~~~~~~~~~~~~~~~~~~~~~~~~~~~~~~~~~~~1021 248 | naddrttls);1022 | ~~~~~~~~~~1023In file included from ../../src/cares_wrap.h:17:1024/nix/store/j239p458yixap89j6wpfib9yjypd3ii5-c-ares-1.34.8-dev/include/ares.h:1106:55: note: declared here1025 1106 | CARES_EXTERN CARES_DEPRECATED_FOR(ares_dns_parse) int ares_parse_a_reply(1026 | ^~~~~~~~~~~~~~~~~~1027../../src/cares_wrap.cc:251:37: warning: 'int ares_parse_aaaa_reply(const unsigned char*, int, hostent**, ares_addr6ttl*, int*)' is deprecated: Use ares_dns_parse instead [-Wdeprecated-declarations]1028 251 | status = ares_parse_aaaa_reply(buf,1029 | ~~~~~~~~~~~~~~~~~~~~~^~~~~1030 252 | len,1031 | ~~~~1032 253 | &host,1033 | ~~~~~~1034 254 | static_cast<ares_addr6ttl*>(addrttls),1035 | ~~~~~~~~~~~~~~~~~~~~~~~~~~~~~~~~~~~~~~1036 255 | naddrttls);1037 | ~~~~~~~~~~1038/nix/store/j239p458yixap89j6wpfib9yjypd3ii5-c-ares-1.34.8-dev/include/ares.h:1110:55: note: declared here1039 1110 | CARES_EXTERN CARES_DEPRECATED_FOR(ares_dns_parse) int ares_parse_aaaa_reply(1040 | ^~~~~~~~~~~~~~~~~~~~~1041../../src/cares_wrap.cc:258:35: warning: 'int ares_parse_ns_reply(const unsigned char*, int, hostent**)' is deprecated: Use ares_dns_parse instead [-Wdeprecated-declarations]1042 258 | status = ares_parse_ns_reply(buf, len, &host);1043 | ~~~~~~~~~~~~~~~~~~~^~~~~~~~~~~~~~~~~1044/nix/store/j239p458yixap89j6wpfib9yjypd3ii5-c-ares-1.34.8-dev/include/ares.h:1121:55: note: declared here1045 1121 | CARES_EXTERN CARES_DEPRECATED_FOR(ares_dns_parse) int ares_parse_ns_reply(1046 | ^~~~~~~~~~~~~~~~~~~1047../../src/cares_wrap.cc:261:36: warning: 'int ares_parse_ptr_reply(const unsigned char*, int, const void*, int, int, hostent**)' is deprecated: Use ares_dns_parse instead [-Wdeprecated-declarations]1048 261 | status = ares_parse_ptr_reply(buf, len, nullptr, 0, AF_INET, &host);1049 | ~~~~~~~~~~~~~~~~~~~~^~~~~~~~~~~~~~~~~~~~~~~~~~~~~~~~~~~~~~1050/nix/store/j239p458yixap89j6wpfib9yjypd3ii5-c-ares-1.34.8-dev/include/ares.h:1117:55: note: declared here1051 1117 | CARES_EXTERN CARES_DEPRECATED_FOR(ares_dns_parse) int ares_parse_ptr_reply(1052 | ^~~~~~~~~~~~~~~~~~~~1053../../src/cares_wrap.cc: In function 'v8::Maybe<int> node::cares_wrap::{anonymous}::ParseMxReply(node::Environment*, const unsigned char*, int, v8::Local<v8::Array>, bool)':1054../../src/cares_wrap.cc:337:35: warning: 'int ares_parse_mx_reply(const unsigned char*, int, ares_mx_reply**)' is deprecated: Use ares_dns_parse instead [-Wdeprecated-declarations]1055 337 | int status = ares_parse_mx_reply(buf, len, &mx_start);1056 | ~~~~~~~~~~~~~~~~~~~^~~~~~~~~~~~~~~~~~~~~1057/nix/store/j239p458yixap89j6wpfib9yjypd3ii5-c-ares-1.34.8-dev/include/ares.h:1127:55: note: declared here1058 1127 | CARES_EXTERN CARES_DEPRECATED_FOR(ares_dns_parse) int ares_parse_mx_reply(1059 | ^~~~~~~~~~~~~~~~~~~1060../../src/cares_wrap.cc: In function 'v8::Maybe<int> node::cares_wrap::{anonymous}::ParseCaaReply(node::Environment*, const unsigned char*, int, v8::Local<v8::Array>, bool)':1061../../src/cares_wrap.cc:383:36: warning: 'int ares_parse_caa_reply(const unsigned char*, int, ares_caa_reply**)' is deprecated: Use ares_dns_parse instead [-Wdeprecated-declarations]1062 383 | int status = ares_parse_caa_reply(buf, len, &caa_start);1063 | ~~~~~~~~~~~~~~~~~~~~^~~~~~~~~~~~~~~~~~~~~~1064/nix/store/j239p458yixap89j6wpfib9yjypd3ii5-c-ares-1.34.8-dev/include/ares.h:1114:55: note: declared here1065 1114 | CARES_EXTERN CARES_DEPRECATED_FOR(ares_dns_parse) int ares_parse_caa_reply(1066 | ^~~~~~~~~~~~~~~~~~~~1067../../src/cares_wrap.cc: In function 'v8::Maybe<int> node::cares_wrap::{anonymous}::ParseTxtReply(node::Environment*, const unsigned char*, int, v8::Local<v8::Array>, bool)':1068../../src/cares_wrap.cc:511:40: warning: 'int ares_parse_txt_reply_ext(const unsigned char*, int, ares_txt_ext**)' is deprecated: Use ares_dns_parse instead [-Wdeprecated-declarations]1069 511 | int status = ares_parse_txt_reply_ext(buf, len, &txt_out);1070 | ~~~~~~~~~~~~~~~~~~~~~~~~^~~~~~~~~~~~~~~~~~~~1071/nix/store/j239p458yixap89j6wpfib9yjypd3ii5-c-ares-1.34.8-dev/include/ares.h:1133:55: note: declared here1072 1133 | CARES_EXTERN CARES_DEPRECATED_FOR(ares_dns_parse) int ares_parse_txt_reply_ext(1073 | ^~~~~~~~~~~~~~~~~~~~~~~~1074../../src/cares_wrap.cc: In function 'v8::Maybe<int> node::cares_wrap::{anonymous}::ParseSrvReply(node::Environment*, const unsigned char*, int, v8::Local<v8::Array>, bool)':1075../../src/cares_wrap.cc:598:36: warning: 'int ares_parse_srv_reply(const unsigned char*, int, ares_srv_reply**)' is deprecated: Use ares_dns_parse instead [-Wdeprecated-declarations]1076 598 | int status = ares_parse_srv_reply(buf, len, &srv_start);1077 | ~~~~~~~~~~~~~~~~~~~~^~~~~~~~~~~~~~~~~~~~~~1078/nix/store/j239p458yixap89j6wpfib9yjypd3ii5-c-ares-1.34.8-dev/include/ares.h:1124:55: note: declared here1079 1124 | CARES_EXTERN CARES_DEPRECATED_FOR(ares_dns_parse) int ares_parse_srv_reply(1080 | ^~~~~~~~~~~~~~~~~~~~1081../../src/cares_wrap.cc: In function 'v8::Maybe<int> node::cares_wrap::{anonymous}::ParseNaptrReply(node::Environment*, const unsigned char*, int, v8::Local<v8::Array>, bool)':1082../../src/cares_wrap.cc:653:38: warning: 'int ares_parse_naptr_reply(const unsigned char*, int, ares_naptr_reply**)' is deprecated: Use ares_dns_parse instead [-Wdeprecated-declarations]1083 653 | int status = ares_parse_naptr_reply(buf, len, &naptr_start);1084 | ~~~~~~~~~~~~~~~~~~~~~~^~~~~~~~~~~~~~~~~~~~~~~~1085/nix/store/j239p458yixap89j6wpfib9yjypd3ii5-c-ares-1.34.8-dev/include/ares.h:1136:55: note: declared here1086 1136 | CARES_EXTERN CARES_DEPRECATED_FOR(ares_dns_parse) int ares_parse_naptr_reply(1087 | ^~~~~~~~~~~~~~~~~~~~~~1088../../src/cares_wrap.cc: In member function 'void node::cares_wrap::ChannelWrap::EnsureServers()':1089../../src/cares_wrap.cc:1000:25: warning: 'int ares_get_servers_ports(const ares_channel_t*, ares_addr_port_node**)' is deprecated: Use ares_get_servers_csv instead [-Wdeprecated-declarations]1090 1000 | ares_get_servers_ports(channel_, &servers);1091 | ~~~~~~~~~~~~~~~~~~~~~~^~~~~~~~~~~~~~~~~~~~1092/nix/store/j239p458yixap89j6wpfib9yjypd3ii5-c-ares-1.34.8-dev/include/ares.h:1196:28: note: declared here1093 1196 | int ares_get_servers_ports(const ares_channel_t *channel,1094 | ^~~~~~~~~~~~~~~~~~~~~~1095../../src/cares_wrap.cc: In static member function 'static v8::Maybe<int> node::cares_wrap::SoaTraits::Parse(node::cares_wrap::QuerySoaWrap*, const std::unique_ptr<node::cares_wrap::ResponseData>&)':1096../../src/cares_wrap.cc:1711:36: warning: 'int ares_parse_soa_reply(const unsigned char*, int, ares_soa_reply**)' is deprecated: Use ares_dns_parse instead [-Wdeprecated-declarations]1097 1711 | int status = ares_parse_soa_reply(buf, len, &soa_out);1098 | ~~~~~~~~~~~~~~~~~~~~^~~~~~~~~~~~~~~~~~~~1099/nix/store/j239p458yixap89j6wpfib9yjypd3ii5-c-ares-1.34.8-dev/include/ares.h:1139:55: note: declared here1100 1139 | CARES_EXTERN CARES_DEPRECATED_FOR(ares_dns_parse) int ares_parse_soa_reply(1101 | ^~~~~~~~~~~~~~~~~~~~1102../../src/cares_wrap.cc: In function 'void node::cares_wrap::{anonymous}::GetServers(const v8::FunctionCallbackInfo<v8::Value>&)':1103../../src/cares_wrap.cc:2092:33: warning: 'int ares_get_servers_ports(const ares_channel_t*, ares_addr_port_node**)' is deprecated: Use ares_get_servers_csv instead [-Wdeprecated-declarations]1104 2092 | int r = ares_get_servers_ports(channel->cares_channel(), &servers);1105 | ~~~~~~~~~~~~~~~~~~~~~~^~~~~~~~~~~~~~~~~~~~~~~~~~~~~~~~~~~~1106/nix/store/j239p458yixap89j6wpfib9yjypd3ii5-c-ares-1.34.8-dev/include/ares.h:1196:28: note: declared here1107 1196 | int ares_get_servers_ports(const ares_channel_t *channel,1108 | ^~~~~~~~~~~~~~~~~~~~~~1109../../src/cares_wrap.cc: In function 'void node::cares_wrap::{anonymous}::SetServers(const v8::FunctionCallbackInfo<v8::Value>&)':1110../../src/cares_wrap.cc:2137:30: warning: 'int ares_set_servers(ares_channel_t*, const ares_addr_node*)' is deprecated: Use ares_set_servers_csv instead [-Wdeprecated-declarations]1111 2137 | int rv = ares_set_servers(channel->cares_channel(), nullptr);1112 | ~~~~~~~~~~~~~~~~^~~~~~~~~~~~~~~~~~~~~~~~~~~~~~~~~~~1113/nix/store/j239p458yixap89j6wpfib9yjypd3ii5-c-ares-1.34.8-dev/include/ares.h:1176:61: note: declared here1114 1176 | CARES_EXTERN CARES_DEPRECATED_FOR(ares_set_servers_csv) int ares_set_servers(1115 | ^~~~~~~~~~~~~~~~1116../../src/cares_wrap.cc:2197:33: warning: 'int ares_set_servers_ports(ares_channel_t*, const ares_addr_port_node*)' is deprecated: Use ares_set_servers_ports_csv instead [-Wdeprecated-declarations]1117 2197 | err = ares_set_servers_ports(channel->cares_channel(), servers.data());1118 | ~~~~~~~~~~~~~~~~~~~~~~^~~~~~~~~~~~~~~~~~~~~~~~~~~~~~~~~~~~~~~~~~1119/nix/store/j239p458yixap89j6wpfib9yjypd3ii5-c-ares-1.34.8-dev/include/ares.h:1181:20: note: declared here1120 1181 | int ares_set_servers_ports(ares_channel_t *channel,1121 | ^~~~~~~~~~~~~~~~~~~~~~1122[185/1871] CXX obj/src/node_base.node_config_file.o1123In file included from ../../src/memory_tracker.h:6,1124 from ../../src/aliased_buffer.h:7,1125 from ../../src/env.h:27,1126 from ../../src/node_internals.h:27,1127 from ../../src/node_config_file.h:12,1128 from ../../src/node_config_file.cc:1:1129../../deps/v8/include/v8-profiler.h: In constructor 'v8::HeapProfiler::HeapSnapshotOptions::HeapSnapshotOptions()':1130../../deps/v8/include/v8-profiler.h:1128:27: warning: 'v8::HeapProfiler::HeapSnapshotOptions::global_object_name_resolver' is deprecated: Use context_name_resolver callback instead. [-Wdeprecated-declarations]1131 1128 | HeapSnapshotOptions() {}1132 | ^1133../../deps/v8/include/v8-profiler.h:1142:25: note: declared here1134 1142 | ObjectNameResolver* global_object_name_resolver = nullptr;1135 | ^~~~~~~~~~~~~~~~~~~~~~~~~~~1136../../deps/v8/include/v8-profiler.h:1128:27: warning: 'v8::HeapProfiler::HeapSnapshotOptions::global_object_name_resolver' is deprecated: Use context_name_resolver callback instead. [-Wdeprecated-declarations]1137 1128 | HeapSnapshotOptions() {}1138 | ^1139../../deps/v8/include/v8-profiler.h:1142:25: note: declared here1140 1142 | ObjectNameResolver* global_object_name_resolver = nullptr;1141 | ^~~~~~~~~~~~~~~~~~~~~~~~~~~1142[186/1871] CXX obj/deps/v8/src/torque/torque_base.torque-parser.o1143[187/1871] CXX obj/src/node_base.node_dir.o1144In file included from ../../src/memory_tracker.h:6,1145 from ../../src/aliased_buffer.h:7,1146 from ../../src/node_file.h:7,1147 from ../../src/node_dir.h:6,1148 from ../../src/node_dir.cc:1:1149../../deps/v8/include/v8-profiler.h: In constructor 'v8::HeapProfiler::HeapSnapshotOptions::HeapSnapshotOptions()':1150../../deps/v8/include/v8-profiler.h:1128:27: warning: 'v8::HeapProfiler::HeapSnapshotOptions::global_object_name_resolver' is deprecated: Use context_name_resolver callback instead. [-Wdeprecated-declarations]1151 1128 | HeapSnapshotOptions() {}1152 | ^1153../../deps/v8/include/v8-profiler.h:1142:25: note: declared here1154 1142 | ObjectNameResolver* global_object_name_resolver = nullptr;1155 | ^~~~~~~~~~~~~~~~~~~~~~~~~~~1156../../deps/v8/include/v8-profiler.h:1128:27: warning: 'v8::HeapProfiler::HeapSnapshotOptions::global_object_name_resolver' is deprecated: Use context_name_resolver callback instead. [-Wdeprecated-declarations]1157 1128 | HeapSnapshotOptions() {}1158 | ^1159../../deps/v8/include/v8-profiler.h:1142:25: note: declared here1160 1142 | ObjectNameResolver* global_object_name_resolver = nullptr;1161 | ^~~~~~~~~~~~~~~~~~~~~~~~~~~1162[188/1871] CXX obj/src/node_base.node_constants.o1163In file included from ../../src/memory_tracker.h:6,1164 from ../../src/aliased_buffer.h:7,1165 from ../../src/aliased_buffer-inl.h:6,1166 from ../../src/env-inl.h:27,1167 from ../../src/node_constants.cc:22:1168../../deps/v8/include/v8-profiler.h: In constructor 'v8::HeapProfiler::HeapSnapshotOptions::HeapSnapshotOptions()':1169../../deps/v8/include/v8-profiler.h:1128:27: warning: 'v8::HeapProfiler::HeapSnapshotOptions::global_object_name_resolver' is deprecated: Use context_name_resolver callback instead. [-Wdeprecated-declarations]1170 1128 | HeapSnapshotOptions() {}1171 | ^1172../../deps/v8/include/v8-profiler.h:1142:25: note: declared here1173 1142 | ObjectNameResolver* global_object_name_resolver = nullptr;1174 | ^~~~~~~~~~~~~~~~~~~~~~~~~~~1175../../deps/v8/include/v8-profiler.h:1128:27: warning: 'v8::HeapProfiler::HeapSnapshotOptions::global_object_name_resolver' is deprecated: Use context_name_resolver callback instead. [-Wdeprecated-declarations]1176 1128 | HeapSnapshotOptions() {}1177 | ^1178../../deps/v8/include/v8-profiler.h:1142:25: note: declared here1179 1142 | ObjectNameResolver* global_object_name_resolver = nullptr;1180 | ^~~~~~~~~~~~~~~~~~~~~~~~~~~1181[189/1871] CXX obj/src/node_base.node_dotenv.o1182In file included from ../../src/util.h:29,1183 from ../../src/util-inl.h:33,1184 from ../../src/node_dotenv.h:6,1185 from ../../src/node_dotenv.cc:1:1186../../deps/v8/include/v8-profiler.h: In constructor 'v8::HeapProfiler::HeapSnapshotOptions::HeapSnapshotOptions()':1187../../deps/v8/include/v8-profiler.h:1128:27: warning: 'v8::HeapProfiler::HeapSnapshotOptions::global_object_name_resolver' is deprecated: Use context_name_resolver callback instead. [-Wdeprecated-declarations]1188 1128 | HeapSnapshotOptions() {}1189 | ^1190../../deps/v8/include/v8-profiler.h:1142:25: note: declared here1191 1142 | ObjectNameResolver* global_object_name_resolver = nullptr;1192 | ^~~~~~~~~~~~~~~~~~~~~~~~~~~1193../../deps/v8/include/v8-profiler.h:1128:27: warning: 'v8::HeapProfiler::HeapSnapshotOptions::global_object_name_resolver' is deprecated: Use context_name_resolver callback instead. [-Wdeprecated-declarations]1194 1128 | HeapSnapshotOptions() {}1195 | ^1196../../deps/v8/include/v8-profiler.h:1142:25: note: declared here1197 1142 | ObjectNameResolver* global_object_name_resolver = nullptr;1198 | ^~~~~~~~~~~~~~~~~~~~~~~~~~~1199[190/1871] CXX obj/src/node_base.node_credentials.o1200In file included from ../../src/memory_tracker.h:6,1201 from ../../src/aliased_buffer.h:7,1202 from ../../src/aliased_buffer-inl.h:6,1203 from ../../src/env-inl.h:27,1204 from ../../src/node_credentials.cc:1:1205../../deps/v8/include/v8-profiler.h: In constructor 'v8::HeapProfiler::HeapSnapshotOptions::HeapSnapshotOptions()':1206../../deps/v8/include/v8-profiler.h:1128:27: warning: 'v8::HeapProfiler::HeapSnapshotOptions::global_object_name_resolver' is deprecated: Use context_name_resolver callback instead. [-Wdeprecated-declarations]1207 1128 | HeapSnapshotOptions() {}1208 | ^1209../../deps/v8/include/v8-profiler.h:1142:25: note: declared here1210 1142 | ObjectNameResolver* global_object_name_resolver = nullptr;1211 | ^~~~~~~~~~~~~~~~~~~~~~~~~~~1212../../deps/v8/include/v8-profiler.h:1128:27: warning: 'v8::HeapProfiler::HeapSnapshotOptions::global_object_name_resolver' is deprecated: Use context_name_resolver callback instead. [-Wdeprecated-declarations]1213 1128 | HeapSnapshotOptions() {}1214 | ^1215../../deps/v8/include/v8-profiler.h:1142:25: note: declared here1216 1142 | ObjectNameResolver* global_object_name_resolver = nullptr;1217 | ^~~~~~~~~~~~~~~~~~~~~~~~~~~1218[191/1871] CXX obj/src/node_base.node_env_var.o1219In file included from ../../src/memory_tracker.h:6,1220 from ../../src/base_object.h:29,1221 from ../../src/async_wrap.h:27,1222 from ../../src/debug_utils.h:6,1223 from ../../src/debug_utils-inl.h:6,1224 from ../../src/node_env_var.cc:1:1225../../deps/v8/include/v8-profiler.h: In constructor 'v8::HeapProfiler::HeapSnapshotOptions::HeapSnapshotOptions()':1226../../deps/v8/include/v8-profiler.h:1128:27: warning: 'v8::HeapProfiler::HeapSnapshotOptions::global_object_name_resolver' is deprecated: Use context_name_resolver callback instead. [-Wdeprecated-declarations]1227 1128 | HeapSnapshotOptions() {}1228 | ^1229../../deps/v8/include/v8-profiler.h:1142:25: note: declared here1230 1142 | ObjectNameResolver* global_object_name_resolver = nullptr;1231 | ^~~~~~~~~~~~~~~~~~~~~~~~~~~1232../../deps/v8/include/v8-profiler.h:1128:27: warning: 'v8::HeapProfiler::HeapSnapshotOptions::global_object_name_resolver' is deprecated: Use context_name_resolver callback instead. [-Wdeprecated-declarations]1233 1128 | HeapSnapshotOptions() {}1234 | ^1235../../deps/v8/include/v8-profiler.h:1142:25: note: declared here1236 1142 | ObjectNameResolver* global_object_name_resolver = nullptr;1237 | ^~~~~~~~~~~~~~~~~~~~~~~~~~~1238[192/1871] CXX obj/src/node_base.node_blob.o1239In file included from ../../src/memory_tracker.h:6,1240 from ../../src/base_object.h:29,1241 from ../../src/async_wrap.h:27,1242 from ../../src/node_blob.h:8,1243 from ../../src/node_blob.cc:1:1244../../deps/v8/include/v8-profiler.h: In constructor 'v8::HeapProfiler::HeapSnapshotOptions::HeapSnapshotOptions()':1245../../deps/v8/include/v8-profiler.h:1128:27: warning: 'v8::HeapProfiler::HeapSnapshotOptions::global_object_name_resolver' is deprecated: Use context_name_resolver callback instead. [-Wdeprecated-declarations]1246 1128 | HeapSnapshotOptions() {}1247 | ^1248../../deps/v8/include/v8-profiler.h:1142:25: note: declared here1249 1142 | ObjectNameResolver* global_object_name_resolver = nullptr;1250 | ^~~~~~~~~~~~~~~~~~~~~~~~~~~1251../../deps/v8/include/v8-profiler.h:1128:27: warning: 'v8::HeapProfiler::HeapSnapshotOptions::global_object_name_resolver' is deprecated: Use context_name_resolver callback instead. [-Wdeprecated-declarations]1252 1128 | HeapSnapshotOptions() {}1253 | ^1254../../deps/v8/include/v8-profiler.h:1142:25: note: declared here1255 1142 | ObjectNameResolver* global_object_name_resolver = nullptr;1256 | ^~~~~~~~~~~~~~~~~~~~~~~~~~~1257[193/1871] CXX obj/src/node_base.node_binding.o1258In file included from ../../src/memory_tracker.h:6,1259 from ../../src/aliased_buffer.h:7,1260 from ../../src/aliased_buffer-inl.h:6,1261 from ../../src/env-inl.h:27,1262 from ../../src/node_binding.cc:3:1263../../deps/v8/include/v8-profiler.h: In constructor 'v8::HeapProfiler::HeapSnapshotOptions::HeapSnapshotOptions()':1264../../deps/v8/include/v8-profiler.h:1128:27: warning: 'v8::HeapProfiler::HeapSnapshotOptions::global_object_name_resolver' is deprecated: Use context_name_resolver callback instead. [-Wdeprecated-declarations]1265 1128 | HeapSnapshotOptions() {}1266 | ^1267../../deps/v8/include/v8-profiler.h:1142:25: note: declared here1268 1142 | ObjectNameResolver* global_object_name_resolver = nullptr;1269 | ^~~~~~~~~~~~~~~~~~~~~~~~~~~1270../../deps/v8/include/v8-profiler.h:1128:27: warning: 'v8::HeapProfiler::HeapSnapshotOptions::global_object_name_resolver' is deprecated: Use context_name_resolver callback instead. [-Wdeprecated-declarations]1271 1128 | HeapSnapshotOptions() {}1272 | ^1273../../deps/v8/include/v8-profiler.h:1142:25: note: declared here1274 1142 | ObjectNameResolver* global_object_name_resolver = nullptr;1275 | ^~~~~~~~~~~~~~~~~~~~~~~~~~~1276[194/1871] CXX obj/src/node_base.node_external_reference.o1277In file included from ../../src/memory_tracker.h:6,1278 from ../../src/base_object.h:29,1279 from ../../src/base_object-inl.h:27,1280 from ../../src/node_external_reference.cc:4:1281../../deps/v8/include/v8-profiler.h: In constructor 'v8::HeapProfiler::HeapSnapshotOptions::HeapSnapshotOptions()':1282../../deps/v8/include/v8-profiler.h:1128:27: warning: 'v8::HeapProfiler::HeapSnapshotOptions::global_object_name_resolver' is deprecated: Use context_name_resolver callback instead. [-Wdeprecated-declarations]1283 1128 | HeapSnapshotOptions() {}1284 | ^1285../../deps/v8/include/v8-profiler.h:1142:25: note: declared here1286 1142 | ObjectNameResolver* global_object_name_resolver = nullptr;1287 | ^~~~~~~~~~~~~~~~~~~~~~~~~~~1288../../deps/v8/include/v8-profiler.h:1128:27: warning: 'v8::HeapProfiler::HeapSnapshotOptions::global_object_name_resolver' is deprecated: Use context_name_resolver callback instead. [-Wdeprecated-declarations]1289 1128 | HeapSnapshotOptions() {}1290 | ^1291../../deps/v8/include/v8-profiler.h:1142:25: note: declared here1292 1142 | ObjectNameResolver* global_object_name_resolver = nullptr;1293 | ^~~~~~~~~~~~~~~~~~~~~~~~~~~1294[195/1871] CXX obj/src/node_base.node_http_parser.o1295In file included from ../../src/util.h:29,1296 from ../../src/node_http_parser.cc:24:1297../../deps/v8/include/v8-profiler.h: In constructor 'v8::HeapProfiler::HeapSnapshotOptions::HeapSnapshotOptions()':1298../../deps/v8/include/v8-profiler.h:1128:27: warning: 'v8::HeapProfiler::HeapSnapshotOptions::global_object_name_resolver' is deprecated: Use context_name_resolver callback instead. [-Wdeprecated-declarations]1299 1128 | HeapSnapshotOptions() {}1300 | ^1301../../deps/v8/include/v8-profiler.h:1142:25: note: declared here1302 1142 | ObjectNameResolver* global_object_name_resolver = nullptr;1303 | ^~~~~~~~~~~~~~~~~~~~~~~~~~~1304../../deps/v8/include/v8-profiler.h:1128:27: warning: 'v8::HeapProfiler::HeapSnapshotOptions::global_object_name_resolver' is deprecated: Use context_name_resolver callback instead. [-Wdeprecated-declarations]1305 1128 | HeapSnapshotOptions() {}1306 | ^1307../../deps/v8/include/v8-profiler.h:1142:25: note: declared here1308 1142 | ObjectNameResolver* global_object_name_resolver = nullptr;1309 | ^~~~~~~~~~~~~~~~~~~~~~~~~~~1310[196/1871] CXX obj/src/node_base.node_buffer.o1311In file included from ../../src/memory_tracker.h:6,1312 from ../../src/base_object.h:29,1313 from ../../src/async_wrap.h:27,1314 from ../../src/node_blob.h:8,1315 from ../../src/node_buffer.cc:24:1316../../deps/v8/include/v8-profiler.h: In constructor 'v8::HeapProfiler::HeapSnapshotOptions::HeapSnapshotOptions()':1317../../deps/v8/include/v8-profiler.h:1128:27: warning: 'v8::HeapProfiler::HeapSnapshotOptions::global_object_name_resolver' is deprecated: Use context_name_resolver callback instead. [-Wdeprecated-declarations]1318 1128 | HeapSnapshotOptions() {}1319 | ^1320../../deps/v8/include/v8-profiler.h:1142:25: note: declared here1321 1142 | ObjectNameResolver* global_object_name_resolver = nullptr;1322 | ^~~~~~~~~~~~~~~~~~~~~~~~~~~1323../../deps/v8/include/v8-profiler.h:1128:27: warning: 'v8::HeapProfiler::HeapSnapshotOptions::global_object_name_resolver' is deprecated: Use context_name_resolver callback instead. [-Wdeprecated-declarations]1324 1128 | HeapSnapshotOptions() {}1325 | ^1326../../deps/v8/include/v8-profiler.h:1142:25: note: declared here1327 1142 | ObjectNameResolver* global_object_name_resolver = nullptr;1328 | ^~~~~~~~~~~~~~~~~~~~~~~~~~~1329[197/1871] CXX obj/src/node_base.node_errors.o1330In file included from ../../src/memory_tracker.h:6,1331 from ../../src/base_object.h:29,1332 from ../../src/async_wrap.h:27,1333 from ../../src/debug_utils.h:6,1334 from ../../src/debug_utils-inl.h:6,1335 from ../../src/node_errors.cc:6:1336../../deps/v8/include/v8-profiler.h: In constructor 'v8::HeapProfiler::HeapSnapshotOptions::HeapSnapshotOptions()':1337../../deps/v8/include/v8-profiler.h:1128:27: warning: 'v8::HeapProfiler::HeapSnapshotOptions::global_object_name_resolver' is deprecated: Use context_name_resolver callback instead. [-Wdeprecated-declarations]1338 1128 | HeapSnapshotOptions() {}1339 | ^1340../../deps/v8/include/v8-profiler.h:1142:25: note: declared here1341 1142 | ObjectNameResolver* global_object_name_resolver = nullptr;1342 | ^~~~~~~~~~~~~~~~~~~~~~~~~~~1343../../deps/v8/include/v8-profiler.h:1128:27: warning: 'v8::HeapProfiler::HeapSnapshotOptions::global_object_name_resolver' is deprecated: Use context_name_resolver callback instead. [-Wdeprecated-declarations]1344 1128 | HeapSnapshotOptions() {}1345 | ^1346../../deps/v8/include/v8-profiler.h:1142:25: note: declared here1347 1142 | ObjectNameResolver* global_object_name_resolver = nullptr;1348 | ^~~~~~~~~~~~~~~~~~~~~~~~~~~1349[198/1871] CXX obj/src/node_base.node_profiling.o1350In file included from ../../src/node_profiling.h:6,1351 from ../../src/node_profiling.cc:1:1352../../deps/v8/include/v8-profiler.h: In constructor 'v8::HeapProfiler::HeapSnapshotOptions::HeapSnapshotOptions()':1353../../deps/v8/include/v8-profiler.h:1128:27: warning: 'v8::HeapProfiler::HeapSnapshotOptions::global_object_name_resolver' is deprecated: Use context_name_resolver callback instead. [-Wdeprecated-declarations]1354 1128 | HeapSnapshotOptions() {}1355 | ^1356../../deps/v8/include/v8-profiler.h:1142:25: note: declared here1357 1142 | ObjectNameResolver* global_object_name_resolver = nullptr;1358 | ^~~~~~~~~~~~~~~~~~~~~~~~~~~1359../../deps/v8/include/v8-profiler.h:1128:27: warning: 'v8::HeapProfiler::HeapSnapshotOptions::global_object_name_resolver' is deprecated: Use context_name_resolver callback instead. [-Wdeprecated-declarations]1360 1128 | HeapSnapshotOptions() {}1361 | ^1362../../deps/v8/include/v8-profiler.h:1142:25: note: declared here1363 1142 | ObjectNameResolver* global_object_name_resolver = nullptr;1364 | ^~~~~~~~~~~~~~~~~~~~~~~~~~~1365[199/1871] CXX obj/deps/v8/src/torque/torque_base.implementation-visitor.o1366[200/1871] AR obj/tools/v8_gypfiles/libtorque_base.a1367[201/1871] STAMP obj/tools/v8_gypfiles/torque.actions_depends.stamp1368[202/1871] CXX obj/src/node_base.node_builtins.o1369In file included from ../../src/util.h:29,1370 from ../../src/node_mutex.h:6,1371 from ../../src/node_builtins.h:16,1372 from ../../src/node_builtins.cc:1:1373../../deps/v8/include/v8-profiler.h: In constructor 'v8::HeapProfiler::HeapSnapshotOptions::HeapSnapshotOptions()':1374../../deps/v8/include/v8-profiler.h:1128:27: warning: 'v8::HeapProfiler::HeapSnapshotOptions::global_object_name_resolver' is deprecated: Use context_name_resolver callback instead. [-Wdeprecated-declarations]1375 1128 | HeapSnapshotOptions() {}1376 | ^1377../../deps/v8/include/v8-profiler.h:1142:25: note: declared here1378 1142 | ObjectNameResolver* global_object_name_resolver = nullptr;1379 | ^~~~~~~~~~~~~~~~~~~~~~~~~~~1380../../deps/v8/include/v8-profiler.h:1128:27: warning: 'v8::HeapProfiler::HeapSnapshotOptions::global_object_name_resolver' is deprecated: Use context_name_resolver callback instead. [-Wdeprecated-declarations]1381 1128 | HeapSnapshotOptions() {}1382 | ^1383../../deps/v8/include/v8-profiler.h:1142:25: note: declared here1384 1142 | ObjectNameResolver* global_object_name_resolver = nullptr;1385 | ^~~~~~~~~~~~~~~~~~~~~~~~~~~1386[203/1871] LINK torque1387[204/1871] CXX obj/deps/v8/third_party/simdutf/simdutf.simdutf.o1388[205/1871] AR obj/tools/v8_gypfiles/libsimdutf.a1389[206/1871] CXX obj/src/node_base.node_i18n.o1390In file included from ../../src/memory_tracker.h:6,1391 from ../../src/base_object.h:29,1392 from ../../src/node_i18n.h:29,1393 from ../../src/node_i18n.cc:43:1394../../deps/v8/include/v8-profiler.h: In constructor 'v8::HeapProfiler::HeapSnapshotOptions::HeapSnapshotOptions()':1395../../deps/v8/include/v8-profiler.h:1128:27: warning: 'v8::HeapProfiler::HeapSnapshotOptions::global_object_name_resolver' is deprecated: Use context_name_resolver callback instead. [-Wdeprecated-declarations]1396 1128 | HeapSnapshotOptions() {}1397 | ^1398../../deps/v8/include/v8-profiler.h:1142:25: note: declared here1399 1142 | ObjectNameResolver* global_object_name_resolver = nullptr;1400 | ^~~~~~~~~~~~~~~~~~~~~~~~~~~1401../../deps/v8/include/v8-profiler.h:1128:27: warning: 'v8::HeapProfiler::HeapSnapshotOptions::global_object_name_resolver' is deprecated: Use context_name_resolver callback instead. [-Wdeprecated-declarations]1402 1128 | HeapSnapshotOptions() {}1403 | ^1404../../deps/v8/include/v8-profiler.h:1142:25: note: declared here1405 1142 | ObjectNameResolver* global_object_name_resolver = nullptr;1406 | ^~~~~~~~~~~~~~~~~~~~~~~~~~~1407[207/1871] CXX obj/src/node_base.node_ipc_serdes.o1408In file included from ../../src/memory_tracker.h:6,1409 from ../../src/aliased_buffer.h:7,1410 from ../../src/aliased_buffer-inl.h:6,1411 from ../../src/env-inl.h:27,1412 from ../../src/node_ipc_serdes.cc:1:1413../../deps/v8/include/v8-profiler.h: In constructor 'v8::HeapProfiler::HeapSnapshotOptions::HeapSnapshotOptions()':1414../../deps/v8/include/v8-profiler.h:1128:27: warning: 'v8::HeapProfiler::HeapSnapshotOptions::global_object_name_resolver' is deprecated: Use context_name_resolver callback instead. [-Wdeprecated-declarations]1415 1128 | HeapSnapshotOptions() {}1416 | ^1417../../deps/v8/include/v8-profiler.h:1142:25: note: declared here1418 1142 | ObjectNameResolver* global_object_name_resolver = nullptr;1419 | ^~~~~~~~~~~~~~~~~~~~~~~~~~~1420../../deps/v8/include/v8-profiler.h:1128:27: warning: 'v8::HeapProfiler::HeapSnapshotOptions::global_object_name_resolver' is deprecated: Use context_name_resolver callback instead. [-Wdeprecated-declarations]1421 1128 | HeapSnapshotOptions() {}1422 | ^1423../../deps/v8/include/v8-profiler.h:1142:25: note: declared here1424 1142 | ObjectNameResolver* global_object_name_resolver = nullptr;1425 | ^~~~~~~~~~~~~~~~~~~~~~~~~~~1426[208/1871] CXX obj/src/node_base.node_contextify.o1427In file included from ../../src/memory_tracker.h:6,1428 from ../../src/base_object.h:29,1429 from ../../src/base_object-inl.h:27,1430 from ../../src/node_contextify.h:6,1431 from ../../src/node_contextify.cc:22:1432../../deps/v8/include/v8-profiler.h: In constructor 'v8::HeapProfiler::HeapSnapshotOptions::HeapSnapshotOptions()':1433../../deps/v8/include/v8-profiler.h:1128:27: warning: 'v8::HeapProfiler::HeapSnapshotOptions::global_object_name_resolver' is deprecated: Use context_name_resolver callback instead. [-Wdeprecated-declarations]1434 1128 | HeapSnapshotOptions() {}1435 | ^1436../../deps/v8/include/v8-profiler.h:1142:25: note: declared here1437 1142 | ObjectNameResolver* global_object_name_resolver = nullptr;1438 | ^~~~~~~~~~~~~~~~~~~~~~~~~~~1439../../deps/v8/include/v8-profiler.h:1128:27: warning: 'v8::HeapProfiler::HeapSnapshotOptions::global_object_name_resolver' is deprecated: Use context_name_resolver callback instead. [-Wdeprecated-declarations]1440 1128 | HeapSnapshotOptions() {}1441 | ^1442../../deps/v8/include/v8-profiler.h:1142:25: note: declared here1443 1142 | ObjectNameResolver* global_object_name_resolver = nullptr;1444 | ^~~~~~~~~~~~~~~~~~~~~~~~~~~1445[209/1871] CXX obj/src/node_base.node_main_instance.o1446In file included from ../../src/util.h:29,1447 from ../../src/node_main_instance.h:11,1448 from ../../src/node_main_instance.cc:1:1449../../deps/v8/include/v8-profiler.h: In constructor 'v8::HeapProfiler::HeapSnapshotOptions::HeapSnapshotOptions()':1450../../deps/v8/include/v8-profiler.h:1128:27: warning: 'v8::HeapProfiler::HeapSnapshotOptions::global_object_name_resolver' is deprecated: Use context_name_resolver callback instead. [-Wdeprecated-declarations]1451 1128 | HeapSnapshotOptions() {}1452 | ^1453../../deps/v8/include/v8-profiler.h:1142:25: note: declared here1454 1142 | ObjectNameResolver* global_object_name_resolver = nullptr;1455 | ^~~~~~~~~~~~~~~~~~~~~~~~~~~1456../../deps/v8/include/v8-profiler.h:1128:27: warning: 'v8::HeapProfiler::HeapSnapshotOptions::global_object_name_resolver' is deprecated: Use context_name_resolver callback instead. [-Wdeprecated-declarations]1457 1128 | HeapSnapshotOptions() {}1458 | ^1459../../deps/v8/include/v8-profiler.h:1142:25: note: declared here1460 1142 | ObjectNameResolver* global_object_name_resolver = nullptr;1461 | ^~~~~~~~~~~~~~~~~~~~~~~~~~~1462[210/1871] CXX obj/src/node_base.node_metadata.o1463In file included from ../../src/util.h:29,1464 from ../../src/node_metadata.cc:22:1465../../deps/v8/include/v8-profiler.h: In constructor 'v8::HeapProfiler::HeapSnapshotOptions::HeapSnapshotOptions()':1466../../deps/v8/include/v8-profiler.h:1128:27: warning: 'v8::HeapProfiler::HeapSnapshotOptions::global_object_name_resolver' is deprecated: Use context_name_resolver callback instead. [-Wdeprecated-declarations]1467 1128 | HeapSnapshotOptions() {}1468 | ^1469../../deps/v8/include/v8-profiler.h:1142:25: note: declared here1470 1142 | ObjectNameResolver* global_object_name_resolver = nullptr;1471 | ^~~~~~~~~~~~~~~~~~~~~~~~~~~1472../../deps/v8/include/v8-profiler.h:1128:27: warning: 'v8::HeapProfiler::HeapSnapshotOptions::global_object_name_resolver' is deprecated: Use context_name_resolver callback instead. [-Wdeprecated-declarations]1473 1128 | HeapSnapshotOptions() {}1474 | ^1475../../deps/v8/include/v8-profiler.h:1142:25: note: declared here1476 1142 | ObjectNameResolver* global_object_name_resolver = nullptr;1477 | ^~~~~~~~~~~~~~~~~~~~~~~~~~~1478[211/1871] CXX obj/src/node_base.node_locks.o1479In file included from ../../src/memory_tracker.h:6,1480 from ../../src/base_object.h:29,1481 from ../../src/node_locks.h:11,1482 from ../../src/node_locks.cc:1:1483../../deps/v8/include/v8-profiler.h: In constructor 'v8::HeapProfiler::HeapSnapshotOptions::HeapSnapshotOptions()':1484../../deps/v8/include/v8-profiler.h:1128:27: warning: 'v8::HeapProfiler::HeapSnapshotOptions::global_object_name_resolver' is deprecated: Use context_name_resolver callback instead. [-Wdeprecated-declarations]1485 1128 | HeapSnapshotOptions() {}1486 | ^1487../../deps/v8/include/v8-profiler.h:1142:25: note: declared here1488 1142 | ObjectNameResolver* global_object_name_resolver = nullptr;1489 | ^~~~~~~~~~~~~~~~~~~~~~~~~~~1490../../deps/v8/include/v8-profiler.h:1128:27: warning: 'v8::HeapProfiler::HeapSnapshotOptions::global_object_name_resolver' is deprecated: Use context_name_resolver callback instead. [-Wdeprecated-declarations]1491 1128 | HeapSnapshotOptions() {}1492 | ^1493../../deps/v8/include/v8-profiler.h:1142:25: note: declared here1494 1142 | ObjectNameResolver* global_object_name_resolver = nullptr;1495 | ^~~~~~~~~~~~~~~~~~~~~~~~~~~1496[212/1871] CXX obj/src/node_base.node_diagnostics_channel.o1497In file included from ../../src/memory_tracker.h:6,1498 from ../../src/aliased_buffer.h:7,1499 from ../../src/node_diagnostics_channel.h:11,1500 from ../../src/node_diagnostics_channel.cc:1:1501../../deps/v8/include/v8-profiler.h: In constructor 'v8::HeapProfiler::HeapSnapshotOptions::HeapSnapshotOptions()':1502../../deps/v8/include/v8-profiler.h:1128:27: warning: 'v8::HeapProfiler::HeapSnapshotOptions::global_object_name_resolver' is deprecated: Use context_name_resolver callback instead. [-Wdeprecated-declarations]1503 1128 | HeapSnapshotOptions() {}1504 | ^1505../../deps/v8/include/v8-profiler.h:1142:25: note: declared here1506 1142 | ObjectNameResolver* global_object_name_resolver = nullptr;1507 | ^~~~~~~~~~~~~~~~~~~~~~~~~~~1508../../deps/v8/include/v8-profiler.h:1128:27: warning: 'v8::HeapProfiler::HeapSnapshotOptions::global_object_name_resolver' is deprecated: Use context_name_resolver callback instead. [-Wdeprecated-declarations]1509 1128 | HeapSnapshotOptions() {}1510 | ^1511../../deps/v8/include/v8-profiler.h:1142:25: note: declared here1512 1142 | ObjectNameResolver* global_object_name_resolver = nullptr;1513 | ^~~~~~~~~~~~~~~~~~~~~~~~~~~1514[213/1871] CXX obj/src/node_base.env.o1515In file included from ../../src/memory_tracker.h:6,1516 from ../../src/aliased_buffer.h:7,1517 from ../../src/env.h:27,1518 from ../../src/env.cc:1:1519../../deps/v8/include/v8-profiler.h: In constructor 'v8::HeapProfiler::HeapSnapshotOptions::HeapSnapshotOptions()':1520../../deps/v8/include/v8-profiler.h:1128:27: warning: 'v8::HeapProfiler::HeapSnapshotOptions::global_object_name_resolver' is deprecated: Use context_name_resolver callback instead. [-Wdeprecated-declarations]1521 1128 | HeapSnapshotOptions() {}1522 | ^1523../../deps/v8/include/v8-profiler.h:1142:25: note: declared here1524 1142 | ObjectNameResolver* global_object_name_resolver = nullptr;1525 | ^~~~~~~~~~~~~~~~~~~~~~~~~~~1526../../deps/v8/include/v8-profiler.h:1128:27: warning: 'v8::HeapProfiler::HeapSnapshotOptions::global_object_name_resolver' is deprecated: Use context_name_resolver callback instead. [-Wdeprecated-declarations]1527 1128 | HeapSnapshotOptions() {}1528 | ^1529../../deps/v8/include/v8-profiler.h:1142:25: note: declared here1530 1142 | ObjectNameResolver* global_object_name_resolver = nullptr;1531 | ^~~~~~~~~~~~~~~~~~~~~~~~~~~1532[214/1871] CXX obj/src/node_base.node_perf.o1533In file included from ../../src/memory_tracker.h:6,1534 from ../../src/base_object.h:29,1535 from ../../src/base_object-inl.h:27,1536 from ../../src/node_perf.h:6,1537 from ../../src/node_perf.cc:1:1538../../deps/v8/include/v8-profiler.h: In constructor 'v8::HeapProfiler::HeapSnapshotOptions::HeapSnapshotOptions()':1539../../deps/v8/include/v8-profiler.h:1128:27: warning: 'v8::HeapProfiler::HeapSnapshotOptions::global_object_name_resolver' is deprecated: Use context_name_resolver callback instead. [-Wdeprecated-declarations]1540 1128 | HeapSnapshotOptions() {}1541 | ^1542../../deps/v8/include/v8-profiler.h:1142:25: note: declared here1543 1142 | ObjectNameResolver* global_object_name_resolver = nullptr;1544 | ^~~~~~~~~~~~~~~~~~~~~~~~~~~1545../../deps/v8/include/v8-profiler.h:1128:27: warning: 'v8::HeapProfiler::HeapSnapshotOptions::global_object_name_resolver' is deprecated: Use context_name_resolver callback instead. [-Wdeprecated-declarations]1546 1128 | HeapSnapshotOptions() {}1547 | ^1548../../deps/v8/include/v8-profiler.h:1142:25: note: declared here1549 1142 | ObjectNameResolver* global_object_name_resolver = nullptr;1550 | ^~~~~~~~~~~~~~~~~~~~~~~~~~~1551[215/1871] CXX obj/src/node_base.node_os.o1552In file included from ../../src/memory_tracker.h:6,1553 from ../../src/aliased_buffer.h:7,1554 from ../../src/aliased_buffer-inl.h:6,1555 from ../../src/env-inl.h:27,1556 from ../../src/node_os.cc:22:1557../../deps/v8/include/v8-profiler.h: In constructor 'v8::HeapProfiler::HeapSnapshotOptions::HeapSnapshotOptions()':1558../../deps/v8/include/v8-profiler.h:1128:27: warning: 'v8::HeapProfiler::HeapSnapshotOptions::global_object_name_resolver' is deprecated: Use context_name_resolver callback instead. [-Wdeprecated-declarations]1559 1128 | HeapSnapshotOptions() {}1560 | ^1561../../deps/v8/include/v8-profiler.h:1142:25: note: declared here1562 1142 | ObjectNameResolver* global_object_name_resolver = nullptr;1563 | ^~~~~~~~~~~~~~~~~~~~~~~~~~~1564../../deps/v8/include/v8-profiler.h:1128:27: warning: 'v8::HeapProfiler::HeapSnapshotOptions::global_object_name_resolver' is deprecated: Use context_name_resolver callback instead. [-Wdeprecated-declarations]1565 1128 | HeapSnapshotOptions() {}1566 | ^1567../../deps/v8/include/v8-profiler.h:1142:25: note: declared here1568 1142 | ObjectNameResolver* global_object_name_resolver = nullptr;1569 | ^~~~~~~~~~~~~~~~~~~~~~~~~~~1570[216/1871] CXX obj/src/node_base.node_process_events.o1571In file included from ../../src/memory_tracker.h:6,1572 from ../../src/aliased_buffer.h:7,1573 from ../../src/aliased_buffer-inl.h:6,1574 from ../../src/env-inl.h:27,1575 from ../../src/node_process_events.cc:3:1576../../deps/v8/include/v8-profiler.h: In constructor 'v8::HeapProfiler::HeapSnapshotOptions::HeapSnapshotOptions()':1577../../deps/v8/include/v8-profiler.h:1128:27: warning: 'v8::HeapProfiler::HeapSnapshotOptions::global_object_name_resolver' is deprecated: Use context_name_resolver callback instead. [-Wdeprecated-declarations]1578 1128 | HeapSnapshotOptions() {}1579 | ^1580../../deps/v8/include/v8-profiler.h:1142:25: note: declared here1581 1142 | ObjectNameResolver* global_object_name_resolver = nullptr;1582 | ^~~~~~~~~~~~~~~~~~~~~~~~~~~1583../../deps/v8/include/v8-profiler.h:1128:27: warning: 'v8::HeapProfiler::HeapSnapshotOptions::global_object_name_resolver' is deprecated: Use context_name_resolver callback instead. [-Wdeprecated-declarations]1584 1128 | HeapSnapshotOptions() {}1585 | ^1586../../deps/v8/include/v8-profiler.h:1142:25: note: declared here1587 1142 | ObjectNameResolver* global_object_name_resolver = nullptr;1588 | ^~~~~~~~~~~~~~~~~~~~~~~~~~~1589[217/1871] CXX obj/src/node_base.node_postmortem_metadata.o1590In file included from ../../src/memory_tracker.h:6,1591 from ../../src/base_object.h:29,1592 from ../../src/base_object-inl.h:27,1593 from ../../src/node_postmortem_metadata.cc:1:1594../../deps/v8/include/v8-profiler.h: In constructor 'v8::HeapProfiler::HeapSnapshotOptions::HeapSnapshotOptions()':1595../../deps/v8/include/v8-profiler.h:1128:27: warning: 'v8::HeapProfiler::HeapSnapshotOptions::global_object_name_resolver' is deprecated: Use context_name_resolver callback instead. [-Wdeprecated-declarations]1596 1128 | HeapSnapshotOptions() {}1597 | ^1598../../deps/v8/include/v8-profiler.h:1142:25: note: declared here1599 1142 | ObjectNameResolver* global_object_name_resolver = nullptr;1600 | ^~~~~~~~~~~~~~~~~~~~~~~~~~~1601../../deps/v8/include/v8-profiler.h:1128:27: warning: 'v8::HeapProfiler::HeapSnapshotOptions::global_object_name_resolver' is deprecated: Use context_name_resolver callback instead. [-Wdeprecated-declarations]1602 1128 | HeapSnapshotOptions() {}1603 | ^1604../../deps/v8/include/v8-profiler.h:1142:25: note: declared here1605 1142 | ObjectNameResolver* global_object_name_resolver = nullptr;1606 | ^~~~~~~~~~~~~~~~~~~~~~~~~~~1607[218/1871] CXX obj/src/node_base.node_process_object.o1608In file included from ../../src/memory_tracker.h:6,1609 from ../../src/aliased_buffer.h:7,1610 from ../../src/aliased_buffer-inl.h:6,1611 from ../../src/env-inl.h:27,1612 from ../../src/node_process_object.cc:1:1613../../deps/v8/include/v8-profiler.h: In constructor 'v8::HeapProfiler::HeapSnapshotOptions::HeapSnapshotOptions()':1614../../deps/v8/include/v8-profiler.h:1128:27: warning: 'v8::HeapProfiler::HeapSnapshotOptions::global_object_name_resolver' is deprecated: Use context_name_resolver callback instead. [-Wdeprecated-declarations]1615 1128 | HeapSnapshotOptions() {}1616 | ^1617../../deps/v8/include/v8-profiler.h:1142:25: note: declared here1618 1142 | ObjectNameResolver* global_object_name_resolver = nullptr;1619 | ^~~~~~~~~~~~~~~~~~~~~~~~~~~1620../../deps/v8/include/v8-profiler.h:1128:27: warning: 'v8::HeapProfiler::HeapSnapshotOptions::global_object_name_resolver' is deprecated: Use context_name_resolver callback instead. [-Wdeprecated-declarations]1621 1128 | HeapSnapshotOptions() {}1622 | ^1623../../deps/v8/include/v8-profiler.h:1142:25: note: declared here1624 1142 | ObjectNameResolver* global_object_name_resolver = nullptr;1625 | ^~~~~~~~~~~~~~~~~~~~~~~~~~~1626[219/1871] CXX obj/src/node_base.node_platform.o1627In file included from ../../src/util.h:29,1628 from ../../src/node_mutex.h:6,1629 from ../../src/node_platform.h:15,1630 from ../../src/node_platform.cc:1:1631../../deps/v8/include/v8-profiler.h: In constructor 'v8::HeapProfiler::HeapSnapshotOptions::HeapSnapshotOptions()':1632../../deps/v8/include/v8-profiler.h:1128:27: warning: 'v8::HeapProfiler::HeapSnapshotOptions::global_object_name_resolver' is deprecated: Use context_name_resolver callback instead. [-Wdeprecated-declarations]1633 1128 | HeapSnapshotOptions() {}1634 | ^1635../../deps/v8/include/v8-profiler.h:1142:25: note: declared here1636 1142 | ObjectNameResolver* global_object_name_resolver = nullptr;1637 | ^~~~~~~~~~~~~~~~~~~~~~~~~~~1638../../deps/v8/include/v8-profiler.h:1128:27: warning: 'v8::HeapProfiler::HeapSnapshotOptions::global_object_name_resolver' is deprecated: Use context_name_resolver callback instead. [-Wdeprecated-declarations]1639 1128 | HeapSnapshotOptions() {}1640 | ^1641../../deps/v8/include/v8-profiler.h:1142:25: note: declared here1642 1142 | ObjectNameResolver* global_object_name_resolver = nullptr;1643 | ^~~~~~~~~~~~~~~~~~~~~~~~~~~1644[220/1871] CXX obj/src/node_base.node_messaging.o1645In file included from ../../src/memory_tracker.h:6,1646 from ../../src/aliased_buffer.h:7,1647 from ../../src/env.h:27,1648 from ../../src/node_messaging.h:6,1649 from ../../src/node_messaging.cc:1:1650../../deps/v8/include/v8-profiler.h: In constructor 'v8::HeapProfiler::HeapSnapshotOptions::HeapSnapshotOptions()':1651../../deps/v8/include/v8-profiler.h:1128:27: warning: 'v8::HeapProfiler::HeapSnapshotOptions::global_object_name_resolver' is deprecated: Use context_name_resolver callback instead. [-Wdeprecated-declarations]1652 1128 | HeapSnapshotOptions() {}1653 | ^1654../../deps/v8/include/v8-profiler.h:1142:25: note: declared here1655 1142 | ObjectNameResolver* global_object_name_resolver = nullptr;1656 | ^~~~~~~~~~~~~~~~~~~~~~~~~~~1657../../deps/v8/include/v8-profiler.h:1128:27: warning: 'v8::HeapProfiler::HeapSnapshotOptions::global_object_name_resolver' is deprecated: Use context_name_resolver callback instead. [-Wdeprecated-declarations]1658 1128 | HeapSnapshotOptions() {}1659 | ^1660../../deps/v8/include/v8-profiler.h:1142:25: note: declared here1661 1142 | ObjectNameResolver* global_object_name_resolver = nullptr;1662 | ^~~~~~~~~~~~~~~~~~~~~~~~~~~1663[221/1871] CXX obj/src/node_base.node_report_utils.o1664In file included from ../../src/memory_tracker.h:6,1665 from ../../src/aliased_buffer.h:7,1666 from ../../src/env.h:27,1667 from ../../src/node_internals.h:27,1668 from ../../src/node_report_utils.cc:2:1669../../deps/v8/include/v8-profiler.h: In constructor 'v8::HeapProfiler::HeapSnapshotOptions::HeapSnapshotOptions()':1670../../deps/v8/include/v8-profiler.h:1128:27: warning: 'v8::HeapProfiler::HeapSnapshotOptions::global_object_name_resolver' is deprecated: Use context_name_resolver callback instead. [-Wdeprecated-declarations]1671 1128 | HeapSnapshotOptions() {}1672 | ^1673../../deps/v8/include/v8-profiler.h:1142:25: note: declared here1674 1142 | ObjectNameResolver* global_object_name_resolver = nullptr;1675 | ^~~~~~~~~~~~~~~~~~~~~~~~~~~1676../../deps/v8/include/v8-profiler.h:1128:27: warning: 'v8::HeapProfiler::HeapSnapshotOptions::global_object_name_resolver' is deprecated: Use context_name_resolver callback instead. [-Wdeprecated-declarations]1677 1128 | HeapSnapshotOptions() {}1678 | ^1679../../deps/v8/include/v8-profiler.h:1142:25: note: declared here1680 1142 | ObjectNameResolver* global_object_name_resolver = nullptr;1681 | ^~~~~~~~~~~~~~~~~~~~~~~~~~~1682[222/1871] CXX obj/src/node_base.node_process_methods.o1683In file included from ../../src/memory_tracker.h:6,1684 from ../../src/base_object.h:29,1685 from ../../src/async_wrap.h:27,1686 from ../../src/async_wrap-inl.h:27,1687 from ../../src/node_process_methods.cc:1:1688../../deps/v8/include/v8-profiler.h: In constructor 'v8::HeapProfiler::HeapSnapshotOptions::HeapSnapshotOptions()':1689../../deps/v8/include/v8-profiler.h:1128:27: warning: 'v8::HeapProfiler::HeapSnapshotOptions::global_object_name_resolver' is deprecated: Use context_name_resolver callback instead. [-Wdeprecated-declarations]1690 1128 | HeapSnapshotOptions() {}1691 | ^1692../../deps/v8/include/v8-profiler.h:1142:25: note: declared here1693 1142 | ObjectNameResolver* global_object_name_resolver = nullptr;1694 | ^~~~~~~~~~~~~~~~~~~~~~~~~~~1695../../deps/v8/include/v8-profiler.h:1128:27: warning: 'v8::HeapProfiler::HeapSnapshotOptions::global_object_name_resolver' is deprecated: Use context_name_resolver callback instead. [-Wdeprecated-declarations]1696 1128 | HeapSnapshotOptions() {}1697 | ^1698../../deps/v8/include/v8-profiler.h:1142:25: note: declared here1699 1142 | ObjectNameResolver* global_object_name_resolver = nullptr;1700 | ^~~~~~~~~~~~~~~~~~~~~~~~~~~1701[223/1871] CXX obj/src/node_base.node_report.o1702In file included from ../../src/util.h:29,1703 from ../../src/node_report.h:9,1704 from ../../src/node_report.cc:1:1705../../deps/v8/include/v8-profiler.h: In constructor 'v8::HeapProfiler::HeapSnapshotOptions::HeapSnapshotOptions()':1706../../deps/v8/include/v8-profiler.h:1128:27: warning: 'v8::HeapProfiler::HeapSnapshotOptions::global_object_name_resolver' is deprecated: Use context_name_resolver callback instead. [-Wdeprecated-declarations]1707 1128 | HeapSnapshotOptions() {}1708 | ^1709../../deps/v8/include/v8-profiler.h:1142:25: note: declared here1710 1142 | ObjectNameResolver* global_object_name_resolver = nullptr;1711 | ^~~~~~~~~~~~~~~~~~~~~~~~~~~1712../../deps/v8/include/v8-profiler.h:1128:27: warning: 'v8::HeapProfiler::HeapSnapshotOptions::global_object_name_resolver' is deprecated: Use context_name_resolver callback instead. [-Wdeprecated-declarations]1713 1128 | HeapSnapshotOptions() {}1714 | ^1715../../deps/v8/include/v8-profiler.h:1142:25: note: declared here1716 1142 | ObjectNameResolver* global_object_name_resolver = nullptr;1717 | ^~~~~~~~~~~~~~~~~~~~~~~~~~~1718[224/1871] CXX obj/src/node_base.node_report_module.o1719In file included from ../../src/memory_tracker.h:6,1720 from ../../src/aliased_buffer.h:7,1721 from ../../src/env.h:27,1722 from ../../src/node_report_module.cc:1:1723../../deps/v8/include/v8-profiler.h: In constructor 'v8::HeapProfiler::HeapSnapshotOptions::HeapSnapshotOptions()':1724../../deps/v8/include/v8-profiler.h:1128:27: warning: 'v8::HeapProfiler::HeapSnapshotOptions::global_object_name_resolver' is deprecated: Use context_name_resolver callback instead. [-Wdeprecated-declarations]1725 1128 | HeapSnapshotOptions() {}1726 | ^1727../../deps/v8/include/v8-profiler.h:1142:25: note: declared here1728 1142 | ObjectNameResolver* global_object_name_resolver = nullptr;1729 | ^~~~~~~~~~~~~~~~~~~~~~~~~~~1730../../deps/v8/include/v8-profiler.h:1128:27: warning: 'v8::HeapProfiler::HeapSnapshotOptions::global_object_name_resolver' is deprecated: Use context_name_resolver callback instead. [-Wdeprecated-declarations]1731 1128 | HeapSnapshotOptions() {}1732 | ^1733../../deps/v8/include/v8-profiler.h:1142:25: note: declared here1734 1142 | ObjectNameResolver* global_object_name_resolver = nullptr;1735 | ^~~~~~~~~~~~~~~~~~~~~~~~~~~1736[225/1871] CXX obj/src/node_base.node_serdes.o1737In file included from ../../src/memory_tracker.h:6,1738 from ../../src/base_object.h:29,1739 from ../../src/base_object-inl.h:27,1740 from ../../src/node_serdes.cc:1:1741../../deps/v8/include/v8-profiler.h: In constructor 'v8::HeapProfiler::HeapSnapshotOptions::HeapSnapshotOptions()':1742../../deps/v8/include/v8-profiler.h:1128:27: warning: 'v8::HeapProfiler::HeapSnapshotOptions::global_object_name_resolver' is deprecated: Use context_name_resolver callback instead. [-Wdeprecated-declarations]1743 1128 | HeapSnapshotOptions() {}1744 | ^1745../../deps/v8/include/v8-profiler.h:1142:25: note: declared here1746 1142 | ObjectNameResolver* global_object_name_resolver = nullptr;1747 | ^~~~~~~~~~~~~~~~~~~~~~~~~~~1748../../deps/v8/include/v8-profiler.h:1128:27: warning: 'v8::HeapProfiler::HeapSnapshotOptions::global_object_name_resolver' is deprecated: Use context_name_resolver callback instead. [-Wdeprecated-declarations]1749 1128 | HeapSnapshotOptions() {}1750 | ^1751../../deps/v8/include/v8-profiler.h:1142:25: note: declared here1752 1142 | ObjectNameResolver* global_object_name_resolver = nullptr;1753 | ^~~~~~~~~~~~~~~~~~~~~~~~~~~1754[226/1871] CXX obj/src/node_base.node_modules.o1755In file included from ../../src/memory_tracker.h:6,1756 from ../../src/aliased_buffer.h:7,1757 from ../../src/node_snapshotable.h:7,1758 from ../../src/node_modules.h:7,1759 from ../../src/node_modules.cc:1:1760../../deps/v8/include/v8-profiler.h: In constructor 'v8::HeapProfiler::HeapSnapshotOptions::HeapSnapshotOptions()':1761../../deps/v8/include/v8-profiler.h:1128:27: warning: 'v8::HeapProfiler::HeapSnapshotOptions::global_object_name_resolver' is deprecated: Use context_name_resolver callback instead. [-Wdeprecated-declarations]1762 1128 | HeapSnapshotOptions() {}1763 | ^1764../../deps/v8/include/v8-profiler.h:1142:25: note: declared here1765 1142 | ObjectNameResolver* global_object_name_resolver = nullptr;1766 | ^~~~~~~~~~~~~~~~~~~~~~~~~~~1767../../deps/v8/include/v8-profiler.h:1128:27: warning: 'v8::HeapProfiler::HeapSnapshotOptions::global_object_name_resolver' is deprecated: Use context_name_resolver callback instead. [-Wdeprecated-declarations]1768 1128 | HeapSnapshotOptions() {}1769 | ^1770../../deps/v8/include/v8-profiler.h:1142:25: note: declared here1771 1142 | ObjectNameResolver* global_object_name_resolver = nullptr;1772 | ^~~~~~~~~~~~~~~~~~~~~~~~~~~1773[227/1871] CXX obj/src/node_base.node_realm.o1774In file included from ../../src/memory_tracker.h:6,1775 from ../../src/cleanup_queue.h:11,1776 from ../../src/node_realm.h:8,1777 from ../../src/node_realm.cc:1:1778../../deps/v8/include/v8-profiler.h: In constructor 'v8::HeapProfiler::HeapSnapshotOptions::HeapSnapshotOptions()':1779../../deps/v8/include/v8-profiler.h:1128:27: warning: 'v8::HeapProfiler::HeapSnapshotOptions::global_object_name_resolver' is deprecated: Use context_name_resolver callback instead. [-Wdeprecated-declarations]1780 1128 | HeapSnapshotOptions() {}1781 | ^1782../../deps/v8/include/v8-profiler.h:1142:25: note: declared here1783 1142 | ObjectNameResolver* global_object_name_resolver = nullptr;1784 | ^~~~~~~~~~~~~~~~~~~~~~~~~~~1785../../deps/v8/include/v8-profiler.h:1128:27: warning: 'v8::HeapProfiler::HeapSnapshotOptions::global_object_name_resolver' is deprecated: Use context_name_resolver callback instead. [-Wdeprecated-declarations]1786 1128 | HeapSnapshotOptions() {}1787 | ^1788../../deps/v8/include/v8-profiler.h:1142:25: note: declared here1789 1142 | ObjectNameResolver* global_object_name_resolver = nullptr;1790 | ^~~~~~~~~~~~~~~~~~~~~~~~~~~1791[228/1871] CXX obj/src/node_base.node_shadow_realm.o1792In file included from ../../src/memory_tracker.h:6,1793 from ../../src/cleanup_queue.h:11,1794 from ../../src/node_realm.h:8,1795 from ../../src/node_shadow_realm.h:6,1796 from ../../src/node_shadow_realm.cc:1:1797../../deps/v8/include/v8-profiler.h: In constructor 'v8::HeapProfiler::HeapSnapshotOptions::HeapSnapshotOptions()':1798../../deps/v8/include/v8-profiler.h:1128:27: warning: 'v8::HeapProfiler::HeapSnapshotOptions::global_object_name_resolver' is deprecated: Use context_name_resolver callback instead. [-Wdeprecated-declarations]1799 1128 | HeapSnapshotOptions() {}1800 | ^1801../../deps/v8/include/v8-profiler.h:1142:25: note: declared here1802 1142 | ObjectNameResolver* global_object_name_resolver = nullptr;1803 | ^~~~~~~~~~~~~~~~~~~~~~~~~~~1804../../deps/v8/include/v8-profiler.h:1128:27: warning: 'v8::HeapProfiler::HeapSnapshotOptions::global_object_name_resolver' is deprecated: Use context_name_resolver callback instead. [-Wdeprecated-declarations]1805 1128 | HeapSnapshotOptions() {}1806 | ^1807../../deps/v8/include/v8-profiler.h:1142:25: note: declared here1808 1142 | ObjectNameResolver* global_object_name_resolver = nullptr;1809 | ^~~~~~~~~~~~~~~~~~~~~~~~~~~1810[229/1871] CXX obj/src/node_base.node_http2.o1811In file included from ../../src/memory_tracker.h:6,1812 from ../../src/aliased_buffer.h:7,1813 from ../../src/env.h:27,1814 from ../../src/node_http2.h:11,1815 from ../../src/node_http2.cc:1:1816../../deps/v8/include/v8-profiler.h: In constructor 'v8::HeapProfiler::HeapSnapshotOptions::HeapSnapshotOptions()':1817../../deps/v8/include/v8-profiler.h:1128:27: warning: 'v8::HeapProfiler::HeapSnapshotOptions::global_object_name_resolver' is deprecated: Use context_name_resolver callback instead. [-Wdeprecated-declarations]1818 1128 | HeapSnapshotOptions() {}1819 | ^1820../../deps/v8/include/v8-profiler.h:1142:25: note: declared here1821 1142 | ObjectNameResolver* global_object_name_resolver = nullptr;1822 | ^~~~~~~~~~~~~~~~~~~~~~~~~~~1823../../deps/v8/include/v8-profiler.h:1128:27: warning: 'v8::HeapProfiler::HeapSnapshotOptions::global_object_name_resolver' is deprecated: Use context_name_resolver callback instead. [-Wdeprecated-declarations]1824 1128 | HeapSnapshotOptions() {}1825 | ^1826../../deps/v8/include/v8-profiler.h:1142:25: note: declared here1827 1142 | ObjectNameResolver* global_object_name_resolver = nullptr;1828 | ^~~~~~~~~~~~~~~~~~~~~~~~~~~1829[230/1871] CXX obj/src/node_base.node_task_queue.o1830In file included from ../../src/memory_tracker.h:6,1831 from ../../src/base_object.h:29,1832 from ../../src/async_wrap.h:27,1833 from ../../src/node_task_queue.cc:1:1834../../deps/v8/include/v8-profiler.h: In constructor 'v8::HeapProfiler::HeapSnapshotOptions::HeapSnapshotOptions()':1835../../deps/v8/include/v8-profiler.h:1128:27: warning: 'v8::HeapProfiler::HeapSnapshotOptions::global_object_name_resolver' is deprecated: Use context_name_resolver callback instead. [-Wdeprecated-declarations]1836 1128 | HeapSnapshotOptions() {}1837 | ^1838../../deps/v8/include/v8-profiler.h:1142:25: note: declared here1839 1142 | ObjectNameResolver* global_object_name_resolver = nullptr;1840 | ^~~~~~~~~~~~~~~~~~~~~~~~~~~1841../../deps/v8/include/v8-profiler.h:1128:27: warning: 'v8::HeapProfiler::HeapSnapshotOptions::global_object_name_resolver' is deprecated: Use context_name_resolver callback instead. [-Wdeprecated-declarations]1842 1128 | HeapSnapshotOptions() {}1843 | ^1844../../deps/v8/include/v8-profiler.h:1142:25: note: declared here1845 1142 | ObjectNameResolver* global_object_name_resolver = nullptr;1846 | ^~~~~~~~~~~~~~~~~~~~~~~~~~~1847[231/1871] CXX obj/src/node_base.node_stat_watcher.o1848In file included from ../../src/memory_tracker.h:6,1849 from ../../src/base_object.h:29,1850 from ../../src/async_wrap.h:27,1851 from ../../src/handle_wrap.h:27,1852 from ../../src/node_stat_watcher.h:28,1853 from ../../src/node_stat_watcher.cc:22:1854../../deps/v8/include/v8-profiler.h: In constructor 'v8::HeapProfiler::HeapSnapshotOptions::HeapSnapshotOptions()':1855../../deps/v8/include/v8-profiler.h:1128:27: warning: 'v8::HeapProfiler::HeapSnapshotOptions::global_object_name_resolver' is deprecated: Use context_name_resolver callback instead. [-Wdeprecated-declarations]1856 1128 | HeapSnapshotOptions() {}1857 | ^1858../../deps/v8/include/v8-profiler.h:1142:25: note: declared here1859 1142 | ObjectNameResolver* global_object_name_resolver = nullptr;1860 | ^~~~~~~~~~~~~~~~~~~~~~~~~~~1861../../deps/v8/include/v8-profiler.h:1128:27: warning: 'v8::HeapProfiler::HeapSnapshotOptions::global_object_name_resolver' is deprecated: Use context_name_resolver callback instead. [-Wdeprecated-declarations]1862 1128 | HeapSnapshotOptions() {}1863 | ^1864../../deps/v8/include/v8-profiler.h:1142:25: note: declared here1865 1142 | ObjectNameResolver* global_object_name_resolver = nullptr;1866 | ^~~~~~~~~~~~~~~~~~~~~~~~~~~1867[232/1871] CXX obj/src/node_base.node_symbols.o1868In file included from ../../src/memory_tracker.h:6,1869 from ../../src/aliased_buffer.h:7,1870 from ../../src/aliased_buffer-inl.h:6,1871 from ../../src/env-inl.h:27,1872 from ../../src/node_symbols.cc:1:1873../../deps/v8/include/v8-profiler.h: In constructor 'v8::HeapProfiler::HeapSnapshotOptions::HeapSnapshotOptions()':1874../../deps/v8/include/v8-profiler.h:1128:27: warning: 'v8::HeapProfiler::HeapSnapshotOptions::global_object_name_resolver' is deprecated: Use context_name_resolver callback instead. [-Wdeprecated-declarations]1875 1128 | HeapSnapshotOptions() {}1876 | ^1877../../deps/v8/include/v8-profiler.h:1142:25: note: declared here1878 1142 | ObjectNameResolver* global_object_name_resolver = nullptr;1879 | ^~~~~~~~~~~~~~~~~~~~~~~~~~~1880../../deps/v8/include/v8-profiler.h:1128:27: warning: 'v8::HeapProfiler::HeapSnapshotOptions::global_object_name_resolver' is deprecated: Use context_name_resolver callback instead. [-Wdeprecated-declarations]1881 1128 | HeapSnapshotOptions() {}1882 | ^1883../../deps/v8/include/v8-profiler.h:1142:25: note: declared here1884 1142 | ObjectNameResolver* global_object_name_resolver = nullptr;1885 | ^~~~~~~~~~~~~~~~~~~~~~~~~~~1886[233/1871] CXX obj/src/node_base.node_trace_events.o1887In file included from ../../src/memory_tracker.h:6,1888 from ../../src/base_object.h:29,1889 from ../../src/base_object-inl.h:27,1890 from ../../src/node_trace_events.cc:1:1891../../deps/v8/include/v8-profiler.h: In constructor 'v8::HeapProfiler::HeapSnapshotOptions::HeapSnapshotOptions()':1892../../deps/v8/include/v8-profiler.h:1128:27: warning: 'v8::HeapProfiler::HeapSnapshotOptions::global_object_name_resolver' is deprecated: Use context_name_resolver callback instead. [-Wdeprecated-declarations]1893 1128 | HeapSnapshotOptions() {}1894 | ^1895../../deps/v8/include/v8-profiler.h:1142:25: note: declared here1896 1142 | ObjectNameResolver* global_object_name_resolver = nullptr;1897 | ^~~~~~~~~~~~~~~~~~~~~~~~~~~1898../../deps/v8/include/v8-profiler.h:1128:27: warning: 'v8::HeapProfiler::HeapSnapshotOptions::global_object_name_resolver' is deprecated: Use context_name_resolver callback instead. [-Wdeprecated-declarations]1899 1128 | HeapSnapshotOptions() {}1900 | ^1901../../deps/v8/include/v8-profiler.h:1142:25: note: declared here1902 1142 | ObjectNameResolver* global_object_name_resolver = nullptr;1903 | ^~~~~~~~~~~~~~~~~~~~~~~~~~~1904[234/1871] CXX obj/src/node_base.node_file.o1905In file included from ../../src/memory_tracker.h:6,1906 from ../../src/aliased_buffer.h:7,1907 from ../../src/node_file.h:7,1908 from ../../src/node_file.cc:21:1909../../deps/v8/include/v8-profiler.h: In constructor 'v8::HeapProfiler::HeapSnapshotOptions::HeapSnapshotOptions()':1910../../deps/v8/include/v8-profiler.h:1128:27: warning: 'v8::HeapProfiler::HeapSnapshotOptions::global_object_name_resolver' is deprecated: Use context_name_resolver callback instead. [-Wdeprecated-declarations]1911 1128 | HeapSnapshotOptions() {}1912 | ^1913../../deps/v8/include/v8-profiler.h:1142:25: note: declared here1914 1142 | ObjectNameResolver* global_object_name_resolver = nullptr;1915 | ^~~~~~~~~~~~~~~~~~~~~~~~~~~1916../../deps/v8/include/v8-profiler.h:1128:27: warning: 'v8::HeapProfiler::HeapSnapshotOptions::global_object_name_resolver' is deprecated: Use context_name_resolver callback instead. [-Wdeprecated-declarations]1917 1128 | HeapSnapshotOptions() {}1918 | ^1919../../deps/v8/include/v8-profiler.h:1142:25: note: declared here1920 1142 | ObjectNameResolver* global_object_name_resolver = nullptr;1921 | ^~~~~~~~~~~~~~~~~~~~~~~~~~~1922[235/1871] CXX obj/src/node_base.node_types.o1923In file included from ../../src/memory_tracker.h:6,1924 from ../../src/aliased_buffer.h:7,1925 from ../../src/aliased_buffer-inl.h:6,1926 from ../../src/env-inl.h:27,1927 from ../../src/node_types.cc:1:1928../../deps/v8/include/v8-profiler.h: In constructor 'v8::HeapProfiler::HeapSnapshotOptions::HeapSnapshotOptions()':1929../../deps/v8/include/v8-profiler.h:1128:27: warning: 'v8::HeapProfiler::HeapSnapshotOptions::global_object_name_resolver' is deprecated: Use context_name_resolver callback instead. [-Wdeprecated-declarations]1930 1128 | HeapSnapshotOptions() {}1931 | ^1932../../deps/v8/include/v8-profiler.h:1142:25: note: declared here1933 1142 | ObjectNameResolver* global_object_name_resolver = nullptr;1934 | ^~~~~~~~~~~~~~~~~~~~~~~~~~~1935../../deps/v8/include/v8-profiler.h:1128:27: warning: 'v8::HeapProfiler::HeapSnapshotOptions::global_object_name_resolver' is deprecated: Use context_name_resolver callback instead. [-Wdeprecated-declarations]1936 1128 | HeapSnapshotOptions() {}1937 | ^1938../../deps/v8/include/v8-profiler.h:1142:25: note: declared here1939 1142 | ObjectNameResolver* global_object_name_resolver = nullptr;1940 | ^~~~~~~~~~~~~~~~~~~~~~~~~~~1941[236/1871] CXX obj/src/node_base.node_sockaddr.o1942In file included from ../../src/memory_tracker.h:6,1943 from ../../src/base_object.h:29,1944 from ../../src/node_sockaddr.h:6,1945 from ../../src/node_sockaddr.cc:1:1946../../deps/v8/include/v8-profiler.h: In constructor 'v8::HeapProfiler::HeapSnapshotOptions::HeapSnapshotOptions()':1947../../deps/v8/include/v8-profiler.h:1128:27: warning: 'v8::HeapProfiler::HeapSnapshotOptions::global_object_name_resolver' is deprecated: Use context_name_resolver callback instead. [-Wdeprecated-declarations]1948 1128 | HeapSnapshotOptions() {}1949 | ^1950../../deps/v8/include/v8-profiler.h:1142:25: note: declared here1951 1142 | ObjectNameResolver* global_object_name_resolver = nullptr;1952 | ^~~~~~~~~~~~~~~~~~~~~~~~~~~1953../../deps/v8/include/v8-profiler.h:1128:27: warning: 'v8::HeapProfiler::HeapSnapshotOptions::global_object_name_resolver' is deprecated: Use context_name_resolver callback instead. [-Wdeprecated-declarations]1954 1128 | HeapSnapshotOptions() {}1955 | ^1956../../deps/v8/include/v8-profiler.h:1142:25: note: declared here1957 1142 | ObjectNameResolver* global_object_name_resolver = nullptr;1958 | ^~~~~~~~~~~~~~~~~~~~~~~~~~~1959[237/1871] CXX obj/src/node_base.node_options.o1960In file included from ../../src/util.h:29,1961 from ../../src/node_mutex.h:6,1962 from ../../src/node_options.h:11,1963 from ../../src/node_options.cc:1:1964../../deps/v8/include/v8-profiler.h: In constructor 'v8::HeapProfiler::HeapSnapshotOptions::HeapSnapshotOptions()':1965../../deps/v8/include/v8-profiler.h:1128:27: warning: 'v8::HeapProfiler::HeapSnapshotOptions::global_object_name_resolver' is deprecated: Use context_name_resolver callback instead. [-Wdeprecated-declarations]1966 1128 | HeapSnapshotOptions() {}1967 | ^1968../../deps/v8/include/v8-profiler.h:1142:25: note: declared here1969 1142 | ObjectNameResolver* global_object_name_resolver = nullptr;1970 | ^~~~~~~~~~~~~~~~~~~~~~~~~~~1971../../deps/v8/include/v8-profiler.h:1128:27: warning: 'v8::HeapProfiler::HeapSnapshotOptions::global_object_name_resolver' is deprecated: Use context_name_resolver callback instead. [-Wdeprecated-declarations]1972 1128 | HeapSnapshotOptions() {}1973 | ^1974../../deps/v8/include/v8-profiler.h:1142:25: note: declared here1975 1142 | ObjectNameResolver* global_object_name_resolver = nullptr;1976 | ^~~~~~~~~~~~~~~~~~~~~~~~~~~1977[238/1871] CXX obj/src/node_base.node_sea.o1978In file included from ../../src/memory_tracker.h:6,1979 from ../../src/base_object.h:29,1980 from ../../src/async_wrap.h:27,1981 from ../../src/debug_utils.h:6,1982 from ../../src/debug_utils-inl.h:6,1983 from ../../src/blob_serializer_deserializer-inl.h:14,1984 from ../../src/node_sea.cc:3:1985../../deps/v8/include/v8-profiler.h: In constructor 'v8::HeapProfiler::HeapSnapshotOptions::HeapSnapshotOptions()':1986../../deps/v8/include/v8-profiler.h:1128:27: warning: 'v8::HeapProfiler::HeapSnapshotOptions::global_object_name_resolver' is deprecated: Use context_name_resolver callback instead. [-Wdeprecated-declarations]1987 1128 | HeapSnapshotOptions() {}1988 | ^1989../../deps/v8/include/v8-profiler.h:1142:25: note: declared here1990 1142 | ObjectNameResolver* global_object_name_resolver = nullptr;1991 | ^~~~~~~~~~~~~~~~~~~~~~~~~~~1992../../deps/v8/include/v8-profiler.h:1128:27: warning: 'v8::HeapProfiler::HeapSnapshotOptions::global_object_name_resolver' is deprecated: Use context_name_resolver callback instead. [-Wdeprecated-declarations]1993 1128 | HeapSnapshotOptions() {}1994 | ^1995../../deps/v8/include/v8-profiler.h:1142:25: note: declared here1996 1142 | ObjectNameResolver* global_object_name_resolver = nullptr;1997 | ^~~~~~~~~~~~~~~~~~~~~~~~~~~1998[239/1871] CXX obj/src/tracing/node_base.agent.o1999In file included from ../../src/util.h:29,2000 from ../../src/node_mutex.h:6,26278ok 5022 parallel/test-worker-onmessage26279 ---26280 duration_ms: 134.4980026281 ...26282ok 5023 parallel/test-worker-parent-port-ref26283 ---26284 duration_ms: 134.5180026285 ...26286ok 5024 parallel/test-worker-process-argv26287 ---26288 duration_ms: 134.5210026289 ...26290ok 5025 parallel/test-worker-nearheaplimit-deadlock26291 ---26292 duration_ms: 168.3380026293 ...26294ok 5026 parallel/test-worker-process-exit-async-module26295 ---26296 duration_ms: 108.0680026297 ...26298ok 5027 parallel/test-worker-ref26299 ---26300 duration_ms: 107.7850026301 ...26302ok 5028 parallel/test-worker-process-cwd26303 ---26304 duration_ms: 167.4840026305 ...26306ok 5029 parallel/test-worker-process-env-shared26307 ---26308 duration_ms: 135.2670026309 ...26310ok 5030 parallel/test-worker-relative-path-double-dot26311 ---26312 duration_ms: 107.9270026313 ...26314ok 5031 parallel/test-worker-ref-onexit26315 ---26316 duration_ms: 111.7680026317 ...26318ok 5032 parallel/test-worker-on-process-exit26319 ---26320 duration_ms: 209.9420026321 ...26322ok 5033 parallel/test-worker-safe-getters26323 ---26324 duration_ms: 108.3930026325 ...26326ok 5034 parallel/test-worker-sharedarraybuffer-from-worker-thread26327 ---26328 duration_ms: 108.4190026329 ...26330ok 5035 parallel/test-worker-relative-path26331 ---26332 duration_ms: 135.1010026333 ...26334ok 5036 parallel/test-worker-process-env26335 ---26336 duration_ms: 209.9770026337 ...26338ok 5037 parallel/test-worker-spec-differences26339 ---26340 duration_ms: 135.2400026341 ...26342ok 5038 parallel/test-worker-stack-overflow26343 ---26344 duration_ms: 136.3550026345 ...26346ok 5039 parallel/test-worker-node-options26347 ---26348 duration_ms: 261.9710026349 ...26350ok 5040 parallel/test-worker-stdio-flush26351 ---26352 duration_ms: 134.8830026353 ...26354ok 5041 parallel/test-worker-stdio-flush-inflight26355 ---26356 duration_ms: 134.8140026357 ...26358ok 5042 parallel/test-worker-stdio-from-preload-module26359 ---26360 duration_ms: 134.4450026361 ...26362ok 5043 parallel/test-worker-syntax-error-file26363 ---26364 duration_ms: 136.0950026365 ...26366ok 5044 parallel/test-worker-terminate-http2-respond-with-file26367 ---26368 duration_ms: 136.3660026369 ...26370ok 5045 parallel/test-worker-stdio26371 ---26372 duration_ms: 167.8290026373 ...26374ok 5046 parallel/test-worker-terminate-nested26375 ---26376 duration_ms: 134.2700026377 ...26378ok 5047 parallel/test-worker-syntax-error26379 ---26380 duration_ms: 169.5080026381 ...26382ok 5048 parallel/test-worker-terminate-microtask-loop26383 ---26384 duration_ms: 135.8710026385 ...26386ok 5049 parallel/test-worker-messaging26387 ---26388 duration_ms: 326.7620026389 ...26390ok 5050 parallel/test-worker-terminate-null-handler26391 ---26392 duration_ms: 135.2950026393 ...26394ok 5051 parallel/test-worker-terminate-timers26395 ---26396 duration_ms: 108.4340026397 ...26398ok 5052 parallel/test-worker-type-check26399 ---26400 duration_ms: 86.6360026401 ...26402ok 5053 parallel/test-worker-terminate-unrefed26403 ---26404 duration_ms: 109.6720026405 ...26406ok 5054 parallel/test-worker-thread-name26407 ---26408 duration_ms: 107.7820026409 ...26410ok 5055 parallel/test-worker-terminate-ref-public-port26411 ---26412 duration_ms: 135.5470026413 ...26414ok 5056 parallel/test-worker-terminate-source-map26415 ---26416 duration_ms: 134.8090026417 ...26418ok 5057 parallel/test-worker-unsupported-eval-on-url26419 ---26420 duration_ms: 86.7720026421 ...26422ok 5058 parallel/test-worker-unsupported-path26423 ---26424 duration_ms: 86.8670026425 ...26426ok 5059 parallel/test-worker-track-unmanaged-fds26427 ---26428 duration_ms: 136.0670026429 ...26430ok 5060 parallel/test-worker-uncaught-exception26431 ---26432 duration_ms: 108.9390026433 ...26434ok 5061 parallel/test-worker-resource-limits26435 ---26436 duration_ms: 260.9070026437 ...26438ok 5062 parallel/test-worker-voluntarily-exit-followed-by-addition26439 ---26440 duration_ms: 107.8990026441 ...26442ok 5063 parallel/test-worker-stack-overflow-stack-size26443 ---26444 duration_ms: 261.4260026445 ...26446ok 5064 parallel/test-worker-uncaught-exception-async26447 ---26448 duration_ms: 134.7430026449 ...26450ok 5065 parallel/test-wrap-js-stream-duplex26451 ---26452 duration_ms: 87.3050026453 ...26454ok 5066 parallel/test-wrap-js-stream-destroy26455 ---26456 duration_ms: 88.5070026457 ...26458ok 5067 parallel/test-wrap-js-stream-exceptions26459 ---26460 duration_ms: 88.2770026461 ...26462ok 5068 parallel/test-wrap-js-stream-read-stop26463 ---26464 duration_ms: 86.4610026465 ...26466ok 5069 parallel/test-worker-voluntarily-exit-followed-by-throw26467 ---26468 duration_ms: 107.6910026469 ...26470ok 5070 parallel/test-worker-unsupported-things26471 ---26472 duration_ms: 134.5050026473 ...26474ok 5071 parallel/test-worker-workerdata-messageport26475 ---26476 duration_ms: 108.5350026477 ...26478ok 5072 parallel/test-zlib-brotli-flush26479 ---26480 duration_ms: 86.5000026481 ...26482ok 5073 parallel/test-zlib-brotli-flush-invalid-kind26483 ---26484 duration_ms: 86.6020026485 ...26486ok 5074 parallel/test-worker-vm-context-terminate26487 ---26488 duration_ms: 167.6080026489 ...26490ok 5075 parallel/test-zlib-brotli-dictionary26491 ---26492 duration_ms: 108.0850026493 ...26494ok 5076 parallel/test-worker-workerdata-sharedarraybuffer26495 ---26496 duration_ms: 136.5930026497 ...26498ok 5077 parallel/test-zlib-brotli-from-string26499 ---26500 duration_ms: 87.1510026501 ...26502ok 5078 parallel/test-zlib-brotli-kmaxlength-rangeerror26503 ---26504 duration_ms: 86.6830026505 ...26506ok 5079 parallel/test-zlib-brotli26507 ---26508 duration_ms: 134.3350026509 ...26510ok 5080 parallel/test-zlib-brotli-from-brotli26511 ---26512 duration_ms: 107.7760026513 ...26514ok 5081 parallel/test-worker-unref-from-message-during-exit26515 ---26516 duration_ms: 209.1190026517 ...26518ok 5082 parallel/test-zlib-close-after-error26519 ---26520 duration_ms: 108.0410026521 ...26522ok 5083 parallel/test-zlib-const26523 ---26524 duration_ms: 87.1880026525 ...26526ok 5084 parallel/test-zlib-crc3226527 ---26528 duration_ms: 87.5280026529 ...26530ok 5085 parallel/test-zlib-create-raw26531 ---26532 duration_ms: 87.1870026533 ...26534ok 5086 parallel/test-zlib-deflate-raw-inherits26535 ---26536 duration_ms: 86.9020026537 ...26538ok 5087 parallel/test-zlib-destroy26539 ---26540 duration_ms: 86.6870026541 ...26542ok 5088 parallel/test-zlib-close-after-write26543 ---26544 duration_ms: 108.4670026545 ...26546ok 5089 parallel/test-zlib-deflate-constructors26547 ---26548 duration_ms: 108.4270026549 ...26550ok 5090 parallel/test-zlib-dictionary26551 ---26552 duration_ms: 86.9260026553 ...26554ok 5091 parallel/test-zlib-dictionary-fail26555 ---26556 duration_ms: 86.6160026557 ...26558ok 5092 parallel/test-zlib-empty-buffer26559 ---26560 duration_ms: 86.9570026561 ...26562ok 5093 parallel/test-zlib-failed-init26563 ---26564 duration_ms: 86.7010026565 ...26566ok 5094 parallel/test-zlib-flush-drain26567 ---26568 duration_ms: 86.6720026569 ...26570ok 5095 parallel/test-zlib-flush-drain-longblock26571 ---26572 duration_ms: 86.6050026573 ...26574ok 5096 parallel/test-zlib-flush-flags26575 ---26576 duration_ms: 86.8200026577 ...26578ok 5097 parallel/test-zlib-destroy-pipe26579 ---26580 duration_ms: 134.1710026581 ...26582ok 5098 parallel/test-zlib-flush26583 ---26584 duration_ms: 107.9540026585 ...26586ok 5099 parallel/test-zlib-close-in-ondata26587 ---26588 duration_ms: 168.4140026589 ...26590ok 5100 parallel/test-zlib-flush-write-sync-interleaved26591 ---26592 duration_ms: 108.3150026593 ...26594ok 5101 parallel/test-zlib-invalid-input26595 ---26596 duration_ms: 86.9860026597 ...26598ok 5102 parallel/test-zlib-from-concatenated-gzip26599 ---26600 duration_ms: 107.7780026601 ...26602ok 5103 parallel/test-zlib-no-stream26603 ---26604 duration_ms: 56.4170026605 ...26606ok 5104 parallel/test-trace-events-http26607 ---26608 duration_ms: 4308.2170026609 ...26610ok 5105 parallel/test-zlib-kmaxlength-rangeerror26611 ---26612 duration_ms: 86.7720026613 ...26614ok 5106 parallel/test-zlib-from-gzip26615 ---26616 duration_ms: 108.0630026617 ...26618ok 5107 parallel/test-zlib-from-gzip-with-trailing-garbage26619 ---26620 duration_ms: 107.8710026621 ...26622ok 5108 parallel/test-zlib-invalid-arg-value-brotli-compress26623 ---26624 duration_ms: 107.7190026625 ...26626ok 5109 parallel/test-zlib-from-string26627 ---26628 duration_ms: 108.8530026629 ...26630ok 5110 parallel/test-zlib-negative-zero26631 ---26632 duration_ms: 86.5660026633 ...26634ok 5111 parallel/test-zlib-convenience-methods26635 ---26636 duration_ms: 210.1810026637 ...26638ok 5112 parallel/test-zlib-not-string-or-buffer26639 ---26640 duration_ms: 86.5950026641 ...26642ok 5113 parallel/test-zlib-maxOutputLength26643 ---26644 duration_ms: 107.7620026645 ...26646ok 5114 parallel/test-zlib-object-write26647 ---26648 duration_ms: 86.9330026649 ...26650ok 5115 parallel/test-zlib-params26651 ---26652 duration_ms: 87.3440026653 ...26654ok 5116 parallel/test-zlib-invalid-input-memory26655 ---26656 duration_ms: 134.4680026657 ...26658ok 5117 parallel/test-zlib-premature-end26659 ---26660 duration_ms: 87.3560026661 ...26662ok 5118 parallel/test-zlib-random-byte-pipes26663 ---26664 duration_ms: 87.2370026665 ...26666ok 5119 parallel/test-zlib-reset-before-write26667 ---26668 duration_ms: 87.1120026669 ...26670ok 5120 parallel/test-zlib26671 ---26672 duration_ms: 325.7430026673 ...26674ok 5121 parallel/test-zlib-reset-during-write26675 ---26676 duration_ms: 86.5230026677 ...26678ok 5122 parallel/test-zlib-reject-garbage-after-end26679 ---26680 duration_ms: 109.2450026681 ...26682ok 5123 parallel/test-zlib-sync-no-event26683 ---26684 duration_ms: 87.0470026685 ...26686ok 5124 parallel/test-zlib-truncated26687 ---26688 duration_ms: 87.5600026689 ...26690ok 5125 parallel/test-zlib-unzip-one-byte-chunks26691 ---26692 duration_ms: 87.0220026693 ...26694ok 5126 parallel/test-zlib-write-after-flush26695 ---26696 duration_ms: 86.4020026697 ...26698ok 5127 parallel/test-zlib-zero-byte26699 ---26700 duration_ms: 87.0790026701 ...26702ok 5128 parallel/test-zlib-type-error26703 ---26704 duration_ms: 108.6320026705 ...26706ok 5129 parallel/test-zlib-write-after-close26707 ---26708 duration_ms: 108.2030026709 ...26710ok 5130 parallel/test-worker-messaging-errors-timeout26711 ---26712 duration_ms: 707.3030026713 ...26714ok 5131 parallel/test-zlib-write-after-end26715 ---26716 duration_ms: 108.1670026717 ...26718ok 5132 parallel/test-zlib-zero-windowBits26719 ---26720 duration_ms: 107.8130026721 ...26722ok 5133 parallel/test-zlib-unused-weak26723 ---26724 duration_ms: 134.7270026725 ...26726ok 5134 parallel/test-zlib-zip-edgecases26727 ---26728 duration_ms: 108.5040026729 ...26730ok 5135 parallel/test-zlib-zip-encoding26731 ---26732 duration_ms: 108.2560026733 ...26734ok 5136 parallel/test-zlib-zip-internals26735 ---26736 duration_ms: 108.1980026737 ...26738ok 5137 parallel/test-zlib-zip26739 ---26740 duration_ms: 169.3220026741 ...26742ok 5138 parallel/test-zlib-zip-metadata26743 ---26744 duration_ms: 134.8220026745 ...26746ok 5139 parallel/test-zlib-zstd-from-string26747 ---26748 duration_ms: 86.6340026749 ...26750ok 5140 parallel/test-zlib-zip-file-lifecycle26751 ---26752 duration_ms: 168.1090026753 ...26754ok 5141 parallel/test-zlib-zstd-dictionary26755 ---26756 duration_ms: 107.8210026757 ...26758ok 5142 parallel/test-zlib-zstd-flush26759 ---26760 duration_ms: 107.7180026761 ...26762ok 5143 parallel/test-zlib-zip-sync26763 ---26764 duration_ms: 135.3120026765 ...26766ok 5144 parallel/test-zlib-zip-vfs26767 ---26768 duration_ms: 134.3530026769 ...26770ok 5145 parallel/test-x509-escaping26771 ---26772 duration_ms: 507.2970026773 ...26774ok 5146 parallel/test-zlib-zstd26775 ---26776 duration_ms: 135.0830026777 ...26778ok 5147 parallel/test-zlib-zstd-kmaxlength-rangeerror26779 ---26780 duration_ms: 108.3230026781 ...26782ok 5148 parallel/test-zlib-zip-files26783 ---26784 duration_ms: 209.6380026785 ...26786ok 5149 parallel/test-zlib-zip-hardening26787 ---26788 duration_ms: 209.4730026789 ...26790ok 5150 parallel/test-zlib-zstd-from-zstd26791 ---26792 duration_ms: 134.6630026793 ...26794ok 5151 parallel/test-zlib-zip-interop26795 ---26796 duration_ms: 209.1450026797 ...26798ok 5152 sea/test-build-sea # skip Running the resultant binary fails with `/home/iojs/node-tmp/.tmp.2379/sea: error while loading shared libraries: libicui18n.so.71: cannot open shared object file: No such file or directory`.26799 ---26800 duration_ms: 109.5990026801 ...26802ok 5153 parallel/test-zlib-zstd-pledged-src-size26803 ---26804 duration_ms: 136.0200026805 ...26806ok 5154 parallel/test-zlib-zip-property26807 ---26808 duration_ms: 209.4280026809 ...26810ok 5155 parallel/test-zlib-zip-security-hardening26811 ---26812 duration_ms: 210.5040026813 ...26814ok 5156 sea/test-build-sea-already-exists # skip Running the resultant binary fails with `/home/iojs/node-tmp/.tmp.2379/sea: error while loading shared libraries: libicui18n.so.71: cannot open shared object file: No such file or directory`.26815 ---26816 duration_ms: 108.1730026817 ...26818ok 5157 sea/test-build-sea-config-not-found # skip Running the resultant binary fails with `/home/iojs/node-tmp/.tmp.2379/sea: error while loading shared libraries: libicui18n.so.71: cannot open shared object file: No such file or directory`.26819 ---26820 duration_ms: 108.1130026821 ...26822ok 5158 sea/test-build-sea-executable-field # skip Running the resultant binary fails with `/home/iojs/node-tmp/.tmp.2379/sea: error while loading shared libraries: libicui18n.so.71: cannot open shared object file: No such file or directory`.26823 ---26824 duration_ms: 88.0900026825 ...26826ok 5159 parallel/test-zlib-zip-writable26827 ---26828 duration_ms: 209.7470026829 ...26830ok 5160 sea/test-build-sea-invalid-boolean-fields # skip Running the resultant binary fails with `/home/iojs/node-tmp/.tmp.2379/sea: error while loading shared libraries: libicui18n.so.71: cannot open shared object file: No such file or directory`.26831 ---26832 duration_ms: 87.2700026833 ...26834ok 5161 sea/test-build-sea-invalid-assets # skip Running the resultant binary fails with `/home/iojs/node-tmp/.tmp.2379/sea: error while loading shared libraries: libicui18n.so.71: cannot open shared object file: No such file or directory`.26835 ---26836 duration_ms: 89.6160026837 ...26838ok 5162 sea/test-build-sea-invalid-exec-argv # skip Running the resultant binary fails with `/home/iojs/node-tmp/.tmp.2379/sea: error while loading shared libraries: libicui18n.so.71: cannot open shared object file: No such file or directory`.26839 ---26840 duration_ms: 86.4270026841 ...26842ok 5163 sea/test-build-sea-custom-argv0 # skip Running the resultant binary fails with `/home/iojs/node-tmp/.tmp.2379/sea: error while loading shared libraries: libicui18n.so.71: cannot open shared object file: No such file or directory`.26843 ---26844 duration_ms: 107.9500026845 ...26846ok 5164 sea/test-build-sea-elf-segments # skip Running the resultant binary fails with `/home/iojs/node-tmp/.tmp.2379/sea: error while loading shared libraries: libicui18n.so.71: cannot open shared object file: No such file or directory`.26847 ---26848 duration_ms: 108.0020026849 ...26850ok 5165 sea/test-build-sea-invalid-json # skip Running the resultant binary fails with `/home/iojs/node-tmp/.tmp.2379/sea: error while loading shared libraries: libicui18n.so.71: cannot open shared object file: No such file or directory`.26851 ---26852 duration_ms: 87.1030026853 ...26854ok 5166 sea/test-build-sea-missing-main # skip Running the resultant binary fails with `/home/iojs/node-tmp/.tmp.2379/sea: error while loading shared libraries: libicui18n.so.71: cannot open shared object file: No such file or directory`.26855 ---26856 duration_ms: 86.3500026857 ...26858ok 5167 sea/test-build-sea-invalid-executable # skip Running the resultant binary fails with `/home/iojs/node-tmp/.tmp.2379/sea: error while loading shared libraries: libicui18n.so.71: cannot open shared object file: No such file or directory`.26859 ---26860 duration_ms: 108.5010026861 ...26862ok 5168 sea/test-single-executable-application # skip Running the resultant binary fails with `/home/iojs/node-tmp/.tmp.2379/sea: error while loading shared libraries: libicui18n.so.71: cannot open shared object file: No such file or directory`.26863 ---26864 duration_ms: 86.8810026865 ...26866ok 5169 sea/test-build-sea-missing-output # skip Running the resultant binary fails with `/home/iojs/node-tmp/.tmp.2379/sea: error while loading shared libraries: libicui18n.so.71: cannot open shared object file: No such file or directory`.26867 ---26868 duration_ms: 108.0030026869 ...26870ok 5170 sea/test-single-executable-application-asset-keys-empty # skip Running the resultant binary fails with `/home/iojs/node-tmp/.tmp.2379/sea: error while loading shared libraries: libicui18n.so.71: cannot open shared object file: No such file or directory`.26871 ---26872 duration_ms: 87.4790026873 ...26874ok 5171 sea/test-build-sea-vfs-incompatible-options # skip Running the resultant binary fails with `/home/iojs/node-tmp/.tmp.2379/sea: error while loading shared libraries: libicui18n.so.71: cannot open shared object file: No such file or directory`.26875 ---26876 duration_ms: 108.1340026877 ...26878ok 5172 sea/test-single-executable-application-asset-keys # skip Running the resultant binary fails with `/home/iojs/node-tmp/.tmp.2379/sea: error while loading shared libraries: libicui18n.so.71: cannot open shared object file: No such file or directory`.26879 ---26880 duration_ms: 109.4270026881 ...26882ok 5173 sea/test-single-executable-application-assets # skip Running the resultant binary fails with `/home/iojs/node-tmp/.tmp.2379/sea: error while loading shared libraries: libicui18n.so.71: cannot open shared object file: No such file or directory`.26883 ---26884 duration_ms: 108.1230026885 ...26886ok 5174 sea/test-single-executable-application-disable-experimental-sea-warning # skip Running the resultant binary fails with `/home/iojs/node-tmp/.tmp.2379/sea: error while loading shared libraries: libicui18n.so.71: cannot open shared object file: No such file or directory`.26887 ---26888 duration_ms: 87.9530026889 ...26890ok 5175 sea/test-single-executable-application-empty # skip Running the resultant binary fails with `/home/iojs/node-tmp/.tmp.2379/sea: error while loading shared libraries: libicui18n.so.71: cannot open shared object file: No such file or directory`.26891 ---26892 duration_ms: 87.8100026893 ...26894ok 5176 sea/test-single-executable-application-exec-argv # skip Running the resultant binary fails with `/home/iojs/node-tmp/.tmp.2379/sea: error while loading shared libraries: libicui18n.so.71: cannot open shared object file: No such file or directory`.26895 ---26896 duration_ms: 86.4620026897 ...26898ok 5177 sea/test-single-executable-application-exec-argv-empty # skip Running the resultant binary fails with `/home/iojs/node-tmp/.tmp.2379/sea: error while loading shared libraries: libicui18n.so.71: cannot open shared object file: No such file or directory`.26899 ---26900 duration_ms: 86.3940026901 ...26902ok 5178 sea/test-single-executable-application-assets-raw # skip Running the resultant binary fails with `/home/iojs/node-tmp/.tmp.2379/sea: error while loading shared libraries: libicui18n.so.71: cannot open shared object file: No such file or directory`.26903 ---26904 duration_ms: 108.9250026905 ...26906ok 5179 sea/test-single-executable-application-exec-argv-extension-env # skip Running the resultant binary fails with `/home/iojs/node-tmp/.tmp.2379/sea: error while loading shared libraries: libicui18n.so.71: cannot open shared object file: No such file or directory`.26907 ---26908 duration_ms: 86.7400026909 ...26910ok 5180 sea/test-single-executable-application-esm-code-cache # skip Running the resultant binary fails with `/home/iojs/node-tmp/.tmp.2379/sea: error while loading shared libraries: libicui18n.so.71: cannot open shared object file: No such file or directory`.26911 ---26912 duration_ms: 108.6970026913 ...26914ok 5181 sea/test-single-executable-application-esm # skip Running the resultant binary fails with `/home/iojs/node-tmp/.tmp.2379/sea: error while loading shared libraries: libicui18n.so.71: cannot open shared object file: No such file or directory`.26915 ---26916 duration_ms: 109.1120026917 ...26918ok 5182 sea/test-single-executable-application-assets-nonexistent-file26919 ---26920 duration_ms: 134.5450026921 ...26922ok 5183 sea/test-single-executable-application-exec-argv-extension-cli # skip Running the resultant binary fails with `/home/iojs/node-tmp/.tmp.2379/sea: error while loading shared libraries: libicui18n.so.71: cannot open shared object file: No such file or directory`.26923 ---26924 duration_ms: 109.6950026925 ...26926ok 5184 sea/test-single-executable-application-exec-argv-extension-none # skip Running the resultant binary fails with `/home/iojs/node-tmp/.tmp.2379/sea: error while loading shared libraries: libicui18n.so.71: cannot open shared object file: No such file or directory`.26927 ---26928 duration_ms: 107.9890026929 ...26930ok 5185 sea/test-single-executable-application-inspect # skip Running the resultant binary fails with `/home/iojs/node-tmp/.tmp.2379/sea: error while loading shared libraries: libicui18n.so.71: cannot open shared object file: No such file or directory`.26931 ---26932 duration_ms: 107.8550026933 ...26934ok 5186 sea/test-single-executable-application-assets-invalid-type26935 ---26936 duration_ms: 167.8920026937 ...26938ok 5187 sea/test-single-executable-application-snapshot-and-code-cache # skip Running the resultant binary fails with `/home/iojs/node-tmp/.tmp.2379/sea: error while loading shared libraries: libicui18n.so.71: cannot open shared object file: No such file or directory`.26939 ---26940 duration_ms: 87.1890026941 ...26942ok 5188 sea/test-single-executable-application-snapshot-worker # skip Running the resultant binary fails with `/home/iojs/node-tmp/.tmp.2379/sea: error while loading shared libraries: libicui18n.so.71: cannot open shared object file: No such file or directory`.26943 ---26944 duration_ms: 87.0850026945 ...26946ok 5189 parallel/test-zlib-zip-fuzz26947 ---26948 duration_ms: 407.9550026949 ...26950ok 5190 sea/test-single-executable-application-use-code-cache # skip Running the resultant binary fails with `/home/iojs/node-tmp/.tmp.2379/sea: error while loading shared libraries: libicui18n.so.71: cannot open shared object file: No such file or directory`.26951 ---26952 duration_ms: 87.1640026953 ...26954ok 5191 sea/test-single-executable-application-inspect-in-sea-flags # skip Running the resultant binary fails with `/home/iojs/node-tmp/.tmp.2379/sea: error while loading shared libraries: libicui18n.so.71: cannot open shared object file: No such file or directory`.26955 ---26956 duration_ms: 110.9890026957 ...26958ok 5192 sea/test-single-executable-application-snapshot # skip Running the resultant binary fails with `/home/iojs/node-tmp/.tmp.2379/sea: error while loading shared libraries: libicui18n.so.71: cannot open shared object file: No such file or directory`.26959 ---26960 duration_ms: 109.7610026961 ...26962ok 5193 sea/test-single-executable-application-vfs # skip Running the resultant binary fails with `/home/iojs/node-tmp/.tmp.2379/sea: error while loading shared libraries: libicui18n.so.71: cannot open shared object file: No such file or directory`.26963 ---26964 duration_ms: 88.1430026965 ...26966ok 5194 sea/test-single-executable-application-vfs-esm # skip Running the resultant binary fails with `/home/iojs/node-tmp/.tmp.2379/sea: error while loading shared libraries: libicui18n.so.71: cannot open shared object file: No such file or directory`.26967 ---26968 duration_ms: 87.6680026969 ...26970ok 5195 es-module/test-cjs-legacyMainResolve26971 ---26972 duration_ms: 107.9320026973 ...26974ok 5196 es-module/test-cjs-prototype-pollution26975 ---26976 duration_ms: 108.4940026977 ...26978ok 5197 es-module/test-defer-import-eval26979 ---26980 duration_ms: 108.2610026981 ...26982ok 5198 es-module/test-cjs-defer-static-import-eval26983 ---26984 duration_ms: 134.5630026985 ...26986ok 5199 es-module/test-defer-import-with-module-tree26987 ---26988 duration_ms: 108.1820026989 ...26990ok 5200 es-module/test-esm-assert-strict26991 ---26992 duration_ms: 87.7160026993 ...26994ok 5201 parallel/test-zlib-zip-experimental-warning26995 ---26996 duration_ms: 506.3590026997 ...26998ok 5202 es-module/test-esm-basic-imports26999 ---27000 duration_ms: 87.8820027001 ...27002ok 5203 es-module/test-defer-import-with-regular-import27003 ---27004 duration_ms: 108.0440027005 ...27006ok 5204 es-module/test-disable-require-module-with-detection27007 ---27008 duration_ms: 108.0420027009 ...27010ok 5205 parallel/test-zlib-brotli-16GB27011 ---27012 duration_ms: 809.0150027013 ...27014ok 5206 es-module/test-dynamic-import-script-lifetime27015 ---27016 duration_ms: 108.7890027017 ...27018ok 5207 es-module/test-esm-assertionless-json-import27019 ---27020 duration_ms: 108.6610027021 ...27022ok 5208 es-module/test-defer-import-eval-with-tla27023 ---27024 duration_ms: 135.4810027025 ...27026ok 5209 parallel/test-zlib-zip-security27027 ---27028 duration_ms: 507.2150027029 ...27030ok 5210 parallel/test-v8-take-coverage-noop27031 ---27032 duration_ms: 4260.2910027033 ...27034ok 5211 parallel/test-v8-take-coverage27035 ---27036 duration_ms: 4262.3240027037 ...27038ok 5212 es-module/test-cjs-esm-warn27039 ---27040 duration_ms: 208.9910027041 ...27042ok 5213 es-module/test-esm-cyclic-dynamic-import27043 ---27044 duration_ms: 86.3570027045 ...27046ok 5214 es-module/test-esm-cjs-named-error27047 ---27048 duration_ms: 108.5170027049 ...27050ok 5215 es-module/test-esm-cjs-builtins27051 ---27052 duration_ms: 169.4630027053 ...27054ok 5216 es-module/test-esm-double-encoding27055 ---27056 duration_ms: 87.1710027057 ...27058ok 5217 parallel/test-zlib-zip-coverage27059 ---27060 duration_ms: 607.0460027061 ...27062ok 5218 es-module/test-esm-dynamic-import27063 ---27064 duration_ms: 86.8450027065 ...27066ok 5219 es-module/test-esm-custom-exports27067 ---27068 duration_ms: 108.3470027069 ...27070ok 5220 es-module/test-esm-data-urls27071 ---27072 duration_ms: 108.5050027073 ...27074ok 5221 es-module/test-esm-cjs-main27075 ---27076 duration_ms: 168.4010027077 ...27078ok 5222 es-module/test-esm-default-type27079 ---27080 duration_ms: 108.4770027081 ...27082ok 5223 es-module/test-esm-dns-promises27083 ---27084 duration_ms: 108.7920027085 ...27086ok 5224 sea/test-single-executable-blob-config27087 ---27088 duration_ms: 261.5720027089 ...27090ok 5225 es-module/test-esm-dynamic-import-attribute27091 ---27092 duration_ms: 107.9360027093 ...27094ok 5226 es-module/test-esm-dynamic-import-attribute27095 ---27096 duration_ms: 108.3220027097 ...27098ok 5227 es-module/test-esm-child-process-fork-main27099 ---27100 duration_ms: 209.7370027101 ...27102ok 5228 es-module/test-esm-dynamic-import-commonjs27103 ---27104 duration_ms: 108.3200027105 ...27106ok 5229 es-module/test-esm-dynamic-import-commonjs27107 ---27108 duration_ms: 108.1240027109 ...27110ok 5230 es-module/test-esm-dynamic-import-mutating-fs27111 ---27112 duration_ms: 108.1090027113 ...27114ok 5231 es-module/test-esm-error-cache27115 ---27116 duration_ms: 86.7870027117 ...27118ok 5232 es-module/test-esm-example-loader27119 ---27120 duration_ms: 87.3670027121 ...27122ok 5233 es-module/test-esm-encoded-path27123 ---27124 duration_ms: 112.3390027125 ...27126ok 5234 es-module/test-esm-cjs-exports27127 ---27128 duration_ms: 261.5810027129 ...27130ok 5235 es-module/test-esm-forbidden-globals27131 ---27132 duration_ms: 87.2240027133 ...27134ok 5236 es-module/test-esm-fs-promises27135 ---27136 duration_ms: 87.5710027137 ...27138ok 5237 es-module/test-esm-dynamic-import-mutating-fs27139 ---27140 duration_ms: 168.1770027141 ...27142ok 5238 es-module/test-esm-import-attributes-127143 ---27144 duration_ms: 108.6510027145 ...27146ok 5239 es-module/test-esm-import-attributes-227147 ---27148 duration_ms: 108.2710027149 ...27150ok 5240 es-module/test-esm-exports27151 ---27152 duration_ms: 135.9300027153 ...27154ok 5241 es-module/test-esm-exports-deprecations27155 ---27156 duration_ms: 135.1070027157 ...27158ok 5242 es-module/test-esm-encoded-path-native27159 ---27160 duration_ms: 167.4970027161 ...27162ok 5243 es-module/test-esm-import-attributes-327163 ---27164 duration_ms: 110.1530027165 ...27166ok 5244 es-module/test-esm-import-attributes-errors27167 ---27168 duration_ms: 111.2910027169 ...27170ok 5245 es-module/test-esm-import-attributes-errors27171 ---27172 duration_ms: 110.9400027173 ...27174ok 5246 es-module/test-esm-import-attributes-validation27175 ---27176 duration_ms: 109.3250027177 ...27178ok 5247 es-module/test-esm-import-attributes-validation-text27179 ---27180 duration_ms: 109.4080027181 ...27182ok 5248 es-module/test-esm-import-attributes-identity27183 ---27184 duration_ms: 113.9860027185 ...27186ok 5249 es-module/test-esm-import-meta27187 ---27188 duration_ms: 110.5160027189 ...27190ok 5250 es-module/test-esm-in-require-cache-227191 ---27192 duration_ms: 95.8600027193 ...27194ok 5251 es-module/test-esm-import-meta-resolve-hooks27195 ---27196 duration_ms: 111.8240027197 ...27198ok 5252 es-module/test-esm-import-meta-main27199 ---27200 duration_ms: 139.8510027201 ...27202ok 5253 es-module/test-esm-import-text27203 ---27204 duration_ms: 110.7800027205 ...27206ok 5254 es-module/test-esm-import-json-named-export27207 ---27208 duration_ms: 170.0750027209 ...27210ok 5255 es-module/test-esm-imports27211 ---27212 duration_ms: 108.8890027213 ...27214ok 5256 es-module/test-esm-import-text-disabled27215 ---27216 duration_ms: 112.3380027217 ...27218ok 5257 es-module/test-esm-in-require-cache27219 ---27220 duration_ms: 111.1040027221 ...27222ok 5258 es-module/test-esm-experimental-warnings27223 ---27224 duration_ms: 263.3720027225 ...27226ok 5259 es-module/test-esm-imports-deprecations27227 ---27228 duration_ms: 119.4240027229 ...27230ok 5260 es-module/test-esm-export-not-found27231 ---27232 duration_ms: 262.4770027233 ...27234ok 5261 es-module/test-esm-invalid-data-urls27235 ---27236 duration_ms: 115.5710027237 ...27238ok 5262 es-module/test-esm-json-cache27239 ---27240 duration_ms: 110.7950027241 ...27242ok 5263 sea/test-single-executable-blob-config-errors27243 ---27244 duration_ms: 506.6910027245 ...27246ok 5264 es-module/test-esm-import-assertion-warning27247 ---27248 duration_ms: 262.0420027249 ...27250ok 5265 es-module/test-esm-live-binding27251 ---27252 duration_ms: 110.0170027253 ...27254ok 5266 es-module/test-esm-invalid-pjson27255 ---27256 duration_ms: 171.0180027257 ...27258ok 5267 es-module/test-esm-loader-cache-clearing27259 ---27260 duration_ms: 109.5460027261 ...27262ok 5268 es-module/test-esm-initialization27263 ---27264 duration_ms: 214.3370027265 ...27266ok 5269 es-module/test-esm-json27267 ---27268 duration_ms: 214.5700027269 ...27270ok 5270 es-module/test-esm-loader-modulemap27271 ---27272 duration_ms: 109.4990027273 ...27274ok 5271 es-module/test-esm-loader27275 ---27276 duration_ms: 138.3060027277 ...27278ok 5272 es-module/test-esm-loader-custom-condition27279 ---27280 duration_ms: 134.9540027281 ...27282ok 5273 es-module/test-esm-loader-dependency27283 ---27284 duration_ms: 137.9390027285 ...27286ok 5274 es-module/test-esm-loader-invalid-format27287 ---27288 duration_ms: 135.7890027289 ...27290ok 5275 es-module/test-esm-loader-search27291 ---27292 duration_ms: 86.9820027293 ...27294ok 5276 es-module/test-esm-loader-invalid-url27295 ---27296 duration_ms: 137.3170027297 ...27298ok 5277 es-module/test-esm-loader-mock27299 ---27300 duration_ms: 136.9220027301 ...27302ok 5278 es-module/test-esm-extensionless-esm-and-wasm27303 ---27304 duration_ms: 409.2580027305 ...27306ok 5279 es-module/test-esm-loader-event-loop27307 ---27308 duration_ms: 168.0090027309 ...27310ok 5280 es-module/test-esm-loader-text-format27311 ---27312 duration_ms: 107.9860027313 ...27314ok 5281 es-module/test-esm-loader-not-found27315 ---27316 duration_ms: 210.9810027317 ...27318ok 5282 es-module/test-esm-namespace27319 ---27320 duration_ms: 87.4490027321 ...27322ok 5283 es-module/test-esm-long-path-win # skip this test is Windows-specific.27323 ---27324 duration_ms: 108.4380027325 ...27326ok 5284 es-module/test-cjs-legacyMainResolve-permission27327 ---27328 duration_ms: 707.7120027329 ...27330ok 5285 es-module/test-esm-loader-resolve-type27331 ---27332 duration_ms: 212.5700027333 ...27334ok 5286 es-module/test-esm-main-lookup27335 ---27336 duration_ms: 109.3430027337 ...27338ok 5287 es-module/test-esm-loader-with-source27339 ---27340 duration_ms: 134.8200027341 ...27342ok 5288 es-module/test-esm-extension-lookup-deprecation27343 ---27344 duration_ms: 506.5130027345 ...27346ok 5289 es-module/test-esm-loader-stringify-text27347 ---27348 duration_ms: 168.2850027349 ...27350ok 5290 es-module/test-esm-named-exports27351 ---27352 duration_ms: 135.1580027353 ...27354ok 5291 es-module/test-esm-cjs-load-error-note27355 ---27356 duration_ms: 706.9030027357 ...27358ok 5292 es-module/test-esm-no-addons27359 ---27360 duration_ms: 169.0180027361 ...27362ok 5293 es-module/test-esm-non-js27363 ---27364 duration_ms: 170.9760027365 ...27366ok 5294 es-module/test-esm-path-posix27367 ---27368 duration_ms: 88.7420027369 ...27370ok 5295 es-module/test-esm-path-win3227371 ---27372 duration_ms: 87.3560027373 ...27374ok 5296 es-module/test-esm-import-meta-resolve27375 ---27376 duration_ms: 508.3480027377 ...27378ok 5297 es-module/test-esm-nowarn-exports27379 ---27380 duration_ms: 209.2580027381 ...27382ok 5298 es-module/test-esm-loader-with-syntax-error27383 ---27384 duration_ms: 261.6430027385 ...27386ok 5299 es-module/test-esm-pkgname27387 ---27388 duration_ms: 110.6320027389 ...27390ok 5300 es-module/test-esm-loader-entry-url27391 ---27392 duration_ms: 407.6030027393 ...27394ok 5301 es-module/test-esm-package-map-symlink27395 ---27396 duration_ms: 168.8700027397 ...27398ok 5302 es-module/test-esm-preserve-symlinks-not-found27399 ---27400 duration_ms: 108.0910027401 ...27402ok 5303 es-module/test-esm-preserve-symlinks-not-found-plain27403 ---27404 duration_ms: 108.1640027405 ...27406ok 5304 es-module/test-esm-process27407 ---27408 duration_ms: 107.8210027409 ...27410ok 5305 es-module/test-esm-package-map-version-fork27411 ---27412 duration_ms: 208.9690027413 ...27414ok 5306 es-module/test-esm-prototype-pollution27415 ---27416 duration_ms: 107.9820027417 ...27418ok 5307 es-module/test-esm-package-map-boundaries27419 ---27420 duration_ms: 260.8940027421 ...27422ok 5308 es-module/test-esm-recursive-cjs-dependencies27423 ---27424 duration_ms: 107.9550027425 ...27426ok 5309 es-module/test-esm-package-map-exports27427 ---27428 duration_ms: 261.3040027429 ...27430ok 5310 es-module/test-esm-package-map-flag27431 ---27432 duration_ms: 261.3000027433 ...27434ok 5311 es-module/test-esm-require-cache27435 ---27436 duration_ms: 87.1100027437 ...27438ok 5312 es-module/test-esm-loader-default-resolver27439 ---27440 duration_ms: 506.2160027441 ...27442ok 5313 es-module/test-esm-preserve-symlinks27443 ---27444 duration_ms: 209.6000027445 ...27446ok 5314 es-module/test-esm-loader-thenable27447 ---27448 duration_ms: 407.1780027449 ...27450ok 5315 es-module/test-esm-require-race-condition27451 ---27452 duration_ms: 86.5410027453 ...27454ok 5316 es-module/test-esm-package-map-basic27455 ---27456 duration_ms: 325.5900027457 ...27458ok 5317 es-module/test-esm-scope-node-modules27459 ---27460 duration_ms: 86.4620027461 ...27462ok 5318 es-module/test-esm-repl27463 ---27464 duration_ms: 168.4800027465 ...27466ok 5319 es-module/test-esm-import-meta-main-eval27467 ---27468 duration_ms: 709.1420027469 ...27470ok 5320 es-module/test-esm-resolve-type27471 ---27472 duration_ms: 108.1660027473 ...27474ok 5321 es-module/test-esm-shebang27475 ---27476 duration_ms: 108.6020027477 ...27478ok 5322 es-module/test-esm-throw-undefined27479 ---27480 duration_ms: 89.5080027481 ...27482ok 5323 es-module/test-esm-snapshot27483 ---27484 duration_ms: 107.9340027485 ...27486ok 5324 es-module/test-esm-shared-loader-dep27487 ---27488 duration_ms: 134.3640027489 ...27490ok 5325 es-module/test-esm-repl-imports27491 ---27492 duration_ms: 210.0310027493 ...27494ok 5326 parallel/test-v8-collect-gc-profile27495 ---27496 duration_ms: 5276.1880027497 ...27498ok 5327 parallel/test-v8-collect-gc-profile-in-worker27499 ---27500 duration_ms: 5272.5290027501 ...27502ok 5328 es-module/test-esm-preserve-symlinks-main27503 ---27504 duration_ms: 325.9200027505 ...27506ok 5329 es-module/test-esm-package-map-paths27507 ---27508 duration_ms: 407.4350027509 ...27510ok 5330 es-module/test-esm-type-field27511 ---27512 duration_ms: 110.1910027513 ...27514ok 5331 es-module/test-esm-symlink27515 ---27516 duration_ms: 169.8830027517 ...27518ok 5332 es-module/test-esm-symlink-main27519 ---27520 duration_ms: 171.2820027521 ...27522ok 5333 es-module/test-esm-type-field-errors-227523 ---27524 duration_ms: 111.5110027525 ...27526ok 5334 es-module/test-esm-type-main27527 ---27528 duration_ms: 115.6360027529 ...27530ok 5335 es-module/test-esm-undefined-cjs-global-like-variables27531 ---27532 duration_ms: 113.8160027533 ...27534ok 5336 es-module/test-esm-url-extname27535 ---27536 duration_ms: 116.0010027537 ...27538ok 5337 es-module/test-esm-symlink-type27539 ---27540 duration_ms: 213.4920027541 ...27542ok 5338 es-module/test-esm-syntax-error27543 ---27544 duration_ms: 212.7820027545 ...27546ok 5339 es-module/test-esm-util-types27547 ---27548 duration_ms: 113.5450027549 ...27550ok 5340 es-module/test-esm-import-flag27551 ---27552 duration_ms: 909.7740027553 ...27554ok 5341 es-module/test-esm-package-map-errors27555 ---27556 duration_ms: 508.1010027557 ...27558ok 5342 es-module/test-esm-module-not-found-commonjs-hint27559 ---27560 duration_ms: 609.5220027561 ...27562ok 5343 es-module/test-esm-virtual-json27563 ---27564 duration_ms: 144.4840027565 ...27566ok 5344 es-module/test-esm-wasm-globals-all-types27567 ---27568 duration_ms: 172.6030027569 ...27570ok 5345 es-module/test-esm-wasm-js-string-builtins27571 ---27572 duration_ms: 175.9400027573 ...27574ok 5346 es-module/test-esm-type-field-errors27575 ---27576 duration_ms: 268.7110027577 ...27578ok 5347 es-module/test-esm-wasm-load-exports27579 ---27580 duration_ms: 181.4890027581 ...27582ok 5348 es-module/test-esm-wasm-escape-import-names27583 ---27584 duration_ms: 214.5890027585 ...27586ok 5349 es-module/test-esm-wasm-module-instances-warning27587 ---27588 duration_ms: 178.9130027589 ...27590ok 5350 es-module/test-esm-wasm-no-code-injection27591 ---27592 duration_ms: 179.4970027593 ...27594ok 5351 es-module/test-esm-wasm-non-identifier-exports27595 ---27596 duration_ms: 177.8390027597 ...27598ok 5352 es-module/test-esm-wasm-reject-wasm-export-names27599 ---27600 duration_ms: 177.3390027601 ...27602ok 5353 es-module/test-esm-wasm-reject-wasm-import-names27603 ---27604 duration_ms: 171.9200027605 ...27606ok 5354 es-module/test-esm-wasm-reject-wasm-js-export-names27607 ---27608 duration_ms: 170.7670027609 ...27610ok 5355 es-module/test-esm-unknown-extension27611 ---27612 duration_ms: 268.7090027613 ...27614ok 5356 es-module/test-esm-wasm-reject-wasm-js-import-module27615 ---27616 duration_ms: 171.7010027617 ...27618ok 5357 es-module/test-esm-wasm-reject-wasm-js-import-names27619 ---27620 duration_ms: 171.2140027621 ...27622ok 5358 es-module/test-esm-wasm-source-phase-identity27623 ---27624 duration_ms: 170.1230027625 ...27626ok 5359 es-module/test-esm-wasm-source-phase-dynamic27627 ---27628 duration_ms: 172.1810027629 ...27630ok 5360 es-module/test-esm-wasm-source-phase-no-execute27631 ---27632 duration_ms: 167.7630027633 ...27634ok 5361 es-module/test-esm-wasm-source-phase-no-execute-dynamic27635 ---27636 duration_ms: 170.1480027637 ...27638ok 5362 es-module/test-esm-wasm-source-phase-not-defined-dynamic27639 ---27640 duration_ms: 167.6060027641 ...27642ok 5363 es-module/test-esm-wasm-source-phase-not-defined-static27643 ---27644 duration_ms: 169.0390027645 ...27646ok 5364 es-module/test-esm-tla27647 ---27648 duration_ms: 410.3950027649 ...27650ok 5365 es-module/test-esm-windows27651 ---27652 duration_ms: 108.0980027653 ...27654ok 5366 es-module/test-import-cjs-jitless27655 ---27656 duration_ms: 108.1900027657 ...27658ok 5367 es-module/test-import-module-conditional-exports-module27659 ---27660 duration_ms: 108.3210027661 ...27662ok 5368 es-module/test-import-module-retry-require-errored27663 ---27664 duration_ms: 108.0380027665 ...27666ok 5369 es-module/test-esm-wasm-source-phase-static27667 ---27668 duration_ms: 168.0230027669 ...27670ok 5370 es-module/test-loaders-hidden-from-users27671 ---27672 duration_ms: 108.4940027673 ...27674ok 5371 es-module/test-esm-wasm-top-level-execution27675 ---27676 duration_ms: 167.7430027677 ...27678ok 5372 es-module/test-esm-wasm-vm-source-phase-dynamic27679 ---27680 duration_ms: 169.4970027681 ...27682ok 5373 es-module/test-esm-wasm-vm-source-phase-static27683 ---27684 duration_ms: 167.9230027685 ...27686ok 5374 es-module/test-esm-register-deprecation27687 ---27688 duration_ms: 610.0900027689 ...27690ok 5375 es-module/test-require-module27691 ---27692 duration_ms: 109.1750027693 ...27694ok 5376 es-module/test-require-as-esm-interop27695 ---27696 duration_ms: 134.9890027697 ...27698ok 5377 es-module/test-loaders-unknown-builtin-module27699 ---27700 duration_ms: 137.9570027701 ...27702ok 5378 es-module/test-require-module-cached-tla27703 ---27704 duration_ms: 109.9100027705 ...27706ok 5379 es-module/test-import-preload-require-cycle27707 ---27708 duration_ms: 169.0950027709 ...27710ok 5380 es-module/test-require-module-conditional-exports27711 ---27712 duration_ms: 108.8210027713 ...27714ok 5381 es-module/test-import-require-tla-twice27715 ---27716 duration_ms: 168.0340027717 ...27718ok 5382 es-module/test-require-module-conditional-exports-module27719 ---27720 duration_ms: 107.8680027721 ...27722ok 5383 es-module/test-require-module-cycle-cjs-esm-esm27723 ---27724 duration_ms: 108.1620027725 ...27726ok 5384 es-module/test-extensionless-esm-type-commonjs27727 ---27728 duration_ms: 209.3800027729 ...27730ok 5385 es-module/test-require-module-default-extension27731 ---27732 duration_ms: 107.8780027733 ...27734ok 5386 es-module/test-require-module-detect-entry-point27735 ---27736 duration_ms: 87.1200027737 ...27738ok 5387 es-module/test-require-module-defined-esmodule27739 ---27740 duration_ms: 110.0350027741 ...27742ok 5388 es-module/test-esm-source-map27743 ---27744 duration_ms: 612.2380027745 ...27746ok 5389 es-module/test-require-module-dont-detect-cjs27747 ---27748 duration_ms: 108.8280027749 ...27750ok 5390 es-module/test-require-module-dynamic-import-127751 ---27752 duration_ms: 109.2470027753 ...27754ok 5391 es-module/test-require-module-dynamic-import-227755 ---27756 duration_ms: 108.0310027757 ...27758ok 5392 es-module/test-require-module-dynamic-import-327759 ---27760 duration_ms: 108.6940027761 ...27762ok 5393 es-module/test-require-module-dynamic-import-427763 ---27764 duration_ms: 108.3680027765 ...27766ok 5394 es-module/test-require-module-detect-entry-point-aou27767 ---27768 duration_ms: 135.1670027769 ...27770ok 5395 es-module/test-require-module-error-catching27771 ---27772 duration_ms: 109.0230027773 ...27774ok 5396 es-module/test-esm-loader-programmatically27775 ---27776 duration_ms: 1115.9020027777 ...27778ok 5397 es-module/test-require-module-implicit27779 ---27780 duration_ms: 110.7650027781 ...27782ok 5398 es-module/test-require-module-instantiated27783 ---27784 duration_ms: 108.6940027785 ...27786ok 5399 es-module/test-require-esm-from-imported-cjs27787 ---27788 duration_ms: 261.4230027789 ...27790ok 5400 es-module/test-require-module-retry-import-errored27791 ---27792 duration_ms: 110.1230027793 ...27794ok 5401 es-module/test-require-module-retry-import-errored-227795 ---27796 duration_ms: 86.8150027797 ...27798ok 5402 es-module/test-require-module-retry-import-evaluating27799 ---27800 duration_ms: 109.4830027801 ...27802ok 5403 es-module/test-require-module-synchronous-rejection-handling27803 ---27804 duration_ms: 108.6190027805 ...27806ok 5404 es-module/test-require-module-cycle-esm-cjs-esm-esm27807 ---27808 duration_ms: 262.1370027809 ...27810ok 5405 es-module/test-require-module-tla-instantiation-error27811 ---27812 duration_ms: 108.7410027813 ...27814ok 5406 es-module/test-require-module-tla-retry-import27815 ---27816 duration_ms: 89.5680027817 ...27818ok 5407 es-module/test-require-module-tla-error-metadata27819 ---27820 duration_ms: 134.7820027821 ...27822ok 5408 es-module/test-require-module-tla-rejected27823 ---27824 duration_ms: 109.6280027825 ...27826ok 5409 es-module/test-require-module-tla-nested27827 ---27828 duration_ms: 111.7270027829 ...27830ok 5410 es-module/test-require-module-tla-resolved27831 ---27832 duration_ms: 111.4770027833 ...27834ok 5411 es-module/test-require-module-tla-retry-import-227835 ---27836 duration_ms: 108.6110027837 ...27838ok 5412 es-module/test-require-module-tla-unresolved27839 ---27840 duration_ms: 109.4280027841 ...27842ok 5413 es-module/test-require-module-tla-retry-require27843 ---27844 duration_ms: 112.8410027845 ...27846ok 5414 es-module/test-require-module-twice27847 ---27848 duration_ms: 108.6960027849 ...27850ok 5415 es-module/test-require-module-tla-execution27851 ---27852 duration_ms: 168.6890027853 ...27854ok 5416 es-module/test-require-module-cycle-esm-esm-cjs-esm27855 ---27856 duration_ms: 326.5980027857 ...27858ok 5417 es-module/test-require-module-cycle-esm-esm-cjs-esm-esm27859 ---27860 duration_ms: 326.4870027861 ...27862ok 5418 es-module/test-require-module-with-detection27863 ---27864 duration_ms: 108.1260027865 ...27866ok 5419 es-module/test-require-module-tla-print-execution27867 ---27868 duration_ms: 172.4710027869 ...27870ok 5420 es-module/test-vm-compile-function-lineoffset27871 ---27872 duration_ms: 89.7720027873 ...27874ok 5421 es-module/test-require-module-errors27875 ---27876 duration_ms: 326.0700027877 ...27878ok 5422 es-module/test-require-module-cycle-esm-cjs-esm27879 ---27880 duration_ms: 408.1800027881 ...27882ok 5423 es-module/test-require-module-feature-detect27883 ---27884 duration_ms: 326.5400027885 ...27886ok 5424 es-module/test-vm-main-context-default-loader27887 ---27888 duration_ms: 107.8190027889 ...27890ok 5425 es-module/test-vm-main-context-default-loader-eval27891 ---27892 duration_ms: 109.9580027893 ...27894ok 5426 es-module/test-vm-compile-function-leak27895 ---27896 duration_ms: 135.5160027897 ...27898ok 5427 es-module/test-vm-synthetic-module-leak27899 ---27900 duration_ms: 108.2580027901 ...27902ok 5428 es-module/test-vm-contextified-script-leak27903 ---27904 duration_ms: 134.7460027905 ...27906ok 5429 es-module/test-wasm-memory-out-of-bound27907 ---27908 duration_ms: 109.5770027909 ...27910ok 5430 es-module/test-wasm-simple27911 ---27912 duration_ms: 108.8770027913 ...27914ok 5431 es-module/test-require-module-warning27915 ---27916 duration_ms: 209.6490027917 ...27918ok 5432 message/assert_throws_stack27919 ---27920 duration_ms: 111.3700027921 ...27922ok 5433 message/console_assert27923 ---27924 duration_ms: 109.9220027925 ...27926ok 5434 message/internal_assert27927 ---27928 duration_ms: 109.0630027929 ...27930ok 5435 message/internal_assert_fail27931 ---27932 duration_ms: 109.4870027933 ...27934ok 5436 message/max_tick_depth27935 ---27936 duration_ms: 110.6820027937 ...27938ok 5437 message/nexttick_throw27939 ---27940 duration_ms: 109.7650027941 ...27942ok 5438 es-module/test-esm-loader-spawn-promisified27943 ---27944 duration_ms: 1409.5980027945 ...27946ok 5439 message/util_inspect_error27947 ---27948 duration_ms: 90.0310027949 ...27950ok 5440 es-module/test-require-module-transpiled27951 ---27952 duration_ms: 326.3220027953 ...27954ok 5441 message/test-testpy-env-var-via-comment27955 ---27956 duration_ms: 109.1700027957 ...27958ok 5442 message/util-inspect-error-cause27959 ---27960 duration_ms: 110.2830027961 ...27962ok 5443 es-module/test-vm-source-text-module-leak27963 ---27964 duration_ms: 262.0220027965 ...27966ok 5444 client-proxy/test-http-proxy-perf-hooks27967 ---27968 duration_ms: 136.0990027969 ...27970ok 5445 message/node_run_list27971 ---27972 duration_ms: 171.4080027973 ...27974ok 5446 message/node_run_non_existent27975 ---27976 duration_ms: 171.4200027977 ...27978ok 5447 es-module/test-esm-tla-unfinished27979 ---27980 duration_ms: 1012.5860027981 ...27982ok 5448 client-proxy/test-http-proxy-request-authority-construction27983 ---27984 duration_ms: 119.9150027985 ...27986ok 5449 client-proxy/test-http-proxy-request-invalid-credentials27987 ---27988 duration_ms: 116.3580027989 ...27990ok 5450 client-proxy/test-http-proxy-request-invalid-char-in-options27991 ---27992 duration_ms: 137.0980027993 ...27994ok 5451 es-module/test-require-module-tla-error-snapshot27995 ---27996 duration_ms: 508.7790027997 ...27998ok 5452 client-proxy/test-http-proxy-request-absolute-path-authority-match27999 ---28000 duration_ms: 176.1870028001 ...28002ok 5453 es-module/test-require-node-modules-warning28003 ---28004 duration_ms: 406.8970028005 ...28006ok 5454 client-proxy/test-http-proxy-request-invalid-proxy28007 ---28008 duration_ms: 144.0810028009 ...28010ok 5455 client-proxy/test-http-proxy-request-max-sockets28011 ---28012 duration_ms: 171.2720028013 ...28014ok 5456 client-proxy/test-http-proxy-request-invalid-char-in-url28015 ---28016 duration_ms: 222.4520028017 ...28018ok 5457 client-proxy/test-http-proxy-request-invalid-url28019 ---28020 duration_ms: 212.5880028021 ...28022ok 5458 client-proxy/test-http-proxy-request-connection-refused28023 ---28024 duration_ms: 268.4430028025 ...28026ok 5459 es-module/test-require-module-preload28027 ---28028 duration_ms: 710.0620028029 ...28030ok 5460 client-proxy/test-http-proxy-request-ipv628031 ---28032 duration_ms: 262.7360028033 ...28034ok 5461 client-proxy/test-http-proxy-request-validation-errors28035 ---28036 duration_ms: 137.0720028037 ...28038ok 5462 client-proxy/test-http-proxy-request-origin-form-path28039 ---28040 duration_ms: 170.1170028041 ...28042ok 5463 client-proxy/test-http-proxy-request-socket-keep-alive28043 ---28044 duration_ms: 167.9940028045 ...28046ok 5464 es-module/test-loaders-workers-spawned28047 ---28048 duration_ms: 909.0630028049 ...28050ok 5465 client-proxy/test-http-proxy-request-https-proxy28051 ---28052 duration_ms: 331.2990028053 ...28054ok 5466 client-proxy/test-http-proxy-request-no-proxy-asterisk28055 ---28056 duration_ms: 267.5640028057 ...28058ok 5467 client-proxy/test-http-proxy-request-no-proxy28059 ---28060 duration_ms: 341.4920028061 ...28062ok 5468 client-proxy/test-http-proxy-request-proxy-failure-50028063 ---28064 duration_ms: 263.2210028065 ...28066ok 5469 client-proxy/test-http-proxy-request-proxy-failure-hang-up28067 ---28068 duration_ms: 262.8910028069 ...28070ok 5470 client-proxy/test-http-proxy-request28071 ---28072 duration_ms: 513.7330028073 ...28074ok 5471 client-proxy/test-http-request-proxy-post28075 ---28076 duration_ms: 329.9830028077 ...28078ok 5472 client-proxy/test-http-request-proxy-post-server-failure28079 ---28080 duration_ms: 265.8940028081 ...28082ok 5473 client-proxy/test-http-set-global-proxy-from-env-fetch28083 ---28084 duration_ms: 266.5340028085 ...28086ok 5474 client-proxy/test-http-set-global-proxy-from-env-fetch-default28087 ---28088 duration_ms: 262.1340028089 ...28090ok 5475 es-module/test-esm-detect-ambiguous28091 ---28092 duration_ms: 2313.7530028093 ...28094ok 5476 client-proxy/test-http-proxy-request-no-proxy-ip28095 ---28096 duration_ms: 416.2820028097 ...28098ok 5477 client-proxy/test-http-set-global-proxy-from-env-invalid-type28099 ---28100 duration_ms: 108.8260028101 ...28102ok 5478 client-proxy/test-http-set-global-proxy-from-env-invalid-url28103 ---28104 duration_ms: 109.1020028105 ...28106ok 5479 client-proxy/test-http-proxy-request-no-proxy-port-specific28107 ---28108 duration_ms: 410.7620028109 ...28110ok 5480 client-proxy/test-http-set-global-proxy-from-env-fetch-empty28111 ---28112 duration_ms: 264.2080028113 ...28114ok 5481 es-module/test-esm-loader-chaining28115 ---28116 duration_ms: 2011.3590028117 ...28118ok 5482 client-proxy/test-http-proxy-fetch28119 ---28120 duration_ms: 609.6160028121 ...28122ok 5483 client-proxy/test-http-set-global-proxy-from-env-http-request-empty28123 ---28124 duration_ms: 214.4680028125 ...28126ok 5484 client-proxy/test-http-set-global-proxy-from-env-http-request-restore28127 ---28128 duration_ms: 212.6200028129 ...28130ok 5485 client-proxy/test-http-set-global-proxy-from-env-fetch-https28131 ---28132 duration_ms: 263.6970028133 ...28134ok 5486 client-proxy/test-http-set-global-proxy-from-env-fetch-restore28135 ---28136 duration_ms: 262.6210028137 ...28138ok 5487 client-proxy/test-http-set-global-proxy-from-env-fetch-no-proxy28139 ---28140 duration_ms: 264.7630028141 ...28142ok 5488 client-proxy/test-http-set-global-proxy-from-env-http-request28143 ---28144 duration_ms: 270.8110028145 ...28146ok 5489 client-proxy/test-http-set-global-proxy-from-env-http-request-default28147 ---28148 duration_ms: 270.0360028149 ...28150ok 5490 client-proxy/test-http-set-global-proxy-from-env-https-request28151 ---28152 duration_ms: 261.7940028153 ...28154ok 5491 client-proxy/test-https-proxy-request-invalid-credentials28155 ---28156 duration_ms: 108.5000028157 ...28158ok 5492 client-proxy/test-https-proxy-request-invalid-char-in-options28159 ---28160 duration_ms: 134.5760028161 ...28162ok 5493 parallel/test-zlib-zip-zip6428163 ---28164 duration_ms: 2910.9870028165 ...28166ok 5494 client-proxy/test-http-set-global-proxy-from-env-no-proxy28167 ---28168 duration_ms: 260.6150028169 ...28170ok 5495 client-proxy/test-https-proxy-request-invalid-char-in-url28171 ---28172 duration_ms: 173.6680028173 ...28174ok 5496 client-proxy/test-http-set-global-proxy-from-env-override-fetch28175 ---28176 duration_ms: 261.0420028177 ...28178ok 5497 client-proxy/test-https-proxy-request-max-sockets28179 ---28180 duration_ms: 168.9810028181 ...28182ok 5498 client-proxy/test-http-set-global-proxy-from-env-override-http28183 ---28184 duration_ms: 262.2360028185 ...28186ok 5499 client-proxy/test-https-proxy-request-auth-failure28187 ---28188 duration_ms: 262.0800028189 ...28190ok 5500 client-proxy/test-https-proxy-request-connection-refused28191 ---28192 duration_ms: 261.3970028193 ...28194ok 5501 client-proxy/test-https-proxy-request-empty-response28195 ---28196 duration_ms: 261.4250028197 ...28198ok 5502 client-proxy/test-https-proxy-request-handshake-failure28199 ---28200 duration_ms: 262.1430028201 ...28202ok 5503 client-proxy/test-https-proxy-request-https-proxy28203 ---28204 duration_ms: 262.1420028205 ...28206ok 5504 client-proxy/test-http-proxy-request-no-proxy-domain28207 ---28208 duration_ms: 714.8640028209 ...28210ok 5505 client-proxy/test-https-proxy-request-invalid-url28211 ---28212 duration_ms: 262.5700028213 ...28214ok 5506 client-proxy/test-https-proxy-request-socket-keep-alive28215 ---28216 duration_ms: 134.5040028217 ...28218ok 5507 client-proxy/test-https-proxy-request-malformed-response28219 ---28220 duration_ms: 267.2130028221 ...28222ok 5508 client-proxy/test-https-proxy-request-no-proxy28223 ---28224 duration_ms: 265.0160028225 ...28226ok 5509 client-proxy/test-https-proxy-request-proxy-failure-40428227 ---28228 duration_ms: 262.0740028229 ...28230ok 5510 client-proxy/test-https-proxy-request-proxy-failure-50028231 ---28232 duration_ms: 262.4620028233 ...28234ok 5511 client-proxy/test-https-proxy-request-server-failure-hang-up28235 ---28236 duration_ms: 209.0960028237 ...28238ok 5512 es-module/test-typescript-module28239 ---28240 duration_ms: 1108.6170028241 ...28242ok 5513 client-proxy/test-https-proxy-request-proxy-failure-50228243 ---28244 duration_ms: 262.0730028245 ...28246ok 5514 client-proxy/test-https-proxy-request-header-overflow28247 ---28248 duration_ms: 407.6540028249 ...28250ok 5515 client-proxy/test-https-proxy-request-proxy-failure-hang-up28251 ---28252 duration_ms: 262.6820028253 ...28254ok 5516 client-proxy/test-https-request-proxy-post28255 ---28256 duration_ms: 208.7670028257 ...28258ok 5517 parallel/test-stream-iter-broadcast-from28259 ---28260 duration_ms: 10254.8780028261 ...28262ok 5518 client-proxy/test-https-proxy-request-ipv628263 ---28264 duration_ms: 407.7520028265 ...28266ok 5519 client-proxy/test-https-proxy-fetch28267 ---28268 duration_ms: 507.3530028269 ...28270ok 5520 client-proxy/test-https-proxy-request28271 ---28272 duration_ms: 509.0330028273 ...28274ok 5521 es-module/test-typescript-commonjs28275 ---28276 duration_ms: 1310.2710028277 ...28278ok 5522 client-proxy/test-use-env-proxy-cli-http28279 ---28280 duration_ms: 326.1350028281 ...28282ok 5523 client-proxy/test-use-env-proxy-cli-https28283 ---28284 duration_ms: 327.1760028285 ...28286ok 5524 client-proxy/test-use-env-proxy-precedence28287 ---28288 duration_ms: 406.5360028289 ...28290ok 5525 es-module/test-typescript-eval28291 ---28292 duration_ms: 1808.1900028293 ...28294ok 5526 es-module/test-esm-tla-syntax-errors-not-recognized-as-tla-error28295 ---28296 duration_ms: 2716.9710028297 ...28298ok 5527 client-proxy/test-https-proxy-request-incomplete-headers28299 ---28300 duration_ms: 1307.3330028301 ...28302ok 5528 client-proxy/test-https-proxy-request-tunnel-timeout28303 ---28304 duration_ms: 1306.5690028305 ...28306ok 5529 client-proxy/test-https-proxy-request-tunnel-timeout-agent28307 ---28308 duration_ms: 1306.9480028309 ...28310ok 5530 es-module/test-typescript28311 ---28312 duration_ms: 2409.5200028313 ...28314ok 5531 pummel/test-array-hash-collision28315 ---28316 duration_ms: 260.3860028317 ...28318ok 5532 es-module/test-wasm-web-api28319 ---28320 duration_ms: 3411.5440028321 ...28322ok 5533 pummel/test-blob-slice-with-large-size28323 ---28324 duration_ms: 1506.6590028325 ...28326ok 5534 pummel/test-buffer-large-size-buffer-alloc28327 ---28328 duration_ms: 1506.8260028329 ...28330ok 5535 pummel/test-buffer-large-size-buffer-alloc-unsafe28331 ---28332 duration_ms: 1407.0840028333 ...28334ok 5536 pummel/test-buffer-large-size-buffer-alloc-unsafe-slow28335 ---28336 duration_ms: 1507.3710028337 ...28338ok 5537 pummel/test-buffer-large-size-buffer-write28339 ---28340 duration_ms: 69.6310028341 ...28342ok 5538 pummel/test-buffer-large-size-copy28343 ---28344 duration_ms: 2507.9420028345 ...28346ok 5539 pummel/test-buffer-large-size-slowbuffer28347 ---28348 duration_ms: 1507.1370028349 ...28350ok 5540 pummel/test-child-process-spawn-loop28351 ---28352 duration_ms: 806.8660028353 ...28354ok 5541 pummel/test-crypto-argon2-nonblocking-constructor28355 ---28356 duration_ms: 1307.8710028357 ...28358ok 5542 pummel/test-crypto-dh-hash28359 ---28360 duration_ms: 134.3890028361 ...28362ok 5543 pummel/test-crypto-dh-keys28363 ---28364 duration_ms: 209.2910028365 ...28366ok 5544 parallel/test-runner-execution-ordered-bypass28367 ---28368 duration_ms: 30368.0680028369 ...28370ok 5545 pummel/test-crypto-pqc-sign-verify-slh-dsa28371 ---28372 duration_ms: 7111.0020028373 ...28374ok 5546 pummel/test-dh-regr28375 ---28376 duration_ms: 15515.1550028377 ...28378ok 5547 pummel/test-fs-largefile28379 ---28380 duration_ms: 69.4690028381 ...28382ok 5548 pummel/test-fs-read-file-sync-utf8-memory28383 ---28384 duration_ms: 606.6690028385 ...28386ok 5549 pummel/test-fs-readfile-tostring-fail28387 ---28388 duration_ms: 806.9720028389 ...28390ok 5550 pummel/test-heap-profile-and-snapshot-near-heap-limit28391 ---28392 duration_ms: 707.0800028393 ...28394ok 5551 pummel/test-heap-profile-near-heap-limit28395 ---28396 duration_ms: 606.8000028397 ...28398ok 5552 pummel/test-heapdump-dns28399 ---28400 duration_ms: 1207.4210028401 ...28402ok 5553 pummel/test-heapdump-env28403 ---28404 duration_ms: 506.4720028405 ...28406ok 5554 pummel/test-heapdump-fs-promise28407 ---28408 duration_ms: 906.9720028409 ...28410ok 5555 pummel/test-heapdump-http228411 ---28412 duration_ms: 1607.7030028413 ...28414ok 5556 pummel/test-heapdump-inspector28415 ---28416 duration_ms: 907.5360028417 ...28418ok 5557 pummel/test-heapdump-shadow-realm28419 ---28420 duration_ms: 1908.0780028421 ...28422ok 5558 pummel/test-heapdump-tls28423 ---28424 duration_ms: 907.2950028425 ...28426ok 5559 pummel/test-heapdump-urlpattern28427 ---28428 duration_ms: 806.8240028429 ...28430ok 5560 pummel/test-heapdump-vm-script28431 ---28432 duration_ms: 506.8650028433 ...28434ok 5561 pummel/test-heapdump-worker28435 ---28436 duration_ms: 907.3840028437 ...28438ok 5562 pummel/test-heapdump-zlib28439 ---28440 duration_ms: 8013.1510028441 ...28442ok 5563 pummel/test-heapdump-zstd28443 ---28444 duration_ms: 1207.4090028445 ...28446ok 5564 pummel/test-heapsnapshot-near-heap-limit28447 ---28448 duration_ms: 1907.7930028449 ...28450ok 5565 pummel/test-heapsnapshot-near-heap-limit-big28451 ---28452 duration_ms: 1707.4730028453 ...28454ok 5566 pummel/test-heapsnapshot-near-heap-limit-bounded28455 ---28456 duration_ms: 1607.5150028457 ...28458ok 5567 pummel/test-heapsnapshot-near-heap-limit-by-api28459 ---28460 duration_ms: 2609.3730028461 ...28462ok 5568 pummel/test-http-many-keep-alive-connections28463 ---28464 duration_ms: 707.1500028465 ...28466ok 5569 pummel/test-http-upload-timeout28467 ---28468 duration_ms: 3413.0510028469 ...28470ok 5570 pummel/test-https-large-response28471 ---28472 duration_ms: 167.7410028473 ...28474ok 5571 pummel/test-https-no-reader28475 ---28476 duration_ms: 2313.0570028477 ...28478ok 5572 pummel/test-keep-alive # skip test requires `wrk` to be installed first28479 ---28480 duration_ms: 69.5630028481 ...28482ok 5573 pummel/test-net-many-clients28483 ---28484 duration_ms: 134.0390028485 ...28486ok 5574 pummel/test-net-pause28487 ---28488 duration_ms: 2313.1500028489 ...28490ok 5575 pummel/test-net-pingpong28491 ---28492 duration_ms: 209.8880028493 ...28494ok 5576 pummel/test-net-pingpong-delay28495 ---28496 duration_ms: 406.3120028497 ...28498ok 5577 pummel/test-net-timeout28499 ---28500 duration_ms: 3714.1070028501 ...28502ok 5578 pummel/test-net-timeout228503 ---28504 duration_ms: 5221.7910028505 ...28506ok 5579 pummel/test-net-write-callbacks28507 ---28508 duration_ms: 706.7610028509 ...28510ok 5580 pummel/test-next-tick-infinite-calls28511 ---28512 duration_ms: 4008.3460028513 ...28514ok 5581 pummel/test-process-cpuUsage28515 ---28516 duration_ms: 707.0020028517 ...28518ok 5582 pummel/test-process-hrtime28519 ---28520 duration_ms: 2207.7790028521 ...28522ok 5583 pummel/test-regress-GH-89228523 ---28524 duration_ms: 261.0580028525 ...28526ok 5584 pummel/test-repl-paste-big-data28527 ---28528 duration_ms: 506.7890028529 ...28530ok 5585 pummel/test-stream-pipe-multi28531 ---28532 duration_ms: 821.5930028533 ...28534ok 5586 pummel/test-string-decoder-large-buffer28535 ---28536 duration_ms: 69.2760028537 ...28538ok 5587 pummel/test-structuredclone-jstransferable28539 ---28540 duration_ms: 806.5980028541 ...28542ok 5588 pummel/test-timers28543 ---28544 duration_ms: 3212.1890028545 ...28546ok 5589 pummel/test-tls-server-large-request28547 ---28548 duration_ms: 209.3220028549 ...28550ok 5590 pummel/test-tls-throttle28551 ---28552 duration_ms: 167.5600028553 ...28554ok 5591 pummel/test-vm-memleak28555 ---28556 duration_ms: 5409.4750028557 ...28558ok 5592 pummel/test-vm-race28559 ---28560 duration_ms: 5209.5760028561 ...28562ok 5593 pummel/test-watch-file28563 ---28564 duration_ms: 5223.1220028565 ...28566ok 5594 pummel/test-webcrypto-derivebits-pbkdf228567 ---28568 duration_ms: 2708.5040028569 ...28570ok 5595 pummel/test-webcrypto-kangarootwelve-32bit-overflow # skip only relevant when kMaxLength < 2^3228571 ---28572 duration_ms: 86.3980028573 ...28574ok 5596 pummel/test-worker-take-heapsnapshot28575 ---28576 duration_ms: 406.3290028577 ...28578ok 5597 pummel/test-zlib-zip-slow28579 ---28580 duration_ms: 11216.8720028581 ...28582ok 5598 wpt/test-abort28583 ---28584 duration_ms: 2312.1020028585 ...28586ok 5599 wpt/test-atob28587 ---28588 duration_ms: 167.5960028589 ...28590ok 5600 wpt/test-blob28591 ---28592 duration_ms: 261.0950028593 ...28594ok 5601 wpt/test-broadcastchannel28595 ---28596 duration_ms: 167.5030028597 ...28598ok 5602 wpt/test-compression28599 ---28600 duration_ms: 707.1790028601 ...28602ok 5603 wpt/test-console28603 ---28604 duration_ms: 209.1240028605 ...28606ok 5604 wpt/test-encoding28607 ---28608 duration_ms: 509.5600028609 ...28610ok 5605 wpt/test-events28611 ---28612 duration_ms: 209.0170028613 ...28614ok 5606 wpt/test-file28615 ---28616 duration_ms: 167.6540028617 ...28618ok 5607 wpt/test-hr-time28619 ---28620 duration_ms: 2212.4290028621 ...28622ok 5608 wpt/test-microtask-queuing28623 ---28624 duration_ms: 134.3670028625 ...28626ok 5609 wpt/test-performance-timeline28627 ---28628 duration_ms: 2411.8990028629 ...28630ok 5610 wpt/test-resource-timing28631 ---28632 duration_ms: 261.0720028633 ...28634ok 5611 wpt/test-streams28635 ---28636 duration_ms: 2611.4790028637 ...28638ok 5612 wpt/test-structured-clone28639 ---28640 duration_ms: 167.4900028641 ...28642ok 5613 wpt/test-timers28643 ---28644 duration_ms: 807.5970028645 ...28646ok 5614 wpt/test-url # skip Different versions of Ada affect the WPT tests28647 ---28648 duration_ms: 69.4240028649 ...28650ok 5615 wpt/test-urlpattern28651 ---28652 duration_ms: 209.2760028653 ...28654ok 5616 wpt/test-wasm-jsapi28655 ---28656 duration_ms: 910.4450028657 ...28658ok 5617 wpt/test-wasm-webapi28659 ---28660 duration_ms: 209.0630028661 ...28662ok 5618 wpt/test-web-locks28663 ---28664 duration_ms: 1507.7990028665 ...28666ok 5619 wpt/test-webcrypto28667 ---28668 duration_ms: 4953.7640028669 ...28670ok 5620 wpt/test-webidl28671 ---28672 duration_ms: 261.7770028673 ...28674ok 5621 wpt/test-webstorage28675 ---28676 duration_ms: 1507.3440028677 ...28678ok 5622 wpt/test-workers28679 ---28680 duration_ms: 607.0020028681 ...28682ok 5623 wasm-allocation/test-wasm-allocation28683 ---28684 duration_ms: 90.6870028685 ...28686ok 5624 wasm-allocation/test-wasm-allocation-auto-adapt28687 ---28688 duration_ms: 73.6210028689 ...28690ok 5625 wasm-allocation/test-wasm-allocation-disable-trap-handler28691 ---28692 duration_ms: 73.2540028693 ...28694ok 5626 wasm-allocation/test-wasm-allocation-memory6428695 ---28696 duration_ms: 73.4310028697 ...28698ok 5627 abort/test-abort-backtrace28699 ---28700 duration_ms: 212.8280028701 ...28702ok 5628 abort/test-abort-fatal-error28703 ---28704 duration_ms: 265.0660028705 ...28706ok 5629 abort/test-abort-uncaught-exception28707 ---28708 duration_ms: 264.7440028709 ...28710ok 5630 abort/test-addon-register-signal-handler # skip binding not built yet28711 ---28712 duration_ms: 73.4330028713 ...28714ok 5631 abort/test-addon-uv-handle-leak # skip binding not built yet28715 ---28716 duration_ms: 73.1140028717 ...28718ok 5632 abort/test-http-parser-consume28719 ---28720 duration_ms: 213.0930028721 ...28722ok 5633 abort/test-process-abort-exitcode28723 ---28724 duration_ms: 212.8300028725 ...28726ok 5634 abort/test-signal-handler28727 ---28728 duration_ms: 212.7430028729 ...28730ok 5635 abort/test-worker-abort-uncaught-exception28731 ---28732 duration_ms: 264.5290028733 ...28734ok 5636 abort/test-zlib-invalid-internals-usage28735 ---28736 duration_ms: 212.7920028737 ...28738ok 5637 sequential/test-async-wrap-getasyncid28739 ---28740 duration_ms: 209.2550028741 ...28742ok 5638 sequential/test-buffer-creation-regression28743 ---28744 duration_ms: 69.4240028745 ...28746ok 5639 sequential/test-child-process-emfile28747 ---28748 duration_ms: 167.1590028749 ...28750ok 5640 sequential/test-child-process-execsync28751 ---28752 duration_ms: 607.0620028753 ...28754ok 5641 sequential/test-child-process-exit28755 ---28756 duration_ms: 406.7220028757 ...28758ok 5642 sequential/test-child-process-pass-fd28759 ---28760 duration_ms: 508.8540028761 ...28762ok 5643 sequential/test-cli-syntax-bad28763 ---28764 duration_ms: 506.6440028765 ...28766ok 5644 sequential/test-cli-syntax-file-not-found28767 ---28768 duration_ms: 134.5090028769 ...28770ok 5645 sequential/test-cli-syntax-good28771 ---28772 duration_ms: 167.2560028773 ...28774ok 5646 sequential/test-cli-syntax-require28775 ---28776 duration_ms: 260.4540028777 ...28778ok 5647 sequential/test-cluster-inspect-brk28779 ---28780 duration_ms: 134.4560028781 ...28782ok 5648 sequential/test-cluster-net-listen-ipv6only-none28783 ---28784 duration_ms: 167.5390028785 ...28786ok 5649 sequential/test-cluster-net-listen-ipv6only-rr28787 ---28788 duration_ms: 167.5030028789 ...28790ok 5650 sequential/test-cluster-port-reuse-between-workers28791 ---28792 duration_ms: 261.0590028793 ...28794ok 5651 sequential/test-cluster-send-handle-large-payload28795 ---28796 duration_ms: 167.3960028797 ...28798ok 5652 sequential/test-cpu-prof-default28799 ---28800 duration_ms: 906.7130028801 ...28802ok 5653 sequential/test-cpu-prof-dir-absolute28803 ---28804 duration_ms: 906.8140028805 ...28806ok 5654 sequential/test-cpu-prof-dir-and-name28807 ---28808 duration_ms: 906.9180028809 ...28810ok 5655 sequential/test-cpu-prof-dir-relative28811 ---28812 duration_ms: 906.9290028813 ...28814ok 5656 sequential/test-cpu-prof-drained28815 ---28816 duration_ms: 906.6510028817 ...28818ok 5657 sequential/test-cpu-prof-exit28819 ---28820 duration_ms: 208.9250028821 ...28822ok 5658 sequential/test-cpu-prof-invalid-options28823 ---28824 duration_ms: 167.1600028825 ...28826ok 5659 sequential/test-cpu-prof-kill28827 ---28828 duration_ms: 208.6420028829 ...28830ok 5660 sequential/test-cpu-prof-name28831 ---28832 duration_ms: 1607.3080028833 ...28834ok 5661 sequential/test-cpu-prof-worker-argv28835 ---28836 duration_ms: 906.8930028837 ...28838ok 5662 sequential/test-crypto-timing-safe-equal28839 ---28840 duration_ms: 69.4560028841 ...28842ok 5663 sequential/test-crypto-timing-safe-equal-fast28843 ---28844 duration_ms: 86.1010028845 ...28846ok 5664 sequential/test-debug-prompt28847 ---28848 duration_ms: 607.3550028849 ...28850ok 5665 sequential/test-debugger-custom-port28851 ---28852 duration_ms: 607.0040028853 ...28854ok 5666 sequential/test-debugger-debug-brk28855 ---28856 duration_ms: 134.3510028857 ...28858ok 5667 sequential/test-debugger-invalid-args28859 ---28860 duration_ms: 5316.1500028861 ...28862ok 5668 sequential/test-debugger-launch28863 ---28864 duration_ms: 708.0200028865 ...28866ok 5669 sequential/test-debugger-pid28867 ---28868 duration_ms: 407.0810028869 ...28870ok 5670 sequential/test-deprecation-flags28871 ---28872 duration_ms: 134.6300028873 ...28874ok 5671 sequential/test-dgram-bind-shared-ports28875 ---28876 duration_ms: 260.8030028877 ...28878ok 5672 sequential/test-dgram-implicit-bind-failure28879 ---28880 duration_ms: 86.3990028881 ...28882ok 5673 sequential/test-dgram-pingpong28883 ---28884 duration_ms: 86.2900028885 ...28886ok 5674 sequential/test-diagnostic-dir-cpu-prof28887 ---28888 duration_ms: 1707.4680028889 ...28890ok 5675 sequential/test-diagnostic-dir-heap-prof28891 ---28892 duration_ms: 1207.1130028893 ...28894ok 5676 sequential/test-dtls-interop-openssl-client # skip DTLS is not enabled28895 ---28896 duration_ms: 69.4700028897 ...28898ok 5677 sequential/test-dtls-interop-openssl-server # skip DTLS is not enabled28899 ---28900 duration_ms: 69.2100028901 ...28902ok 5678 sequential/test-error-serdes28903 ---28904 duration_ms: 69.4860028905 ...28906ok 5679 sequential/test-fs-opendir-recursive28907 ---28908 duration_ms: 134.1110028909 ...28910ok 5680 sequential/test-fs-readdir-recursive28911 ---28912 duration_ms: 107.6580028913 ...28914ok 5681 sequential/test-fs-stat-sync-overflow28915 ---28916 duration_ms: 167.2830028917 ...28918ok 5682 sequential/test-gc-http-client28919 ---28920 duration_ms: 506.5380028921 ...28922ok 5683 sequential/test-gc-http-client-onerror28923 ---28924 duration_ms: 506.7250028925 ...28926ok 5684 sequential/test-gc-http-client-timeout28927 ---28928 duration_ms: 406.3890028929 ...28930ok 5685 sequential/test-get-heapsnapshot-options28931 ---28932 duration_ms: 1006.8550028933 ...28934ok 5686 sequential/test-heapdump28935 ---28936 duration_ms: 506.9920028937 ...28938ok 5687 sequential/test-heapdump-flag28939 ---28940 duration_ms: 406.4850028941 ...28942ok 5688 sequential/test-heapdump-flag-custom-dir28943 ---28944 duration_ms: 406.6320028945 ...28946ok 5689 sequential/test-http-econnrefused28947 ---28948 duration_ms: 86.6760028949 ...28950ok 5690 sequential/test-http-keep-alive-large-write28951 ---28952 duration_ms: 86.3230028953 ...28954ok 5691 sequential/test-http-keepalive-maxsockets28955 ---28956 duration_ms: 407.3640028957 ...28958ok 5692 sequential/test-http-regr-gh-292828959 ---28960 duration_ms: 107.6230028961 ...28962ok 5693 sequential/test-http-server-keep-alive-timeout-slow-client-headers28963 ---28964 duration_ms: 1912.5500028965 ...28966ok 5694 sequential/test-http-server-keep-alive-timeout-slow-server28967 ---28968 duration_ms: 708.5610028969 ...28970ok 5695 sequential/test-http2-max-session-memory28971 ---28972 duration_ms: 86.6510028973 ...28974ok 5696 sequential/test-http2-ping-flood28975 ---28976 duration_ms: 107.6780028977 ...28978ok 5697 sequential/test-http2-settings-flood28979 ---28980 duration_ms: 107.4630028981 ...28982ok 5698 sequential/test-http2-timeout-large-write28983 ---28984 duration_ms: 2813.1530028985 ...28986ok 5699 sequential/test-http2-timeout-large-write-file28987 ---28988 duration_ms: 2811.1450028989 ...28990ok 5700 sequential/test-https-connect-localport28991 ---28992 duration_ms: 6220.7900028993 ...28994ok 5701 sequential/test-https-server-keep-alive-timeout28995 ---28996 duration_ms: 1812.1370028997 ...28998ok 5702 sequential/test-init28999 ---29000 duration_ms: 167.4640029001 ...29002ok 5703 sequential/test-inspector-network-resource29003 ---29004 duration_ms: 1509.6270029005 ...29006ok 5704 sequential/test-inspector-open-dispose29007 ---29008 duration_ms: 167.5340029009 ...29010ok 5705 sequential/test-inspector-port-cluster29011 ---29012 duration_ms: 406.3490029013 ...29014ok 5706 sequential/test-module-loading29015 ---29016 duration_ms: 86.6470029017 ...29018ok 5707 sequential/test-net-GH-550429019 ---29020 duration_ms: 260.6140029021 ...29022ok 5708 sequential/test-net-better-error-messages-port29023 ---29024 duration_ms: 86.3970029025 ...29026ok 5709 sequential/test-net-connect-econnrefused29027 ---29028 duration_ms: 133.9610029029 ...29030ok 5710 sequential/test-net-connect-handle-econnrefused29031 ---29032 duration_ms: 86.3920029033 ...29034ok 5711 sequential/test-net-connect-local-error29035 ---29036 duration_ms: 69.3840029037 ...29038ok 5712 sequential/test-net-listen-ipv6only29039 ---29040 duration_ms: 86.2240029041 ...29042ok 5713 sequential/test-net-listen-shared-ports29043 ---29044 duration_ms: 260.3800029045 ...29046ok 5714 sequential/test-net-localport29047 ---29048 duration_ms: 69.3720029049 ...29050ok 5715 sequential/test-net-reconnect-error29051 ---29052 duration_ms: 86.1830029053 ...29054ok 5716 sequential/test-net-response-size29055 ---29056 duration_ms: 1307.3180029057 ...29058ok 5717 sequential/test-net-server-address29059 ---29060 duration_ms: 86.5550029061 ...29062ok 5718 sequential/test-net-server-bind29063 ---29064 duration_ms: 208.9290029065 ...29066ok 5719 sequential/test-net-server-listen-ipv6-link-local29067 ---29068 duration_ms: 86.5170029069 ...29070ok 5720 sequential/test-next-tick-error-spin29071 ---29072 duration_ms: 133.9990029073 ...29074ok 5721 sequential/test-perf-hooks29075 ---29076 duration_ms: 1208.9740029077 ...29078ok 5722 sequential/test-performance-eventloopdelay29079 ---29080 duration_ms: 7220.0970029081 ...29082ok 5723 sequential/test-pipe29083 ---29084 duration_ms: 4317.4800029085 ...29086ok 5724 sequential/test-process-title29087 ---29088 duration_ms: 134.3240029089 ...29090ok 5725 sequential/test-process-warnings29091 ---29092 duration_ms: 134.0960029093 ...29094ok 5726 sequential/test-repl-timeout-throw29095 ---29096 duration_ms: 260.6650029097 ...29098ok 5727 sequential/test-require-cache-without-stat29099 ---29100 duration_ms: 69.5860029101 ...29102ok 5728 sequential/test-resolution-inspect-brk29103 ---29104 duration_ms: 134.0290029105 ...29106ok 5729 sequential/test-stream2-fs29107 ---29108 duration_ms: 86.2580029109 ...29110ok 5730 sequential/test-stream2-stderr-sync29111 ---29112 duration_ms: 167.3890029113 ...29114ok 5731 sequential/test-timers-block-eventloop29115 ---29116 duration_ms: 107.7570029117 ...29118ok 5732 sequential/test-timers-set-interval-excludes-callback-duration29119 ---29120 duration_ms: 507.9300029121 ...29122ok 5733 sequential/test-tls-connect29123 ---29124 duration_ms: 86.6020029125 ...29126ok 5734 sequential/test-tls-lookup29127 ---29128 duration_ms: 86.4860029129 ...29130ok 5735 sequential/test-tls-psk-client # skip missing openssl cli29131 ---29132 duration_ms: 86.4100029133 ...29134ok 5736 sequential/test-tls-session-timeout # skip node compiled without OpenSSL CLI.29135 ---29136 duration_ms: 86.2380029137 ...29138ok 5737 sequential/test-util-debug29139 ---29140 duration_ms: 325.3470029141 ...29142ok 5738 sequential/test-vm-break-on-sigint29143 ---29144 duration_ms: 134.1680029145 ...29146ok 5739 sequential/test-vm-timeout-escape-promise-module-229147 ---29148 duration_ms: 86.4680029149 ...29150ok 5740 sequential/test-vm-timeout-rethrow29151 ---29152 duration_ms: 134.0300029153 ...29154ok 5741 sequential/test-watch-mode-restart-esm-loading-error29155 ---29156 duration_ms: 2311.2250029157 ...29158ok 5742 sequential/test-watch-mode-watch-flags29159 ---29160 duration_ms: 325.7610029161 ...29162ok 5743 sequential/test-watch-mode-worker29163 ---29164 duration_ms: 2210.0110029165 ...29166ok 5744 sequential/test-without-async-context-frame29167 ---29168 duration_ms: 1108.4530029169 ...29170ok 5745 sequential/test-worker-eventlooputil29171 ---29172 duration_ms: 261.4350029173 ...29174ok 5746 sequential/test-worker-fshandles-error-on-termination29175 ---29176 duration_ms: 261.2990029177 ...29178ok 5747 sequential/test-worker-fshandles-open-close-on-termination29179 ---29180 duration_ms: 260.8540029181 ...29182ok 5748 sequential/test-worker-heapsnapshot-options29183 ---29184 duration_ms: 606.9290029185 ...29186ok 5749 sequential/test-worker-prof29187 ---29188 duration_ms: 1907.1260029189 ...29190ok 5750 sequential/test-write-heapsnapshot-options29191 ---29192 duration_ms: 907.1630029193 ...29194ok 5751 sequential/test-zlib-crc32-fast-api29195 ---29196 duration_ms: 86.5650029197 ...29198ok 5752 known_issues/test-cli-print-var-crypto29199 ---29200 duration_ms: 167.4620029201 ...29202ok 5753 known_issues/test-cwd-enoent-file29203 ---29204 duration_ms: 134.2180029205 ...29206ok 5754 known_issues/test-dgram-bind-shared-ports-after-port-029207 ---29208 duration_ms: 208.9270029209 ...29210ok 5755 known_issues/test-fs-cp-async-buffer29211 ---29212 duration_ms: 69.3900029213 ...29214ok 5756 known_issues/test-fs-cp-filter29215 ---29216 duration_ms: 69.2050029217 ...29218ok 5757 known_issues/test-fs-cp-non-utf829219 ---29220 duration_ms: 69.2430029221 ...29222ok 5758 known_issues/test-fs-writeFileSync-invalid-windows29223 ---29224 duration_ms: 69.2480029225 ...29226ok 5759 known_issues/test-http-clientrequest-end-contentlength29227 ---29228 duration_ms: 86.2020029229 ...29230ok 5760 known_issues/test-http-clientrequest-end-empty-response-body29231 ---29232 duration_ms: 86.2700029233 ...29234ok 5761 known_issues/test-http-clientrequest-write-chunked29235 ---29236 duration_ms: 86.2240029237 ...29238ok 5762 known_issues/test-http-path-contains-unicode29239 ---29240 duration_ms: 69.3550029241 ...29242ok 5763 known_issues/test-inspector-cluster-port-clash29243 ---29244 duration_ms: 167.5070029245 ...29246ok 5764 known_issues/test-inspector-instrumentation-breakpoint29247 ---29248 duration_ms: 15345.1580029249 ...29250ok 5765 known_issues/test-repl-require-context29251 ---29252 duration_ms: 107.7890029253 ...29254ok 5766 known_issues/test-stdin-is-always-net.socket29255 ---29256 duration_ms: 167.4140029257 ...29258ok 5767 known_issues/test-stream-writable-sync-error29259 ---29260 duration_ms: 69.4360029261 ...29262ok 5768 known_issues/test-url-parse-conformance29263 ---29264 duration_ms: 107.6230029265 ...29266ok 5769 known_issues/test-vm-function-declaration-uses-define29267 ---29268 duration_ms: 69.4010029269 ...29270ok 5770 known_issues/test-vm-timeout-escape-nexttick29271 ---29272 duration_ms: 806.5270029273 ...2927429275Failed tests:29276out/Release/node /build/node-v26.9.0/test/parallel/test-fs-cp-async-file-modes.mjs29277make: *** [Makefile:631: test-ci-js] Error 1