spaces/spaces-os build #181 failed ← #180 #182 →
eval warnings
4 kinds
· 235 occurrences
- error ×2
- warn lib.nixos.evalModules is experimental and subject to change. See nixos/lib/default.nix ×21
- warn stdenv.isDarwin is deprecated, use stdenv.hostPlatform.isDarwin instead ×109
- warn stdenv.isLinux is deprecated, use stdenv.hostPlatform.isLinux instead ×103
12 failed ⚠ 9
| status | attribute | duration |
|---|---|---|
checks.x86_64-linux.hermes-remote
|
41m 28s | |
nodejs-slim-26.9.0: ... ok 5770 known_issues/test-vm-timeout-escape-nexttick --- duration_ms: 806.42400 ... Failed tests: out/Release/node /build/node-v …nodejs-slim-26.9.0: ... ok 5770 known_issues/test-vm-timeout-escape-nexttick --- duration_ms: 806.42400 ... Failed tests: out/Release/node /build/node-v26.9.0/test/parallel/test-fs-cp-async-file-modes.mjs make: *** [Makefile:631: test-ci-js] Error 1 |
||
checks.x86_64-linux.hermes-simplex-adapter
|
1h 46m | |
nodejs-slim-26.9.0: ... ok 5770 known_issues/test-vm-timeout-escape-nexttick --- duration_ms: 807.16400 ... Failed tests: out/Release/node /build/node-v …nodejs-slim-26.9.0: ... ok 5770 known_issues/test-vm-timeout-escape-nexttick --- duration_ms: 807.16400 ... Failed tests: out/Release/node /build/node-v26.9.0/test/parallel/test-fs-cp-async-file-modes.mjs make: *** [Makefile:631: test-ci-js] Error 1 |
||
checks.x86_64-linux.hermes-vm
|
19m 27s | |
nodejs-slim-26.9.0: ... ok 5770 sequential/test-zlib-crc32-fast-api --- duration_ms: 86.32600 ... Failed tests: out/Release/node /build/node-v26.9.0/tes …nodejs-slim-26.9.0: ... ok 5770 sequential/test-zlib-crc32-fast-api --- duration_ms: 86.32600 ... Failed tests: out/Release/node /build/node-v26.9.0/test/parallel/test-fs-cp-async-file-modes.mjs make: *** [Makefile:631: test-ci-js] Error 1 |
||
checks.x86_64-linux.nixos-installer-live
|
2h 28m | |
omp-17.2.15: at <anonymous> (/$bunfs/root/omp:52:15) at <anonymous> (/$bunfs/root/omp:458333:16) at <anonymous> (/$bunfs/root/omp:52:15) at <ano …omp-17.2.15:
at <anonymous> (/$bunfs/root/omp:52:15)
at <anonymous> (/$bunfs/root/omp:458333:16)
at <anonymous> (/$bunfs/root/omp:52:15)
at <anonymous> (/$bunfs/root/omp:458780:16)
at <anonymous> (/$bunfs/root/omp:52:15)
at <anonymous> (/$bunfs/root/omp:459094:16)
at <anonymous> (/$bunfs/root/omp:52:15)
at <anonymous> (/$bunfs/root/omp:615668:19)
nodejs-slim-26.9.0:
...
ok 5770 known_issues/test-vm-timeout-escape-nexttick
---
duration_ms: 806.88200
...
Failed tests:
out/Release/node /build/node-v26.9.0/test/parallel/test-fs-cp-async-file-modes.mjs
make: *** [Makefile:631: test-ci-js] Error 1
|
||
checks.x86_64-linux.nixos-installer-target
|
59m 53s | |
omp-17.2.15: at <anonymous> (/$bunfs/root/omp:52:15) at <anonymous> (/$bunfs/root/omp:458333:16) at <anonymous> (/$bunfs/root/omp:52:15) at <ano …omp-17.2.15:
at <anonymous> (/$bunfs/root/omp:52:15)
at <anonymous> (/$bunfs/root/omp:458333:16)
at <anonymous> (/$bunfs/root/omp:52:15)
at <anonymous> (/$bunfs/root/omp:458780:16)
at <anonymous> (/$bunfs/root/omp:52:15)
at <anonymous> (/$bunfs/root/omp:459094:16)
at <anonymous> (/$bunfs/root/omp:52:15)
at <anonymous> (/$bunfs/root/omp:615668:19)
nodejs-slim-26.9.0:
...
ok 5770 sequential/test-zlib-crc32-fast-api
---
duration_ms: 86.54600
...
Failed tests:
out/Release/node /build/node-v26.9.0/test/parallel/test-fs-cp-async-file-modes.mjs
make: *** [Makefile:631: test-ci-js] Error 1
|
||
checks.x86_64-linux.nixos-test-machine
|
1h 54m | |
omp-17.2.15: at <anonymous> (/$bunfs/root/omp:52:15) at <anonymous> (/$bunfs/root/omp:458333:16) at <anonymous> (/$bunfs/root/omp:52:15) at <ano …omp-17.2.15:
at <anonymous> (/$bunfs/root/omp:52:15)
at <anonymous> (/$bunfs/root/omp:458333:16)
at <anonymous> (/$bunfs/root/omp:52:15)
at <anonymous> (/$bunfs/root/omp:458780:16)
at <anonymous> (/$bunfs/root/omp:52:15)
at <anonymous> (/$bunfs/root/omp:459094:16)
at <anonymous> (/$bunfs/root/omp:52:15)
at <anonymous> (/$bunfs/root/omp:615668:19)
nodejs-slim-26.9.0:
...
ok 5770 sequential/test-zlib-crc32-fast-api
---
duration_ms: 107.68900
...
Failed tests:
out/Release/node /build/node-v26.9.0/test/parallel/test-fs-cp-async-file-modes.mjs
make: *** [Makefile:631: test-ci-js] Error 1
|
||
checks.x86_64-linux.pkgs-test-vm
|
1h 25m | |
omp-17.2.15: at <anonymous> (/$bunfs/root/omp:52:15) at <anonymous> (/$bunfs/root/omp:458333:16) at <anonymous> (/$bunfs/root/omp:52:15) at <ano …omp-17.2.15:
at <anonymous> (/$bunfs/root/omp:52:15)
at <anonymous> (/$bunfs/root/omp:458333:16)
at <anonymous> (/$bunfs/root/omp:52:15)
at <anonymous> (/$bunfs/root/omp:458780:16)
at <anonymous> (/$bunfs/root/omp:52:15)
at <anonymous> (/$bunfs/root/omp:459094:16)
at <anonymous> (/$bunfs/root/omp:52:15)
at <anonymous> (/$bunfs/root/omp:615668:19)
nodejs-slim-26.9.0:
...
ok 5770 known_issues/test-vm-timeout-escape-nexttick
---
duration_ms: 806.52700
...
Failed tests:
out/Release/node /build/node-v26.9.0/test/parallel/test-fs-cp-async-file-modes.mjs
make: *** [Makefile:631: test-ci-js] Error 1
|
||
checks.x86_64-linux.test-machine
|
59m 23s | |
omp-17.2.15: at <anonymous> (/$bunfs/root/omp:52:15) at <anonymous> (/$bunfs/root/omp:458333:16) at <anonymous> (/$bunfs/root/omp:52:15) at <ano …omp-17.2.15:
at <anonymous> (/$bunfs/root/omp:52:15)
at <anonymous> (/$bunfs/root/omp:458333:16)
at <anonymous> (/$bunfs/root/omp:52:15)
at <anonymous> (/$bunfs/root/omp:458780:16)
at <anonymous> (/$bunfs/root/omp:52:15)
at <anonymous> (/$bunfs/root/omp:459094:16)
at <anonymous> (/$bunfs/root/omp:52:15)
at <anonymous> (/$bunfs/root/omp:615668:19)
nodejs-slim-26.9.0:
...
ok 5770 wpt/test-workers
---
duration_ms: 606.73000
...
Failed tests:
out/Release/node /build/node-v26.9.0/test/parallel/test-fs-cp-async-file-modes.mjs
make: *** [Makefile:631: test-ci-js] Error 1
|
||
checks.x86_64-linux.treefmt
|
1s | |
treefmt-check: alice on - ]).services.hermes-microvm.settings ? providers; + ]).services.hermes-microvm.settings + …treefmt-check:
alice
on
- ]).services.hermes-microvm.settings ? providers;
+ ]).services.hermes-microvm.settings
+ ? providers;
expected = false;
};
};
|
||
checks.x86_64-linux.llama-swap
|
2h 15m | |
nodejs-slim-26.9.0: ... ok 5770 sequential/test-zlib-crc32-fast-api --- duration_ms: 108.06900 ... Failed tests: out/Release/node /build/node-v26.9.0/te …nodejs-slim-26.9.0: ... ok 5770 sequential/test-zlib-crc32-fast-api --- duration_ms: 108.06900 ... Failed tests: out/Release/node /build/node-v26.9.0/test/parallel/test-fs-cp-async-file-modes.mjs make: *** [Makefile:631: test-ci-js] Error 1 |
||
checks.x86_64-linux.pkgs-agent-vm
|
— | |
error: … while calling the 'derivationStrict' builtin at «nix-internal»/derivation-internal.nix:37:12: 36| 37| strict = …error:
… while calling the 'derivationStrict' builtin
at «nix-internal»/derivation-internal.nix:37:12:
36|
37| strict = derivationStrict drvAttrs;
| ^
38|
… while evaluating derivation 'agent-vm'
whose name attribute is located at «github:NixOS/nixpkgs/e554fab72f81915600f3f449b786fd9af40439a5?narHash=sha256-ZKhUe/2IJUq1JhKxKMu8rbkgSGmPP2ZCqlIPn40aGCM%3D»/pkgs/stdenv/generic/make-derivation.nix:651:11
… while evaluating attribute 'text' of derivation 'agent-vm'
at «github:NixOS/nixpkgs/e554fab72f81915600f3f449b786fd9af40439a5?narHash=sha256-ZKhUe/2IJUq1JhKxKMu8rbkgSGmPP2ZCqlIPn40aGCM%3D»/pkgs/build-support/trivial-builders/default.nix:135:11:
134| name
135| text
| ^
136| executable
… while evaluating the option `virtualisation.vmVariant.system.build.toplevel':
… while evaluating definitions from `/nix/store/b8xf6hsi4wfakzvn6lsi040bh9n8djcc-source/nixos/modules/system/activation/top-level.nix':
(stack trace truncated; use '--show-trace' to show the full, detailed trace)
error:
Failed assertions:
- The option definition `services.journald.extraConfig' in `/nix/store/c90f6gw7sl77w6gginxdnhfl7pfbw5f1-source/modules/nixos/test-support' no longer has any effect; please remove it.
Use services.journald.settings.Journal instead.
|
||
checks.x86_64-linux.pkgs-llama-cpp-cuda
|
17m 43s | |
nodejs-slim-26.9.0: ... ok 5770 known_issues/test-vm-timeout-escape-nexttick --- duration_ms: 806.42100 ... Failed tests: out/Release/node /build/node-v …nodejs-slim-26.9.0: ... ok 5770 known_issues/test-vm-timeout-escape-nexttick --- duration_ms: 806.42100 ... Failed tests: out/Release/node /build/node-v26.9.0/test/parallel/test-fs-cp-async-file-modes.mjs make: *** [Makefile:631: test-ci-js] Error 1 |
||
10 succeeded ⚠ 2
| status | attribute | duration |
|---|---|---|
checks.x86_64-linux.docs-reference-current
|
0s | |
checks.x86_64-linux.pkgs-spaces-install-backend
|
6s | |
checks.x86_64-linux.eval-tests
|
7m 34s | |
checks.x86_64-linux.inputs
|
1s | |
checks.x86_64-linux.repo-no-big-files
|
0s | |
checks.x86_64-linux.repo-no-dead-component-names
|
3s | |
checks.x86_64-linux.spaces-install-secret-dialog
|
10s | |
checks.x86_64-linux.spaces-integration-approval-vm
|
53s | |
checks.x86_64-linux.spaces-integration-confirm
|
9s | |
checks.x86_64-linux.spaces-nixos-apply-vm
|
57s |
83 already built ⚠ 13
| status | attribute | duration |
|---|---|---|
checks.x86_64-linux.hermes-skill-clis-on-path
|
— | |
checks.x86_64-linux.pkgs-docs-reference
|
— | |
checks.x86_64-linux.pkgs-docs-update
|
— | |
checks.x86_64-linux.pkgs-voxtype-parakeet-cuda
|
— | |
checks.x86_64-linux.pkgs-voxtype-tuner
|
— | |
checks.x86_64-linux.spaces-cosmic-dock-favorites
|
— | |
checks.x86_64-linux.spaces-install-session
|
— | |
checks.x86_64-linux.spaces-integrations-stager-lifecycle
|
— | |
checks.x86_64-linux.spaces-location-fix-grant
|
— | |
checks.x86_64-linux.spaces-nixos-apply-dispatch
|
— | |
checks.x86_64-linux.spaces-noctalia-artifacts
|
— | |
checks.x86_64-linux.spaces-offline-wiki-zim-grant
|
— | |
checks.x86_64-linux.spaces-voice-record-toggle
|
— | |
checks.x86_64-linux.devshell-default
|
— | |
checks.x86_64-linux.devshell-voxtype-tuner
|
— | |
checks.x86_64-linux.hermes-desktop-ready
|
— | |
checks.x86_64-linux.hermes-desktop-session
|
— | |
checks.x86_64-linux.hermes-kvm-preflight
|
— | |
checks.x86_64-linux.hermes-remote-port-guard
|
— | |
checks.x86_64-linux.hermes-simplex-address-retry
|
— | |
checks.x86_64-linux.hermes-virtio-gpu
|
— | |
checks.x86_64-linux.installer-unplug-hook
|
— | |
checks.x86_64-linux.pkgs-agent-skills
|
— | |
checks.x86_64-linux.pkgs-docs-render
|
— | |
checks.x86_64-linux.pkgs-installer-iso
|
— | |
checks.x86_64-linux.pkgs-installer-vm
|
— | |
checks.x86_64-linux.pkgs-integration-caldav
|
— | |
checks.x86_64-linux.pkgs-integration-contacts
|
— | |
checks.x86_64-linux.pkgs-integration-github
|
— | |
checks.x86_64-linux.pkgs-integration-location
|
— | |
checks.x86_64-linux.pkgs-integration-mail
|
— | |
checks.x86_64-linux.pkgs-integration-nixos
|
— | |
checks.x86_64-linux.pkgs-integration-offline-wiki
|
— | |
checks.x86_64-linux.pkgs-integration-proton
|
— | |
checks.x86_64-linux.pkgs-integration-signal
|
— | |
checks.x86_64-linux.pkgs-landlock-exec
|
— | |
checks.x86_64-linux.pkgs-osm-cli
|
— | |
checks.x86_64-linux.pkgs-python-libzim
|
— | |
checks.x86_64-linux.pkgs-signal-cli
|
— | |
checks.x86_64-linux.pkgs-simplex-chat
|
— | |
checks.x86_64-linux.pkgs-simplex-phone
|
— | |
checks.x86_64-linux.pkgs-skill-config
|
— | |
checks.x86_64-linux.pkgs-spaces-grub-theme
|
— | |
checks.x86_64-linux.pkgs-spaces-himalaya-core
|
— | |
checks.x86_64-linux.pkgs-spaces-install-console
|
— | |
checks.x86_64-linux.pkgs-spaces-installer-session
|
— | |
checks.x86_64-linux.pkgs-spaces-install-secret
|
— | |
checks.x86_64-linux.pkgs-spaces-integration-confirm
|
— | |
checks.x86_64-linux.pkgs-spaces-integrationd
|
— | |
checks.x86_64-linux.pkgs-spaces-integration-gateway
|
— | |
checks.x86_64-linux.pkgs-spaces-integration-mcp
|
— | |
checks.x86_64-linux.pkgs-spaces-integrations
|
— | |
checks.x86_64-linux.pkgs-spaces-landlock-policy
|
— | |
checks.x86_64-linux.pkgs-spaces-logos
|
— | |
checks.x86_64-linux.pkgs-spaces-restore
|
— | |
checks.x86_64-linux.pkgs-spaces-voice-indicator
|
— | |
checks.x86_64-linux.pkgs-wikidata-cli
|
— | |
checks.x86_64-linux.pkgs-wikipedia-cli
|
— | |
checks.x86_64-linux.proton-bridge-wrapper-state
|
— | |
checks.x86_64-linux.spaces-command-wrapper
|
— | |
checks.x86_64-linux.spaces-integration-gateway-e2e
|
— | |
checks.x86_64-linux.spaces-integration-gateway-unit
|
— | |
checks.x86_64-linux.spaces-integration-proton-tls
|
— | |
checks.x86_64-linux.spaces-integrations-app-bridge
|
— | |
checks.x86_64-linux.spaces-integrations-app-form
|
— | |
checks.x86_64-linux.spaces-integrations-app-managed
|
— | |
checks.x86_64-linux.spaces-integrations-app-ndjson-socket
|
— | |
checks.x86_64-linux.spaces-integrations-app-overview
|
— | |
checks.x86_64-linux.spaces-integrations-app-qmllint
|
— | |
checks.x86_64-linux.spaces-integrations-app-setup
|
— | |
checks.x86_64-linux.spaces-integrations-i18n-parity
|
— | |
checks.x86_64-linux.spaces-integrations-mcp-profile
|
— | |
checks.x86_64-linux.spaces-integrations-policy-lowering
|
— | |
checks.x86_64-linux.spaces-integration-wrapper-shell
|
— | |
checks.x86_64-linux.spaces-landlock-policy
|
— | |
checks.x86_64-linux.spaces-signal-cli-flags
|
— | |
checks.x86_64-linux.spaces-voice-indicator-bar-geometry
|
— | |
checks.x86_64-linux.spaces-voice-indicator-plugin-files
|
— | |
checks.x86_64-linux.spaces-voice-indicator-plugin-state
|
— | |
checks.x86_64-linux.spaces-voice-indicator-qmllint
|
— | |
checks.x86_64-linux.spaces-voice-indicator-state
|
— | |
checks.x86_64-linux.spaces-voice-indicator-warning
|
— | |
checks.x86_64-linux.voxtype-user-override-wrapper
|
— |