nixbot

builds

failed nodejs-slim-26.9.0 checks.x86_64-linux.pkgs-llama-cpp-cuda · build #181 · raw

1structuredAttrs is enabled
unpackPhase
2unpacking source archive /nix/store/7ajvk1c4mspigbdgf21bn9d7f7p9kmgk-node-v26.9.0.tar.xz3source root is node-v26.9.04setting SOURCE_DATE_EPOCH to timestamp 1789550914 of file "node-v26.9.0/tools/nix/v8.nix"
patchPhase
5applying patch /nix/store/j4p9lc7z8hi4g40cpqpj3qxb9a7bvanp-configure-armv6-vfpv2.patch6patching file configure.py7Hunk #1 succeeded at 49 with fuzz 1 (offset -1 lines).8applying patch /nix/store/igz0qnjkvwi4f2mn7i13h3ndxl9n5ryi-node-npm-build-npm-package-logic.patch9patching file deps/npm/node_modules/@npmcli/run-script/lib/set-path.js10Hunk #1 succeeded at 13 with fuzz 2 (offset 1 line).11Hunk #2 succeeded at 37 (offset 8 lines).12patching file deps/npm/node_modules/pacote/lib/git.js13Hunk #1 succeeded at 186 (offset -2 lines).14patching file deps/npm/node_modules/@npmcli/arborist/lib/arborist/build-ideal-tree.js15Hunk #1 succeeded at 802 (offset 62 lines).16patching file deps/npm/node_modules/@npmcli/arborist/lib/arborist/load-actual.js17Hunk #1 succeeded at 121 with fuzz 1 (offset -26 lines).18applying patch /nix/store/57n0csr7hpdd0y91ljxpiwlfw7fsx3kl-use-correct-env-in-tests.patch19patching file test/parallel/test-child-process-default-options.js20patching file test/parallel/test-child-process-env.js21patching file test/parallel/test-child-process-exec-env.js22applying patch /nix/store/p2mhv95s89kaqmdynhz6y6asalf8y4dh-bin-sh-node-run-v22.patch23patching file test/fixtures/run-script/node_modules/.bin/positional-args24Hunk #1 succeeded at 1 with fuzz 1.25applying patch /nix/store/3za8p3x3hjfr1a9b1lc3z4aapp9sm2ja-use-nix-codesign.patch26patching file test/parallel/test-macos-app-sandbox.js27applying patch /nix/store/6whc7i794ygkcwjwrprw7y9aglfl238g-fix-temporal-integration-with-shared-icu.patch28patching file deps/v8/src/objects/js-temporal-zoneinfo64.cc29patching file tools/v8_gypfiles/v8.gyp30Hunk #1 succeeded at 1398 (offset 19 lines).31Hunk #2 succeeded at 2051 (offset 93 lines).
updateAutotoolsGnuConfigScriptsPhase
32Updating Autotools / GNU config script to a newer upstream version: ./deps/libffi/config.sub33Updating Autotools / GNU config script to a newer upstream version: ./deps/cares/config/config.sub34Updating Autotools / GNU config script to a newer upstream version: ./deps/ngtcp2/ngtcp2/third-party/libev/config.sub35Updating Autotools / GNU config script to a newer upstream version: ./deps/libffi/config.guess36Updating Autotools / GNU config script to a newer upstream version: ./deps/cares/config/config.guess37Updating Autotools / GNU config script to a newer upstream version: ./deps/ngtcp2/ngtcp2/third-party/libev/config.guess
configurePhase
38fixing libtool script ./deps/libffi/ltmain.sh39fixing libtool script ./deps/cares/config/ltmain.sh40fixing libtool script ./deps/ngtcp2/ngtcp2/third-party/libev/ltmain.sh41./deps/libffi/configure42./deps/cares/configure43./deps/ngtcp2/ngtcp2/third-party/libev/configure44configure flags: --prefix=/nix/store/mn8r5sjblqmigxv5lg89q4wcj5zqb16n-nodejs-slim-26.9.0 --ninja --with-intl=system-icu --openssl-use-def-ca-store --no-cross-compiling --dest-os=linux --dest-cpu=x64 --v8-enable-temporal-support --use-prefix-to-find-headers --shared-abseil --shared-abseil-libpath=/nix/store/iqvb7h1ykhm12304qwx17xbncrhhy1g4-abseil-cpp-20260107.1/lib --shared-ada --shared-ada-libpath=/nix/store/vk3yq4nzlrdvq1qxgy3764qaycanr0mc-ada-4.0.0/lib --shared-brotli --shared-brotli-libpath=/nix/store/xhgd6rb4h8ssid9yw8nvw74cwq69md5y-brotli-1.2.0-lib/lib --shared-cares --shared-cares-libpath=/nix/store/68syfccdbv3hlz7imlc9xl9fzyz4v8gx-c-ares-1.34.8/lib --shared-ffi --shared-ffi-libpath=/nix/store/3r5wfb1dl3sfknvy1yringvmap0hxj4r-libffi-3.8.0/lib --shared-gtest --shared-gtest-libpath=/nix/store/5sdsmm8s00hck28yp95fk993rg42mqsp-gtest-1.18.0/lib --shared-hdr-histogram --shared-hdr-histogram-libpath=/nix/store/9g532g9jf92xy9xh68p99ml815q11zs0-hdrhistogram_c-0.11.10/lib --shared-highway --shared-highway-libpath=/nix/store/xs1jbkdzxs4ym0rh89nx8xfwj387x3aj-libhwy-1.4.0/lib --shared-http-parser --shared-http-parser-libpath=/nix/store/1lw7d9jsv7qb6nvc4fmvvqsyphaacqcs-llhttp-9.4.3/lib --shared-libuv --shared-libuv-libpath=/nix/store/68b1blnvl4scgdq48d4p7h4lw4pm5w0w-libuv-1.52.1/lib --shared-lief --shared-lief-libpath=/nix/store/nx4g3j20wvgq36b406q6rysvqzzrxaci-lief-0.17.6/lib --shared-merve --shared-merve-libpath=/nix/store/2gj58j8rd88kaan7bsqhl9fjxxp11qqi-merve-1.2.2/lib --shared-nbytes --shared-nbytes-libpath=/nix/store/zf8c839ahp1fn736lih7ai2y14rrx2gn-nbytes-0.1.4/lib --shared-nghttp2 --shared-nghttp2-libpath=/nix/store/6avzrsm02jh7q48ym3hgznj3ypc2shc2-nghttp2-1.70.0-lib/lib --shared-nghttp3 --shared-nghttp3-libpath=/nix/store/dki4fkk75v2x4aqkszmi257wxq6rkkyr-nghttp3-1.16.0/lib --shared-ngtcp2 --shared-ngtcp2-libpath=/nix/store/2hc131frgdz45bjbajmpvlrj185lah7p-ngtcp2-1.23.0/lib --shared-openssl --shared-openssl-libpath=/nix/store/yj34vymbqf7mf4lmffipy8jqc4kwr1mc-openssl-3.6.4/lib --shared-simdjson --shared-simdjson-libpath=/nix/store/129shchmqszagbb0m8kk7ddzb7nnklxv-simdjson-4.6.8/lib --shared-simdutf --shared-simdutf-libpath=/nix/store/dw6xlar7m4qfrhbk63zhcc5pmixa1ga1-simdutf-9.1.0/lib --shared-sqlite --shared-sqlite-libpath=/nix/store/7a0nx1a0rdc5s07vxrsdhplqnzncl5z9-sqlite-3.53.3/lib --shared-temporal_capi --shared-temporal_capi-libpath=/nix/store/7hrx4vyx67h46xxwqj3zw4nafa1m8d04-temporal_capi-0.2.6/lib --shared-uvwasi --shared-uvwasi-libpath=/nix/store/qnbgx63w8yya5330xcxyixja3ah6gfzm-uvwasi-0.0.23/lib --shared-zlib --shared-zlib-libpath=/nix/store/lw86vj9kfwgvlivg3p8qg2nibpmhmsl9-zlib-1.3.2/lib --shared-zstd --shared-zstd-libpath=/nix/store/8ik1d1r4l2jzm9mjh6bc0a13yczx62wg-zstd-1.5.7/lib45INFO: configure completed successfully
buildPhase
46build flags: -j32 SHELL=/nix/store/svx59425zxp552p2b8gm11qj5r09b56i-bash-5.3p15/bin/bash47TERM=dumb ninja -C out/Release -j3248ninja: Entering directory `out/Release'49[1/1871] CXX obj/deps/v8/src/base/v8_libbase.abort-mode.o50[2/1871] CXX obj/deps/v8/src/base/v8_libbase.division-by-constant.o51[3/1871] CXX obj/deps/v8/src/base/v8_libbase.fpu.o52[4/1871] CXX obj/deps/v8/src/base/v8_libbase.once.o53[5/1871] CXX obj/deps/v8/src/base/numbers/v8_libbase.cached-powers.o54[6/1871] CXX obj/deps/v8/src/base/numbers/v8_libbase.diy-fp.o55[7/1871] CXX obj/deps/v8/src/base/v8_libbase.sys-info.o56[8/1871] CXX obj/deps/v8/src/base/v8_libbase.cpu.o57[9/1871] CXX obj/deps/v8/src/base/v8_libbase.file-utils.o58[10/1871] CXX obj/deps/v8/src/base/debug/v8_libbase.stack_trace.o59[11/1871] CXX obj/deps/v8/src/base/numbers/v8_libbase.fast-dtoa.o60[12/1871] CXX obj/deps/v8/src/base/numbers/v8_libbase.dtoa.o61[13/1871] CXX obj/deps/v8/src/base/numbers/v8_libbase.bignum.o62[14/1871] CXX obj/deps/v8/src/base/platform/v8_libbase.platform.o63[15/1871] CXX obj/deps/v8/src/base/sanitizer/v8_libbase.lsan-virtual-address-space.o64[16/1871] CXX obj/deps/v8/src/base/platform/v8_libbase.semaphore.o65[17/1871] CXX obj/deps/v8/src/base/v8_libbase.bits.o66[18/1871] CXX obj/deps/v8/src/base/v8_libbase.page-allocator.o67[19/1871] CXX obj/deps/v8/src/base/v8_libbase.strings.o68[20/1871] CXX obj/deps/v8/src/base/platform/v8_libbase.memory-protection-key.o69[21/1871] CXX obj/deps/v8/src/base/numbers/v8_libbase.strtod.o70[22/1871] CXX obj/deps/v8/src/base/v8_libbase.region-allocator.o71[23/1871] CXX obj/deps/v8/src/base/numbers/v8_libbase.bignum-dtoa.o72[24/1871] CXX obj/deps/v8/src/base/sanitizer/v8_libbase.lsan-page-allocator.o73[25/1871] CXX obj/deps/v8/src/base/numbers/v8_libbase.fixed-dtoa.o74[26/1871] CXX obj/deps/v8/src/base/v8_libbase.ieee754.o75[27/1871] CXX obj/deps/v8/src/base/platform/v8_libbase.time.o76[28/1871] CXX obj/deps/v8/src/base/v8_libbase.vlq-base64.o77[29/1871] CXX obj/deps/v8/src/base/platform/v8_libbase.mutex.o78[30/1871] CXX obj/deps/v8/src/base/v8_libbase.bounded-page-allocator.o79[31/1871] CXX obj/deps/v8/src/base/v8_libbase.logging.o80[32/1871] CXX obj/deps/v8/src/base/platform/v8_libbase.platform-posix-time.o81[33/1871] CXX obj/deps/v8/src/base/platform/v8_libbase.condition-variable.o82[34/1871] CXX obj/deps/v8/src/base/v8_libbase.emulated-virtual-address-subspace.o83[35/1871] CXX obj/deps/v8/src/base/platform/v8_libbase.platform-linux.o84[36/1871] CXX obj/deps/v8/src/base/debug/v8_libbase.stack_trace_posix.o85[37/1871] CXX obj/deps/v8/src/base/v8_libbase.virtual-address-space.o86[38/1871] CXX obj/deps/v8/src/base/utils/v8_libbase.random-number-generator.o87[39/1871] ACTION Checking inspector protocol compatibility88[40/1871] CXX obj/deps/v8/src/base/v8_libbase.virtual-address-space-page-allocator.o89[41/1871] ACTION Generating temporal zoneinfo static data90[42/1871] CXX obj/deps/v8/src/base/platform/v8_libbase.platform-posix.o91[43/1871] AR obj/tools/v8_gypfiles/libv8_libbase.a92[44/1871] STAMP obj/tools/v8_gypfiles/v8_flags.actions_depends.stamp93[45/1871] CXX obj/deps/v8/src/torque/torque_base.source-positions.o94[46/1871] CXX obj/deps/v8/src/torque/torque_base.cpp-builder.o95[47/1871] CC obj/deps/v8/third_party/zlib/v8_zlib.compress.o96cc1: warning: command-line option '-fvisibility-inlines-hidden' is valid for C++/ObjC++ but not for C97[48/1871] CC obj/deps/v8/third_party/zlib/v8_zlib.cpu_features.o98cc1: warning: command-line option '-fvisibility-inlines-hidden' is valid for C++/ObjC++ but not for C99[49/1871] ACTION Generating inspector protocol sources from protocol json100[50/1871] STAMP obj/tools/v8_gypfiles/v8_inspector_headers.actions_rules_copies.stamp101[51/1871] CC obj/deps/v8/third_party/zlib/v8_zlib.adler32.o102cc1: warning: command-line option '-fvisibility-inlines-hidden' is valid for C++/ObjC++ but not for C103[52/1871] CC obj/deps/v8/third_party/zlib/v8_zlib.crc32.o104cc1: warning: command-line option '-fvisibility-inlines-hidden' is valid for C++/ObjC++ but not for C105[53/1871] CC obj/deps/v8/third_party/zlib/v8_zlib.gzclose.o106cc1: warning: command-line option '-fvisibility-inlines-hidden' is valid for C++/ObjC++ but not for C107[54/1871] CC obj/deps/v8/third_party/zlib/v8_zlib.gzlib.o108cc1: warning: command-line option '-fvisibility-inlines-hidden' is valid for C++/ObjC++ but not for C109[55/1871] CC obj/deps/v8/third_party/zlib/v8_zlib.gzread.o110cc1: warning: command-line option '-fvisibility-inlines-hidden' is valid for C++/ObjC++ but not for C111[56/1871] CC obj/deps/v8/third_party/zlib/v8_zlib.gzwrite.o112cc1: warning: command-line option '-fvisibility-inlines-hidden' is valid for C++/ObjC++ but not for C113[57/1871] CXX obj/deps/v8/src/interpreter/bytecode_builtins_list_generator.bytecode-operands.o114[58/1871] CXX obj/deps/v8/src/torque/torque_base.global-context.o115[59/1871] CXX obj/deps/v8/src/torque/torque_base.earley-parser.o116[60/1871] CC obj/deps/v8/third_party/zlib/v8_zlib.infback.o117cc1: warning: command-line option '-fvisibility-inlines-hidden' is valid for C++/ObjC++ but not for C118[61/1871] CC obj/deps/v8/third_party/zlib/v8_zlib.inffast.o119cc1: warning: command-line option '-fvisibility-inlines-hidden' is valid for C++/ObjC++ but not for C120[62/1871] CC obj/deps/v8/third_party/zlib/v8_zlib.inftrees.o121cc1: warning: command-line option '-fvisibility-inlines-hidden' is valid for C++/ObjC++ but not for C122[63/1871] CC obj/deps/v8/third_party/zlib/v8_zlib.uncompr.o123cc1: warning: command-line option '-fvisibility-inlines-hidden' is valid for C++/ObjC++ but not for C124[64/1871] CXX obj/deps/v8/src/builtins/bytecode_builtins_list_generator.generate-bytecodes-builtins-list.o125[65/1871] CC obj/deps/v8/third_party/zlib/v8_zlib.deflate.o126cc1: warning: command-line option '-fvisibility-inlines-hidden' is valid for C++/ObjC++ but not for C127[66/1871] CXX obj/deps/v8/src/torque/torque_base.torque-code-generator.o128[67/1871] CXX obj/deps/v8/src/torque/torque_base.server-data.o129[68/1871] CC obj/deps/v8/third_party/zlib/v8_zlib.zutil.o130cc1: warning: command-line option '-fvisibility-inlines-hidden' is valid for C++/ObjC++ but not for C131[69/1871] CXX obj/deps/v8/third_party/zlib/google/v8_zlib.compression_utils_portable.o132[70/1871] CC obj/deps/v8/third_party/zlib/v8_zlib.trees.o133cc1: warning: command-line option '-fvisibility-inlines-hidden' is valid for C++/ObjC++ but not for C134[71/1871] CXX obj/deps/v8/src/interpreter/bytecode_builtins_list_generator.bytecodes.o135[72/1871] CXX obj/deps/v8/src/regexp/gen-regexp-special-case.gen-regexp-special-case.o136[73/1871] CC obj/deps/v8/third_party/zlib/v8_zlib.inflate.o137cc1: warning: command-line option '-fvisibility-inlines-hidden' is valid for C++/ObjC++ but not for C138[74/1871] CXX obj/deps/v8/src/torque/torque_base.type-inference.o139[75/1871] CXX obj/deps/v8/src/torque/torque_base.type-oracle.o140[76/1871] CXX obj/deps/v8/src/libplatform/v8_libplatform.default-thread-isolated-allocator.o141[77/1871] CXX obj/deps/v8/src/torque/torque_base.utils.o142[78/1871] CXX obj/deps/v8/src/torque/torque_base.kythe-data.o143[79/1871] LINK gen-regexp-special-case144[80/1871] ACTION run_gen-regexp-special-case: run_gen-regexp-special-case_action_72d03329d19e24c609ee6e65eeeb110034e9261c37b8a8d83522628d574e9fa7145[81/1871] LINK bytecode_builtins_list_generator146[82/1871] CXX obj/deps/v8/src/torque/torque_base.declarable.o147[83/1871] AR obj/tools/v8_gypfiles/libv8_zlib.a148[84/1871] ACTION generate_bytecode_builtins_list: generate_bytecode_builtins_list_action_73a03d1964edbe79fc19deb968fa21d5c456544c3d095b62158c8959ed2aeed1149[85/1871] CXX obj/deps/v8/src/libplatform/tracing/v8_libplatform.trace-object.o150[86/1871] CXX obj/deps/v8/src/libplatform/tracing/v8_libplatform.trace-writer.o151[87/1871] CXX obj/src/node_js2c.embedded_data.o152[88/1871] CXX obj/deps/v8/src/torque/torque_base.class-debug-reader-generator.o153[89/1871] CXX obj/deps/v8/src/torque/torque_base.cfg.o154[90/1871] CXX obj/deps/v8/src/libplatform/v8_libplatform.delayed-task-queue.o155[91/1871] CXX obj/src/node_js2c.builtin_info.o156[92/1871] CXX obj/deps/v8/src/libplatform/tracing/v8_libplatform.trace-config.o157[93/1871] CXX obj/deps/v8/src/libplatform/tracing/v8_libplatform.trace-buffer.o158[94/1871] CXX obj/deps/v8/src/libplatform/v8_libplatform.task-queue.o159[95/1871] CC obj/test/overlapped-checker/overlapped-checker.main_unix.o160[96/1871] CXX obj/deps/inspector_protocol/crdtp/crdtp.error_support.o161[97/1871] CXX obj/deps/ncrypto/ncrypto_engine.engine.o162[98/1871] AR obj/deps/ncrypto/libncrypto_engine.a163[99/1871] CC obj/test/nop/nop.nop.o164[100/1871] CXX obj/deps/v8/src/libplatform/v8_libplatform.default-platform.o165[101/1871] CXX obj/deps/v8/src/libplatform/v8_libplatform.default-job.o166[102/1871] CXX obj/deps/inspector_protocol/crdtp/crdtp.span.o167[103/1871] CXX obj/deps/inspector_protocol/crdtp/crdtp.json_platform.o168[104/1871] CXX obj/deps/inspector_protocol/crdtp/crdtp.status.o169[105/1871] CXX obj/deps/inspector_protocol/crdtp/crdtp.serializable.o170[106/1871] CXX obj/deps/v8/src/torque/torque.torque.o171[107/1871] LINK overlapped-checker172[108/1871] LINK nop173[109/1871] CXX obj/deps/v8/src/libplatform/v8_libplatform.worker-thread.o174[110/1871] CXX obj/deps/v8/src/libplatform/v8_libplatform.default-worker-threads-task-runner.o175[111/1871] CXX obj/deps/v8/src/libplatform/v8_libplatform.default-foreground-task-runner.o176[112/1871] CXX obj/deps/v8/src/torque/torque_base.declarations.o177[113/1871] CXX obj/deps/v8/src/torque/torque_base.cc-generator.o178[114/1871] CXX obj/deps/v8/src/torque/torque_base.instance-type-generator.o179[115/1871] CXX obj/deps/v8/src/torque/torque_base.torque-compiler.o180[116/1871] CXX obj/deps/v8/src/torque/torque_base.declaration-visitor.o181[117/1871] CXX obj/deps/v8/src/torque/torque_base.csa-generator.o182[118/1871] CXX obj/deps/v8/src/libplatform/tracing/v8_libplatform.tracing-controller.o183[119/1871] AR obj/tools/v8_gypfiles/libv8_libplatform.a184[120/1871] CXX obj/deps/v8/src/torque/torque_base.instructions.o185[121/1871] CXX obj/deps/inspector_protocol/crdtp/crdtp.protocol_core.o186[122/1871] CXX obj/deps/inspector_protocol/crdtp/crdtp.cbor.o187[123/1871] CXX obj/deps/v8/src/torque/torque_base.type-visitor.o188[124/1871] CXX obj/deps/inspector_protocol/crdtp/crdtp.dispatch.o189[125/1871] CXX obj/tools/node_js2c.js2c.o190[126/1871] LINK node_js2c191[127/1871] STAMP obj/node_base.actions_depends.stamp192[128/1871] ACTION node_base: convert_node_protocol_to_json_f26a10641803f604d1307d23f68bde8b450ad8f073bd43313642df31e7a3478c193[129/1871] ACTION node_base: node_js2c_f26a10641803f604d1307d23f68bde8b450ad8f073bd43313642df31e7a3478c194[130/1871] ACTION node_base: concatenate_protocols_f26a10641803f604d1307d23f68bde8b450ad8f073bd43313642df31e7a3478c195[131/1871] ACTION node_base: v8_inspector_compress_protocol_json_f26a10641803f604d1307d23f68bde8b450ad8f073bd43313642df31e7a3478c196[132/1871] ACTION Generating node protocol sources from protocol json197[133/1871] STAMP obj/node_base.actions_rules_copies.stamp198[134/1871] CXX obj/deps/inspector_protocol/crdtp/crdtp.json.o199[135/1871] CXX obj/src/node_base.builtin_info.o200[136/1871] CXX obj/deps/v8/src/torque/torque_base.types.o201[137/1871] CXX obj/src/api/node_base.utils.o202[138/1871] CXX obj/gen/src/node/inspector/protocol/node_base.Target.o203In file included from ../../src/util.h:29,204 from ../../src/inspector/node_string.h:10,205 from gen/src/node/inspector/protocol/Forward.h:19,206 from gen/src/node/inspector/protocol/Protocol.h:18,207 from gen/src/node/inspector/protocol/Target.h:10,208 from gen/src/node/inspector/protocol/Target.cpp:7:209../../deps/v8/include/v8-profiler.h: In constructor 'v8::HeapProfiler::HeapSnapshotOptions::HeapSnapshotOptions()':210../../deps/v8/include/v8-profiler.h:1128:27: warning: 'v8::HeapProfiler::HeapSnapshotOptions::global_object_name_resolver' is deprecated: Use context_name_resolver callback instead. [-Wdeprecated-declarations]211 1128 | HeapSnapshotOptions() {}212 | ^213../../deps/v8/include/v8-profiler.h:1142:25: note: declared here214 1142 | ObjectNameResolver* global_object_name_resolver = nullptr;215 | ^~~~~~~~~~~~~~~~~~~~~~~~~~~216../../deps/v8/include/v8-profiler.h:1128:27: warning: 'v8::HeapProfiler::HeapSnapshotOptions::global_object_name_resolver' is deprecated: Use context_name_resolver callback instead. [-Wdeprecated-declarations]217 1128 | HeapSnapshotOptions() {}218 | ^219../../deps/v8/include/v8-profiler.h:1142:25: note: declared here220 1142 | ObjectNameResolver* global_object_name_resolver = nullptr;221 | ^~~~~~~~~~~~~~~~~~~~~~~~~~~222[139/1871] CXX obj/src/node_base.embedded_data.o223[140/1871] CXX obj/src/node_base.cleanup_queue.o224In file included from ../../src/memory_tracker.h:6,225 from ../../src/cleanup_queue.h:11,226 from ../../src/cleanup_queue.cc:1:227../../deps/v8/include/v8-profiler.h: In constructor 'v8::HeapProfiler::HeapSnapshotOptions::HeapSnapshotOptions()':228../../deps/v8/include/v8-profiler.h:1128:27: warning: 'v8::HeapProfiler::HeapSnapshotOptions::global_object_name_resolver' is deprecated: Use context_name_resolver callback instead. [-Wdeprecated-declarations]229 1128 | HeapSnapshotOptions() {}230 | ^231../../deps/v8/include/v8-profiler.h:1142:25: note: declared here232 1142 | ObjectNameResolver* global_object_name_resolver = nullptr;233 | ^~~~~~~~~~~~~~~~~~~~~~~~~~~234../../deps/v8/include/v8-profiler.h:1128:27: warning: 'v8::HeapProfiler::HeapSnapshotOptions::global_object_name_resolver' is deprecated: Use context_name_resolver callback instead. [-Wdeprecated-declarations]235 1128 | HeapSnapshotOptions() {}236 | ^237../../deps/v8/include/v8-profiler.h:1142:25: note: declared here238 1142 | ObjectNameResolver* global_object_name_resolver = nullptr;239 | ^~~~~~~~~~~~~~~~~~~~~~~~~~~240[141/1871] CXX obj/gen/src/node/inspector/protocol/node_base.NodeRuntime.o241In file included from ../../src/util.h:29,242 from ../../src/inspector/node_string.h:10,243 from gen/src/node/inspector/protocol/Forward.h:19,244 from gen/src/node/inspector/protocol/Protocol.h:18,245 from gen/src/node/inspector/protocol/NodeRuntime.h:10,246 from gen/src/node/inspector/protocol/NodeRuntime.cpp:7:247../../deps/v8/include/v8-profiler.h: In constructor 'v8::HeapProfiler::HeapSnapshotOptions::HeapSnapshotOptions()':248../../deps/v8/include/v8-profiler.h:1128:27: warning: 'v8::HeapProfiler::HeapSnapshotOptions::global_object_name_resolver' is deprecated: Use context_name_resolver callback instead. [-Wdeprecated-declarations]249 1128 | HeapSnapshotOptions() {}250 | ^251../../deps/v8/include/v8-profiler.h:1142:25: note: declared here252 1142 | ObjectNameResolver* global_object_name_resolver = nullptr;253 | ^~~~~~~~~~~~~~~~~~~~~~~~~~~254../../deps/v8/include/v8-profiler.h:1128:27: warning: 'v8::HeapProfiler::HeapSnapshotOptions::global_object_name_resolver' is deprecated: Use context_name_resolver callback instead. [-Wdeprecated-declarations]255 1128 | HeapSnapshotOptions() {}256 | ^257../../deps/v8/include/v8-profiler.h:1142:25: note: declared here258 1142 | ObjectNameResolver* global_object_name_resolver = nullptr;259 | ^~~~~~~~~~~~~~~~~~~~~~~~~~~260[142/1871] CXX obj/deps/ncrypto/ncrypto.ncrypto.o261[143/1871] CXX obj/gen/src/node/inspector/protocol/node_base.DOMStorage.o262In file included from ../../src/util.h:29,263 from ../../src/inspector/node_string.h:10,264 from gen/src/node/inspector/protocol/Forward.h:19,265 from gen/src/node/inspector/protocol/Protocol.h:18,266 from gen/src/node/inspector/protocol/DOMStorage.h:10,267 from gen/src/node/inspector/protocol/DOMStorage.cpp:7:268../../deps/v8/include/v8-profiler.h: In constructor 'v8::HeapProfiler::HeapSnapshotOptions::HeapSnapshotOptions()':269../../deps/v8/include/v8-profiler.h:1128:27: warning: 'v8::HeapProfiler::HeapSnapshotOptions::global_object_name_resolver' is deprecated: Use context_name_resolver callback instead. [-Wdeprecated-declarations]270 1128 | HeapSnapshotOptions() {}271 | ^272../../deps/v8/include/v8-profiler.h:1142:25: note: declared here273 1142 | ObjectNameResolver* global_object_name_resolver = nullptr;274 | ^~~~~~~~~~~~~~~~~~~~~~~~~~~275../../deps/v8/include/v8-profiler.h:1128:27: warning: 'v8::HeapProfiler::HeapSnapshotOptions::global_object_name_resolver' is deprecated: Use context_name_resolver callback instead. [-Wdeprecated-declarations]276 1128 | HeapSnapshotOptions() {}277 | ^278../../deps/v8/include/v8-profiler.h:1142:25: note: declared here279 1142 | ObjectNameResolver* global_object_name_resolver = nullptr;280 | ^~~~~~~~~~~~~~~~~~~~~~~~~~~281[144/1871] CXX obj/gen/src/node/inspector/protocol/node_base.Network.o282In file included from ../../src/util.h:29,283 from ../../src/inspector/node_string.h:10,284 from gen/src/node/inspector/protocol/Forward.h:19,285 from gen/src/node/inspector/protocol/Protocol.h:18,286 from gen/src/node/inspector/protocol/Network.h:10,287 from gen/src/node/inspector/protocol/Network.cpp:7:288../../deps/v8/include/v8-profiler.h: In constructor 'v8::HeapProfiler::HeapSnapshotOptions::HeapSnapshotOptions()':289../../deps/v8/include/v8-profiler.h:1128:27: warning: 'v8::HeapProfiler::HeapSnapshotOptions::global_object_name_resolver' is deprecated: Use context_name_resolver callback instead. [-Wdeprecated-declarations]290 1128 | HeapSnapshotOptions() {}291 | ^292../../deps/v8/include/v8-profiler.h:1142:25: note: declared here293 1142 | ObjectNameResolver* global_object_name_resolver = nullptr;294 | ^~~~~~~~~~~~~~~~~~~~~~~~~~~295../../deps/v8/include/v8-profiler.h:1128:27: warning: 'v8::HeapProfiler::HeapSnapshotOptions::global_object_name_resolver' is deprecated: Use context_name_resolver callback instead. [-Wdeprecated-declarations]296 1128 | HeapSnapshotOptions() {}297 | ^298../../deps/v8/include/v8-profiler.h:1142:25: note: declared here299 1142 | ObjectNameResolver* global_object_name_resolver = nullptr;300 | ^~~~~~~~~~~~~~~~~~~~~~~~~~~301[145/1871] CXX obj/gen/src/node/inspector/protocol/node_base.NodeWorker.o302In file included from ../../src/util.h:29,303 from ../../src/inspector/node_string.h:10,304 from gen/src/node/inspector/protocol/Forward.h:19,305 from gen/src/node/inspector/protocol/Protocol.h:18,306 from gen/src/node/inspector/protocol/NodeWorker.h:10,307 from gen/src/node/inspector/protocol/NodeWorker.cpp:7:308../../deps/v8/include/v8-profiler.h: In constructor 'v8::HeapProfiler::HeapSnapshotOptions::HeapSnapshotOptions()':309../../deps/v8/include/v8-profiler.h:1128:27: warning: 'v8::HeapProfiler::HeapSnapshotOptions::global_object_name_resolver' is deprecated: Use context_name_resolver callback instead. [-Wdeprecated-declarations]310 1128 | HeapSnapshotOptions() {}311 | ^312../../deps/v8/include/v8-profiler.h:1142:25: note: declared here313 1142 | ObjectNameResolver* global_object_name_resolver = nullptr;314 | ^~~~~~~~~~~~~~~~~~~~~~~~~~~315../../deps/v8/include/v8-profiler.h:1128:27: warning: 'v8::HeapProfiler::HeapSnapshotOptions::global_object_name_resolver' is deprecated: Use context_name_resolver callback instead. [-Wdeprecated-declarations]316 1128 | HeapSnapshotOptions() {}317 | ^318../../deps/v8/include/v8-profiler.h:1142:25: note: declared here319 1142 | ObjectNameResolver* global_object_name_resolver = nullptr;320 | ^~~~~~~~~~~~~~~~~~~~~~~~~~~321[146/1871] CXX obj/gen/src/node/inspector/protocol/node_base.NodeTracing.o322In file included from ../../src/util.h:29,323 from ../../src/inspector/node_string.h:10,324 from gen/src/node/inspector/protocol/Forward.h:19,325 from gen/src/node/inspector/protocol/Protocol.h:18,326 from gen/src/node/inspector/protocol/NodeTracing.h:10,327 from gen/src/node/inspector/protocol/NodeTracing.cpp:7:328../../deps/v8/include/v8-profiler.h: In constructor 'v8::HeapProfiler::HeapSnapshotOptions::HeapSnapshotOptions()':329../../deps/v8/include/v8-profiler.h:1128:27: warning: 'v8::HeapProfiler::HeapSnapshotOptions::global_object_name_resolver' is deprecated: Use context_name_resolver callback instead. [-Wdeprecated-declarations]330 1128 | HeapSnapshotOptions() {}331 | ^332../../deps/v8/include/v8-profiler.h:1142:25: note: declared here333 1142 | ObjectNameResolver* global_object_name_resolver = nullptr;334 | ^~~~~~~~~~~~~~~~~~~~~~~~~~~335../../deps/v8/include/v8-profiler.h:1128:27: warning: 'v8::HeapProfiler::HeapSnapshotOptions::global_object_name_resolver' is deprecated: Use context_name_resolver callback instead. [-Wdeprecated-declarations]336 1128 | HeapSnapshotOptions() {}337 | ^338../../deps/v8/include/v8-profiler.h:1142:25: note: declared here339 1142 | ObjectNameResolver* global_object_name_resolver = nullptr;340 | ^~~~~~~~~~~~~~~~~~~~~~~~~~~341[147/1871] CXX obj/gen/src/node/inspector/protocol/node_base.Storage.o342In file included from ../../src/util.h:29,343 from ../../src/inspector/node_string.h:10,344 from gen/src/node/inspector/protocol/Forward.h:19,345 from gen/src/node/inspector/protocol/Protocol.h:18,346 from gen/src/node/inspector/protocol/Storage.h:10,347 from gen/src/node/inspector/protocol/Storage.cpp:7:348../../deps/v8/include/v8-profiler.h: In constructor 'v8::HeapProfiler::HeapSnapshotOptions::HeapSnapshotOptions()':349../../deps/v8/include/v8-profiler.h:1128:27: warning: 'v8::HeapProfiler::HeapSnapshotOptions::global_object_name_resolver' is deprecated: Use context_name_resolver callback instead. [-Wdeprecated-declarations]350 1128 | HeapSnapshotOptions() {}351 | ^352../../deps/v8/include/v8-profiler.h:1142:25: note: declared here353 1142 | ObjectNameResolver* global_object_name_resolver = nullptr;354 | ^~~~~~~~~~~~~~~~~~~~~~~~~~~355../../deps/v8/include/v8-profiler.h:1128:27: warning: 'v8::HeapProfiler::HeapSnapshotOptions::global_object_name_resolver' is deprecated: Use context_name_resolver callback instead. [-Wdeprecated-declarations]356 1128 | HeapSnapshotOptions() {}357 | ^358../../deps/v8/include/v8-profiler.h:1142:25: note: declared here359 1142 | ObjectNameResolver* global_object_name_resolver = nullptr;360 | ^~~~~~~~~~~~~~~~~~~~~~~~~~~361[148/1871] CXX obj/gen/src/node/inspector/protocol/node_base.IO.o362In file included from ../../src/util.h:29,363 from ../../src/inspector/node_string.h:10,364 from gen/src/node/inspector/protocol/Forward.h:19,365 from gen/src/node/inspector/protocol/Protocol.h:18,366 from gen/src/node/inspector/protocol/IO.h:10,367 from gen/src/node/inspector/protocol/IO.cpp:7:368../../deps/v8/include/v8-profiler.h: In constructor 'v8::HeapProfiler::HeapSnapshotOptions::HeapSnapshotOptions()':369../../deps/v8/include/v8-profiler.h:1128:27: warning: 'v8::HeapProfiler::HeapSnapshotOptions::global_object_name_resolver' is deprecated: Use context_name_resolver callback instead. [-Wdeprecated-declarations]370 1128 | HeapSnapshotOptions() {}371 | ^372../../deps/v8/include/v8-profiler.h:1142:25: note: declared here373 1142 | ObjectNameResolver* global_object_name_resolver = nullptr;374 | ^~~~~~~~~~~~~~~~~~~~~~~~~~~375../../deps/v8/include/v8-profiler.h:1128:27: warning: 'v8::HeapProfiler::HeapSnapshotOptions::global_object_name_resolver' is deprecated: Use context_name_resolver callback instead. [-Wdeprecated-declarations]376 1128 | HeapSnapshotOptions() {}377 | ^378../../deps/v8/include/v8-profiler.h:1142:25: note: declared here379 1142 | ObjectNameResolver* global_object_name_resolver = nullptr;380 | ^~~~~~~~~~~~~~~~~~~~~~~~~~~381[149/1871] CXX obj/gen/src/node/inspector/protocol/node_base.Protocol.o382In file included from ../../src/util.h:29,383 from ../../src/inspector/node_string.h:10,384 from gen/src/node/inspector/protocol/Forward.h:19,385 from gen/src/node/inspector/protocol/Protocol.h:18,386 from gen/src/node/inspector/protocol/Protocol.cpp:7:387../../deps/v8/include/v8-profiler.h: In constructor 'v8::HeapProfiler::HeapSnapshotOptions::HeapSnapshotOptions()':388../../deps/v8/include/v8-profiler.h:1128:27: warning: 'v8::HeapProfiler::HeapSnapshotOptions::global_object_name_resolver' is deprecated: Use context_name_resolver callback instead. [-Wdeprecated-declarations]389 1128 | HeapSnapshotOptions() {}390 | ^391../../deps/v8/include/v8-profiler.h:1142:25: note: declared here392 1142 | ObjectNameResolver* global_object_name_resolver = nullptr;393 | ^~~~~~~~~~~~~~~~~~~~~~~~~~~394../../deps/v8/include/v8-profiler.h:1128:27: warning: 'v8::HeapProfiler::HeapSnapshotOptions::global_object_name_resolver' is deprecated: Use context_name_resolver callback instead. [-Wdeprecated-declarations]395 1128 | HeapSnapshotOptions() {}396 | ^397../../deps/v8/include/v8-profiler.h:1142:25: note: declared here398 1142 | ObjectNameResolver* global_object_name_resolver = nullptr;399 | ^~~~~~~~~~~~~~~~~~~~~~~~~~~400[150/1871] CXX obj/src/node_base.internal_only_v8.o401In file included from ../../src/util.h:29,402 from ../../src/util-inl.h:33,403 from ../../src/internal_only_v8.cc:3:404../../deps/v8/include/v8-profiler.h: In constructor 'v8::HeapProfiler::HeapSnapshotOptions::HeapSnapshotOptions()':405../../deps/v8/include/v8-profiler.h:1128:27: warning: 'v8::HeapProfiler::HeapSnapshotOptions::global_object_name_resolver' is deprecated: Use context_name_resolver callback instead. [-Wdeprecated-declarations]406 1128 | HeapSnapshotOptions() {}407 | ^408../../deps/v8/include/v8-profiler.h:1142:25: note: declared here409 1142 | ObjectNameResolver* global_object_name_resolver = nullptr;410 | ^~~~~~~~~~~~~~~~~~~~~~~~~~~411../../deps/v8/include/v8-profiler.h:1128:27: warning: 'v8::HeapProfiler::HeapSnapshotOptions::global_object_name_resolver' is deprecated: Use context_name_resolver callback instead. [-Wdeprecated-declarations]412 1128 | HeapSnapshotOptions() {}413 | ^414../../deps/v8/include/v8-profiler.h:1142:25: note: declared here415 1142 | ObjectNameResolver* global_object_name_resolver = nullptr;416 | ^~~~~~~~~~~~~~~~~~~~~~~~~~~417[151/1871] CXX obj/src/node_base.json_utils.o418[152/1871] CXX obj/src/api/node_base.callback.o419In file included from ../../src/memory_tracker.h:6,420 from ../../src/base_object.h:29,421 from ../../src/async_context_frame.h:6,422 from ../../src/api/callback.cc:1:423../../deps/v8/include/v8-profiler.h: In constructor 'v8::HeapProfiler::HeapSnapshotOptions::HeapSnapshotOptions()':424../../deps/v8/include/v8-profiler.h:1128:27: warning: 'v8::HeapProfiler::HeapSnapshotOptions::global_object_name_resolver' is deprecated: Use context_name_resolver callback instead. [-Wdeprecated-declarations]425 1128 | HeapSnapshotOptions() {}426 | ^427../../deps/v8/include/v8-profiler.h:1142:25: note: declared here428 1142 | ObjectNameResolver* global_object_name_resolver = nullptr;429 | ^~~~~~~~~~~~~~~~~~~~~~~~~~~430../../deps/v8/include/v8-profiler.h:1128:27: warning: 'v8::HeapProfiler::HeapSnapshotOptions::global_object_name_resolver' is deprecated: Use context_name_resolver callback instead. [-Wdeprecated-declarations]431 1128 | HeapSnapshotOptions() {}432 | ^433../../deps/v8/include/v8-profiler.h:1142:25: note: declared here434 1142 | ObjectNameResolver* global_object_name_resolver = nullptr;435 | ^~~~~~~~~~~~~~~~~~~~~~~~~~~436[153/1871] CXX obj/src/node_base.connect_wrap.o437In file included from ../../src/memory_tracker.h:6,438 from ../../src/base_object.h:29,439 from ../../src/async_wrap.h:27,440 from ../../src/req_wrap.h:6,441 from ../../src/req_wrap-inl.h:6,442 from ../../src/connect_wrap.h:6,443 from ../../src/connect_wrap.cc:1:444../../deps/v8/include/v8-profiler.h: In constructor 'v8::HeapProfiler::HeapSnapshotOptions::HeapSnapshotOptions()':445../../deps/v8/include/v8-profiler.h:1128:27: warning: 'v8::HeapProfiler::HeapSnapshotOptions::global_object_name_resolver' is deprecated: Use context_name_resolver callback instead. [-Wdeprecated-declarations]446 1128 | HeapSnapshotOptions() {}447 | ^448../../deps/v8/include/v8-profiler.h:1142:25: note: declared here449 1142 | ObjectNameResolver* global_object_name_resolver = nullptr;450 | ^~~~~~~~~~~~~~~~~~~~~~~~~~~451../../deps/v8/include/v8-profiler.h:1128:27: warning: 'v8::HeapProfiler::HeapSnapshotOptions::global_object_name_resolver' is deprecated: Use context_name_resolver callback instead. [-Wdeprecated-declarations]452 1128 | HeapSnapshotOptions() {}453 | ^454../../deps/v8/include/v8-profiler.h:1142:25: note: declared here455 1142 | ObjectNameResolver* global_object_name_resolver = nullptr;456 | ^~~~~~~~~~~~~~~~~~~~~~~~~~~457[154/1871] CXX obj/src/node_base.base_object.o458In file included from ../../src/memory_tracker.h:6,459 from ../../src/base_object.h:29,460 from ../../src/base_object.cc:1:461../../deps/v8/include/v8-profiler.h: In constructor 'v8::HeapProfiler::HeapSnapshotOptions::HeapSnapshotOptions()':462../../deps/v8/include/v8-profiler.h:1128:27: warning: 'v8::HeapProfiler::HeapSnapshotOptions::global_object_name_resolver' is deprecated: Use context_name_resolver callback instead. [-Wdeprecated-declarations]463 1128 | HeapSnapshotOptions() {}464 | ^465../../deps/v8/include/v8-profiler.h:1142:25: note: declared here466 1142 | ObjectNameResolver* global_object_name_resolver = nullptr;467 | ^~~~~~~~~~~~~~~~~~~~~~~~~~~468../../deps/v8/include/v8-profiler.h:1128:27: warning: 'v8::HeapProfiler::HeapSnapshotOptions::global_object_name_resolver' is deprecated: Use context_name_resolver callback instead. [-Wdeprecated-declarations]469 1128 | HeapSnapshotOptions() {}470 | ^471../../deps/v8/include/v8-profiler.h:1142:25: note: declared here472 1142 | ObjectNameResolver* global_object_name_resolver = nullptr;473 | ^~~~~~~~~~~~~~~~~~~~~~~~~~~474[155/1871] CXX obj/src/api/node_base.encoding.o475In file included from ../../src/memory_tracker.h:6,476 from ../../src/aliased_buffer.h:7,477 from ../../src/aliased_buffer-inl.h:6,478 from ../../src/env-inl.h:27,479 from ../../src/string_bytes.h:30,480 from ../../src/api/encoding.cc:2:481../../deps/v8/include/v8-profiler.h: In constructor 'v8::HeapProfiler::HeapSnapshotOptions::HeapSnapshotOptions()':482../../deps/v8/include/v8-profiler.h:1128:27: warning: 'v8::HeapProfiler::HeapSnapshotOptions::global_object_name_resolver' is deprecated: Use context_name_resolver callback instead. [-Wdeprecated-declarations]483 1128 | HeapSnapshotOptions() {}484 | ^485../../deps/v8/include/v8-profiler.h:1142:25: note: declared here486 1142 | ObjectNameResolver* global_object_name_resolver = nullptr;487 | ^~~~~~~~~~~~~~~~~~~~~~~~~~~488../../deps/v8/include/v8-profiler.h:1128:27: warning: 'v8::HeapProfiler::HeapSnapshotOptions::global_object_name_resolver' is deprecated: Use context_name_resolver callback instead. [-Wdeprecated-declarations]489 1128 | HeapSnapshotOptions() {}490 | ^491../../deps/v8/include/v8-profiler.h:1142:25: note: declared here492 1142 | ObjectNameResolver* global_object_name_resolver = nullptr;493 | ^~~~~~~~~~~~~~~~~~~~~~~~~~~494[156/1871] CXX obj/src/node_base.async_context_frame.o495In file included from ../../src/memory_tracker.h:6,496 from ../../src/base_object.h:29,497 from ../../src/async_context_frame.h:6,498 from ../../src/async_context_frame.cc:1:499../../deps/v8/include/v8-profiler.h: In constructor 'v8::HeapProfiler::HeapSnapshotOptions::HeapSnapshotOptions()':500../../deps/v8/include/v8-profiler.h:1128:27: warning: 'v8::HeapProfiler::HeapSnapshotOptions::global_object_name_resolver' is deprecated: Use context_name_resolver callback instead. [-Wdeprecated-declarations]501 1128 | HeapSnapshotOptions() {}502 | ^503../../deps/v8/include/v8-profiler.h:1142:25: note: declared here504 1142 | ObjectNameResolver* global_object_name_resolver = nullptr;505 | ^~~~~~~~~~~~~~~~~~~~~~~~~~~506../../deps/v8/include/v8-profiler.h:1128:27: warning: 'v8::HeapProfiler::HeapSnapshotOptions::global_object_name_resolver' is deprecated: Use context_name_resolver callback instead. [-Wdeprecated-declarations]507 1128 | HeapSnapshotOptions() {}508 | ^509../../deps/v8/include/v8-profiler.h:1142:25: note: declared here510 1142 | ObjectNameResolver* global_object_name_resolver = nullptr;511 | ^~~~~~~~~~~~~~~~~~~~~~~~~~~512[157/1871] CXX obj/src/api/node_base.exceptions.o513In file included from ../../src/memory_tracker.h:6,514 from ../../src/aliased_buffer.h:7,515 from ../../src/aliased_buffer-inl.h:6,516 from ../../src/env-inl.h:27,517 from ../../src/api/exceptions.cc:3:518../../deps/v8/include/v8-profiler.h: In constructor 'v8::HeapProfiler::HeapSnapshotOptions::HeapSnapshotOptions()':519../../deps/v8/include/v8-profiler.h:1128:27: warning: 'v8::HeapProfiler::HeapSnapshotOptions::global_object_name_resolver' is deprecated: Use context_name_resolver callback instead. [-Wdeprecated-declarations]520 1128 | HeapSnapshotOptions() {}521 | ^522../../deps/v8/include/v8-profiler.h:1142:25: note: declared here523 1142 | ObjectNameResolver* global_object_name_resolver = nullptr;524 | ^~~~~~~~~~~~~~~~~~~~~~~~~~~525../../deps/v8/include/v8-profiler.h:1128:27: warning: 'v8::HeapProfiler::HeapSnapshotOptions::global_object_name_resolver' is deprecated: Use context_name_resolver callback instead. [-Wdeprecated-declarations]526 1128 | HeapSnapshotOptions() {}527 | ^528../../deps/v8/include/v8-profiler.h:1142:25: note: declared here529 1142 | ObjectNameResolver* global_object_name_resolver = nullptr;530 | ^~~~~~~~~~~~~~~~~~~~~~~~~~~531[158/1871] CXX obj/src/api/node_base.hooks.o532In file included from ../../src/memory_tracker.h:6,533 from ../../src/aliased_buffer.h:7,534 from ../../src/aliased_buffer-inl.h:6,535 from ../../src/env-inl.h:27,536 from ../../src/api/hooks.cc:1:537../../deps/v8/include/v8-profiler.h: In constructor 'v8::HeapProfiler::HeapSnapshotOptions::HeapSnapshotOptions()':538../../deps/v8/include/v8-profiler.h:1128:27: warning: 'v8::HeapProfiler::HeapSnapshotOptions::global_object_name_resolver' is deprecated: Use context_name_resolver callback instead. [-Wdeprecated-declarations]539 1128 | HeapSnapshotOptions() {}540 | ^541../../deps/v8/include/v8-profiler.h:1142:25: note: declared here542 1142 | ObjectNameResolver* global_object_name_resolver = nullptr;543 | ^~~~~~~~~~~~~~~~~~~~~~~~~~~544../../deps/v8/include/v8-profiler.h:1128:27: warning: 'v8::HeapProfiler::HeapSnapshotOptions::global_object_name_resolver' is deprecated: Use context_name_resolver callback instead. [-Wdeprecated-declarations]545 1128 | HeapSnapshotOptions() {}546 | ^547../../deps/v8/include/v8-profiler.h:1142:25: note: declared here548 1142 | ObjectNameResolver* global_object_name_resolver = nullptr;549 | ^~~~~~~~~~~~~~~~~~~~~~~~~~~550[159/1871] CXX obj/src/node_base.async_wrap.o551In file included from ../../src/memory_tracker.h:6,552 from ../../src/base_object.h:29,553 from ../../src/async_wrap.h:27,554 from ../../src/async_wrap.cc:22:555../../deps/v8/include/v8-profiler.h: In constructor 'v8::HeapProfiler::HeapSnapshotOptions::HeapSnapshotOptions()':556../../deps/v8/include/v8-profiler.h:1128:27: warning: 'v8::HeapProfiler::HeapSnapshotOptions::global_object_name_resolver' is deprecated: Use context_name_resolver callback instead. [-Wdeprecated-declarations]557 1128 | HeapSnapshotOptions() {}558 | ^559../../deps/v8/include/v8-profiler.h:1142:25: note: declared here560 1142 | ObjectNameResolver* global_object_name_resolver = nullptr;561 | ^~~~~~~~~~~~~~~~~~~~~~~~~~~562../../deps/v8/include/v8-profiler.h:1128:27: warning: 'v8::HeapProfiler::HeapSnapshotOptions::global_object_name_resolver' is deprecated: Use context_name_resolver callback instead. [-Wdeprecated-declarations]563 1128 | HeapSnapshotOptions() {}564 | ^565../../deps/v8/include/v8-profiler.h:1142:25: note: declared here566 1142 | ObjectNameResolver* global_object_name_resolver = nullptr;567 | ^~~~~~~~~~~~~~~~~~~~~~~~~~~568[160/1871] CXX obj/src/node_base.connection_wrap.o569In file included from ../../src/memory_tracker.h:6,570 from ../../src/aliased_buffer.h:7,571 from ../../src/env.h:27,572 from ../../src/stream_base.h:6,573 from ../../src/stream_wrap.h:27,574 from ../../src/connection_wrap.h:6,575 from ../../src/connection_wrap.cc:1:576../../deps/v8/include/v8-profiler.h: In constructor 'v8::HeapProfiler::HeapSnapshotOptions::HeapSnapshotOptions()':577../../deps/v8/include/v8-profiler.h:1128:27: warning: 'v8::HeapProfiler::HeapSnapshotOptions::global_object_name_resolver' is deprecated: Use context_name_resolver callback instead. [-Wdeprecated-declarations]578 1128 | HeapSnapshotOptions() {}579 | ^580../../deps/v8/include/v8-profiler.h:1142:25: note: declared here581 1142 | ObjectNameResolver* global_object_name_resolver = nullptr;582 | ^~~~~~~~~~~~~~~~~~~~~~~~~~~583../../deps/v8/include/v8-profiler.h:1128:27: warning: 'v8::HeapProfiler::HeapSnapshotOptions::global_object_name_resolver' is deprecated: Use context_name_resolver callback instead. [-Wdeprecated-declarations]584 1128 | HeapSnapshotOptions() {}585 | ^586../../deps/v8/include/v8-profiler.h:1142:25: note: declared here587 1142 | ObjectNameResolver* global_object_name_resolver = nullptr;588 | ^~~~~~~~~~~~~~~~~~~~~~~~~~~589[161/1871] CXX obj/src/api/node_base.async_resource.o590In file included from ../../src/memory_tracker.h:6,591 from ../../src/base_object.h:29,592 from ../../src/async_context_frame.h:6,593 from ../../src/api/async_resource.cc:1:594../../deps/v8/include/v8-profiler.h: In constructor 'v8::HeapProfiler::HeapSnapshotOptions::HeapSnapshotOptions()':595../../deps/v8/include/v8-profiler.h:1128:27: warning: 'v8::HeapProfiler::HeapSnapshotOptions::global_object_name_resolver' is deprecated: Use context_name_resolver callback instead. [-Wdeprecated-declarations]596 1128 | HeapSnapshotOptions() {}597 | ^598../../deps/v8/include/v8-profiler.h:1142:25: note: declared here599 1142 | ObjectNameResolver* global_object_name_resolver = nullptr;600 | ^~~~~~~~~~~~~~~~~~~~~~~~~~~601../../deps/v8/include/v8-profiler.h:1128:27: warning: 'v8::HeapProfiler::HeapSnapshotOptions::global_object_name_resolver' is deprecated: Use context_name_resolver callback instead. [-Wdeprecated-declarations]602 1128 | HeapSnapshotOptions() {}603 | ^604../../deps/v8/include/v8-profiler.h:1142:25: note: declared here605 1142 | ObjectNameResolver* global_object_name_resolver = nullptr;606 | ^~~~~~~~~~~~~~~~~~~~~~~~~~~607[162/1871] CXX obj/src/node_base.handle_wrap.o608In file included from ../../src/memory_tracker.h:6,609 from ../../src/base_object.h:29,610 from ../../src/async_wrap.h:27,611 from ../../src/handle_wrap.h:27,612 from ../../src/handle_wrap.cc:22:613../../deps/v8/include/v8-profiler.h: In constructor 'v8::HeapProfiler::HeapSnapshotOptions::HeapSnapshotOptions()':614../../deps/v8/include/v8-profiler.h:1128:27: warning: 'v8::HeapProfiler::HeapSnapshotOptions::global_object_name_resolver' is deprecated: Use context_name_resolver callback instead. [-Wdeprecated-declarations]615 1128 | HeapSnapshotOptions() {}616 | ^617../../deps/v8/include/v8-profiler.h:1142:25: note: declared here618 1142 | ObjectNameResolver* global_object_name_resolver = nullptr;619 | ^~~~~~~~~~~~~~~~~~~~~~~~~~~620../../deps/v8/include/v8-profiler.h:1128:27: warning: 'v8::HeapProfiler::HeapSnapshotOptions::global_object_name_resolver' is deprecated: Use context_name_resolver callback instead. [-Wdeprecated-declarations]621 1128 | HeapSnapshotOptions() {}622 | ^623../../deps/v8/include/v8-profiler.h:1142:25: note: declared here624 1142 | ObjectNameResolver* global_object_name_resolver = nullptr;625 | ^~~~~~~~~~~~~~~~~~~~~~~~~~~626[163/1871] CXX obj/src/node_base.node_debug.o627[164/1871] CXX obj/src/node_base.debug_utils.o628In file included from ../../src/memory_tracker.h:6,629 from ../../src/base_object.h:29,630 from ../../src/async_wrap.h:27,631 from ../../src/debug_utils.h:6,632 from ../../src/debug_utils-inl.h:6,633 from ../../src/debug_utils.cc:1:634../../deps/v8/include/v8-profiler.h: In constructor 'v8::HeapProfiler::HeapSnapshotOptions::HeapSnapshotOptions()':635../../deps/v8/include/v8-profiler.h:1128:27: warning: 'v8::HeapProfiler::HeapSnapshotOptions::global_object_name_resolver' is deprecated: Use context_name_resolver callback instead. [-Wdeprecated-declarations]636 1128 | HeapSnapshotOptions() {}637 | ^638../../deps/v8/include/v8-profiler.h:1142:25: note: declared here639 1142 | ObjectNameResolver* global_object_name_resolver = nullptr;640 | ^~~~~~~~~~~~~~~~~~~~~~~~~~~641../../deps/v8/include/v8-profiler.h:1128:27: warning: 'v8::HeapProfiler::HeapSnapshotOptions::global_object_name_resolver' is deprecated: Use context_name_resolver callback instead. [-Wdeprecated-declarations]642 1128 | HeapSnapshotOptions() {}643 | ^644../../deps/v8/include/v8-profiler.h:1142:25: note: declared here645 1142 | ObjectNameResolver* global_object_name_resolver = nullptr;646 | ^~~~~~~~~~~~~~~~~~~~~~~~~~~647[165/1871] CXX obj/src/api/node_base.embed_helpers.o648In file included from ../../src/memory_tracker.h:6,649 from ../../src/base_object.h:29,650 from ../../src/async_wrap.h:27,651 from ../../src/debug_utils.h:6,652 from ../../src/debug_utils-inl.h:6,653 from ../../src/api/embed_helpers.cc:1:654../../deps/v8/include/v8-profiler.h: In constructor 'v8::HeapProfiler::HeapSnapshotOptions::HeapSnapshotOptions()':655../../deps/v8/include/v8-profiler.h:1128:27: warning: 'v8::HeapProfiler::HeapSnapshotOptions::global_object_name_resolver' is deprecated: Use context_name_resolver callback instead. [-Wdeprecated-declarations]656 1128 | HeapSnapshotOptions() {}657 | ^658../../deps/v8/include/v8-profiler.h:1142:25: note: declared here659 1142 | ObjectNameResolver* global_object_name_resolver = nullptr;660 | ^~~~~~~~~~~~~~~~~~~~~~~~~~~661../../deps/v8/include/v8-profiler.h:1128:27: warning: 'v8::HeapProfiler::HeapSnapshotOptions::global_object_name_resolver' is deprecated: Use context_name_resolver callback instead. [-Wdeprecated-declarations]662 1128 | HeapSnapshotOptions() {}663 | ^664../../deps/v8/include/v8-profiler.h:1142:25: note: declared here665 1142 | ObjectNameResolver* global_object_name_resolver = nullptr;666 | ^~~~~~~~~~~~~~~~~~~~~~~~~~~667[166/1871] CXX obj/src/node_base.fs_event_wrap.o668In file included from ../../src/memory_tracker.h:6,669 from ../../src/base_object.h:29,670 from ../../src/async_wrap.h:27,671 from ../../src/async_wrap-inl.h:27,672 from ../../src/fs_event_wrap.cc:22:673../../deps/v8/include/v8-profiler.h: In constructor 'v8::HeapProfiler::HeapSnapshotOptions::HeapSnapshotOptions()':674../../deps/v8/include/v8-profiler.h:1128:27: warning: 'v8::HeapProfiler::HeapSnapshotOptions::global_object_name_resolver' is deprecated: Use context_name_resolver callback instead. [-Wdeprecated-declarations]675 1128 | HeapSnapshotOptions() {}676 | ^677../../deps/v8/include/v8-profiler.h:1142:25: note: declared here678 1142 | ObjectNameResolver* global_object_name_resolver = nullptr;679 | ^~~~~~~~~~~~~~~~~~~~~~~~~~~680../../deps/v8/include/v8-profiler.h:1128:27: warning: 'v8::HeapProfiler::HeapSnapshotOptions::global_object_name_resolver' is deprecated: Use context_name_resolver callback instead. [-Wdeprecated-declarations]681 1128 | HeapSnapshotOptions() {}682 | ^683../../deps/v8/include/v8-profiler.h:1142:25: note: declared here684 1142 | ObjectNameResolver* global_object_name_resolver = nullptr;685 | ^~~~~~~~~~~~~~~~~~~~~~~~~~~686[167/1871] CXX obj/src/node_base.compile_cache.o687In file included from ../../src/memory_tracker.h:6,688 from ../../src/base_object.h:29,689 from ../../src/async_wrap.h:27,690 from ../../src/debug_utils.h:6,691 from ../../src/debug_utils-inl.h:6,692 from ../../src/compile_cache.cc:3:693../../deps/v8/include/v8-profiler.h: In constructor 'v8::HeapProfiler::HeapSnapshotOptions::HeapSnapshotOptions()':694../../deps/v8/include/v8-profiler.h:1128:27: warning: 'v8::HeapProfiler::HeapSnapshotOptions::global_object_name_resolver' is deprecated: Use context_name_resolver callback instead. [-Wdeprecated-declarations]695 1128 | HeapSnapshotOptions() {}696 | ^697../../deps/v8/include/v8-profiler.h:1142:25: note: declared here698 1142 | ObjectNameResolver* global_object_name_resolver = nullptr;699 | ^~~~~~~~~~~~~~~~~~~~~~~~~~~700../../deps/v8/include/v8-profiler.h:1128:27: warning: 'v8::HeapProfiler::HeapSnapshotOptions::global_object_name_resolver' is deprecated: Use context_name_resolver callback instead. [-Wdeprecated-declarations]701 1128 | HeapSnapshotOptions() {}702 | ^703../../deps/v8/include/v8-profiler.h:1142:25: note: declared here704 1142 | ObjectNameResolver* global_object_name_resolver = nullptr;705 | ^~~~~~~~~~~~~~~~~~~~~~~~~~~706[168/1871] CXX obj/src/api/node_base.environment.o707In file included from ../../src/memory_tracker.h:6,708 from ../../src/base_object.h:29,709 from ../../src/async_wrap.h:27,710 from ../../src/crypto/crypto_util.h:6,711 from ../../src/api/environment.cc:3:712../../deps/v8/include/v8-profiler.h: In constructor 'v8::HeapProfiler::HeapSnapshotOptions::HeapSnapshotOptions()':713../../deps/v8/include/v8-profiler.h:1128:27: warning: 'v8::HeapProfiler::HeapSnapshotOptions::global_object_name_resolver' is deprecated: Use context_name_resolver callback instead. [-Wdeprecated-declarations]714 1128 | HeapSnapshotOptions() {}715 | ^716../../deps/v8/include/v8-profiler.h:1142:25: note: declared here717 1142 | ObjectNameResolver* global_object_name_resolver = nullptr;718 | ^~~~~~~~~~~~~~~~~~~~~~~~~~~719../../deps/v8/include/v8-profiler.h:1128:27: warning: 'v8::HeapProfiler::HeapSnapshotOptions::global_object_name_resolver' is deprecated: Use context_name_resolver callback instead. [-Wdeprecated-declarations]720 1128 | HeapSnapshotOptions() {}721 | ^722../../deps/v8/include/v8-profiler.h:1142:25: note: declared here723 1142 | ObjectNameResolver* global_object_name_resolver = nullptr;724 | ^~~~~~~~~~~~~~~~~~~~~~~~~~~725[169/1871] CXX obj/src/node_base.heap_utils.o726In file included from ../../src/memory_tracker.h:6,727 from ../../src/aliased_buffer.h:7,728 from ../../src/env.h:27,729 from ../../src/node_internals.h:27,730 from ../../src/diagnosticfilename-inl.h:6,731 from ../../src/heap_utils.cc:1:732../../deps/v8/include/v8-profiler.h: In constructor 'v8::HeapProfiler::HeapSnapshotOptions::HeapSnapshotOptions()':733../../deps/v8/include/v8-profiler.h:1128:27: warning: 'v8::HeapProfiler::HeapSnapshotOptions::global_object_name_resolver' is deprecated: Use context_name_resolver callback instead. [-Wdeprecated-declarations]734 1128 | HeapSnapshotOptions() {}735 | ^736../../deps/v8/include/v8-profiler.h:1142:25: note: declared here737 1142 | ObjectNameResolver* global_object_name_resolver = nullptr;738 | ^~~~~~~~~~~~~~~~~~~~~~~~~~~739../../deps/v8/include/v8-profiler.h:1128:27: warning: 'v8::HeapProfiler::HeapSnapshotOptions::global_object_name_resolver' is deprecated: Use context_name_resolver callback instead. [-Wdeprecated-declarations]740 1128 | HeapSnapshotOptions() {}741 | ^742../../deps/v8/include/v8-profiler.h:1142:25: note: declared here743 1142 | ObjectNameResolver* global_object_name_resolver = nullptr;744 | ^~~~~~~~~~~~~~~~~~~~~~~~~~~745[170/1871] CXX obj/src/dataqueue/node_base.queue.o746In file included from ../../src/memory_tracker.h:6,747 from ../../src/base_object.h:29,748 from ../../src/dataqueue/queue.h:5,749 from ../../src/dataqueue/queue.cc:1:750../../deps/v8/include/v8-profiler.h: In constructor 'v8::HeapProfiler::HeapSnapshotOptions::HeapSnapshotOptions()':751../../deps/v8/include/v8-profiler.h:1128:27: warning: 'v8::HeapProfiler::HeapSnapshotOptions::global_object_name_resolver' is deprecated: Use context_name_resolver callback instead. [-Wdeprecated-declarations]752 1128 | HeapSnapshotOptions() {}753 | ^754../../deps/v8/include/v8-profiler.h:1142:25: note: declared here755 1142 | ObjectNameResolver* global_object_name_resolver = nullptr;756 | ^~~~~~~~~~~~~~~~~~~~~~~~~~~757../../deps/v8/include/v8-profiler.h:1128:27: warning: 'v8::HeapProfiler::HeapSnapshotOptions::global_object_name_resolver' is deprecated: Use context_name_resolver callback instead. [-Wdeprecated-declarations]758 1128 | HeapSnapshotOptions() {}759 | ^760../../deps/v8/include/v8-profiler.h:1142:25: note: declared here761 1142 | ObjectNameResolver* global_object_name_resolver = nullptr;762 | ^~~~~~~~~~~~~~~~~~~~~~~~~~~763[171/1871] CXX obj/src/node_base.js_udp_wrap.o764In file included from ../../src/memory_tracker.h:6,765 from ../../src/base_object.h:29,766 from ../../src/async_wrap.h:27,767 from ../../src/handle_wrap.h:27,768 from ../../src/udp_wrap.h:27,769 from ../../src/js_udp_wrap.cc:1:770../../deps/v8/include/v8-profiler.h: In constructor 'v8::HeapProfiler::HeapSnapshotOptions::HeapSnapshotOptions()':771../../deps/v8/include/v8-profiler.h:1128:27: warning: 'v8::HeapProfiler::HeapSnapshotOptions::global_object_name_resolver' is deprecated: Use context_name_resolver callback instead. [-Wdeprecated-declarations]772 1128 | HeapSnapshotOptions() {}773 | ^774../../deps/v8/include/v8-profiler.h:1142:25: note: declared here775 1142 | ObjectNameResolver* global_object_name_resolver = nullptr;776 | ^~~~~~~~~~~~~~~~~~~~~~~~~~~777../../deps/v8/include/v8-profiler.h:1128:27: warning: 'v8::HeapProfiler::HeapSnapshotOptions::global_object_name_resolver' is deprecated: Use context_name_resolver callback instead. [-Wdeprecated-declarations]778 1128 | HeapSnapshotOptions() {}779 | ^780../../deps/v8/include/v8-profiler.h:1142:25: note: declared here781 1142 | ObjectNameResolver* global_object_name_resolver = nullptr;782 | ^~~~~~~~~~~~~~~~~~~~~~~~~~~783[172/1871] CXX obj/src/node_base.js_stream.o784In file included from ../../src/memory_tracker.h:6,785 from ../../src/base_object.h:29,786 from ../../src/async_wrap.h:27,787 from ../../src/js_stream.h:6,788 from ../../src/js_stream.cc:1:789../../deps/v8/include/v8-profiler.h: In constructor 'v8::HeapProfiler::HeapSnapshotOptions::HeapSnapshotOptions()':790../../deps/v8/include/v8-profiler.h:1128:27: warning: 'v8::HeapProfiler::HeapSnapshotOptions::global_object_name_resolver' is deprecated: Use context_name_resolver callback instead. [-Wdeprecated-declarations]791 1128 | HeapSnapshotOptions() {}792 | ^793../../deps/v8/include/v8-profiler.h:1142:25: note: declared here794 1142 | ObjectNameResolver* global_object_name_resolver = nullptr;795 | ^~~~~~~~~~~~~~~~~~~~~~~~~~~796../../deps/v8/include/v8-profiler.h:1128:27: warning: 'v8::HeapProfiler::HeapSnapshotOptions::global_object_name_resolver' is deprecated: Use context_name_resolver callback instead. [-Wdeprecated-declarations]797 1128 | HeapSnapshotOptions() {}798 | ^799../../deps/v8/include/v8-profiler.h:1142:25: note: declared here800 1142 | ObjectNameResolver* global_object_name_resolver = nullptr;801 | ^~~~~~~~~~~~~~~~~~~~~~~~~~~802[173/1871] CXX obj/src/node_base.encoding_binding.o803In file included from ../../src/memory_tracker.h:6,804 from ../../src/aliased_buffer.h:7,805 from ../../src/encoding_binding.h:7,806 from ../../src/encoding_binding.cc:1:807../../deps/v8/include/v8-profiler.h: In constructor 'v8::HeapProfiler::HeapSnapshotOptions::HeapSnapshotOptions()':808../../deps/v8/include/v8-profiler.h:1128:27: warning: 'v8::HeapProfiler::HeapSnapshotOptions::global_object_name_resolver' is deprecated: Use context_name_resolver callback instead. [-Wdeprecated-declarations]809 1128 | HeapSnapshotOptions() {}810 | ^811../../deps/v8/include/v8-profiler.h:1142:25: note: declared here812 1142 | ObjectNameResolver* global_object_name_resolver = nullptr;813 | ^~~~~~~~~~~~~~~~~~~~~~~~~~~814../../deps/v8/include/v8-profiler.h:1128:27: warning: 'v8::HeapProfiler::HeapSnapshotOptions::global_object_name_resolver' is deprecated: Use context_name_resolver callback instead. [-Wdeprecated-declarations]815 1128 | HeapSnapshotOptions() {}816 | ^817../../deps/v8/include/v8-profiler.h:1142:25: note: declared here818 1142 | ObjectNameResolver* global_object_name_resolver = nullptr;819 | ^~~~~~~~~~~~~~~~~~~~~~~~~~~820[174/1871] CXX obj/src/node_base.js_native_api_v8.o821In file included from ../../src/memory_tracker.h:6,822 from ../../src/aliased_buffer.h:7,823 from ../../src/aliased_buffer-inl.h:6,824 from ../../src/env-inl.h:27,825 from ../../src/js_native_api_v8.cc:7:826../../deps/v8/include/v8-profiler.h: In constructor 'v8::HeapProfiler::HeapSnapshotOptions::HeapSnapshotOptions()':827../../deps/v8/include/v8-profiler.h:1128:27: warning: 'v8::HeapProfiler::HeapSnapshotOptions::global_object_name_resolver' is deprecated: Use context_name_resolver callback instead. [-Wdeprecated-declarations]828 1128 | HeapSnapshotOptions() {}829 | ^830../../deps/v8/include/v8-profiler.h:1142:25: note: declared here831 1142 | ObjectNameResolver* global_object_name_resolver = nullptr;832 | ^~~~~~~~~~~~~~~~~~~~~~~~~~~833../../deps/v8/include/v8-profiler.h:1128:27: warning: 'v8::HeapProfiler::HeapSnapshotOptions::global_object_name_resolver' is deprecated: Use context_name_resolver callback instead. [-Wdeprecated-declarations]834 1128 | HeapSnapshotOptions() {}835 | ^836../../deps/v8/include/v8-profiler.h:1142:25: note: declared here837 1142 | ObjectNameResolver* global_object_name_resolver = nullptr;838 | ^~~~~~~~~~~~~~~~~~~~~~~~~~~839[175/1871] CXX obj/src/node_base.node_file_utils.o840In file included from ../../src/util.h:29,841 from ../../src/util-inl.h:33,842 from ../../src/node_file_utils.cc:10:843../../deps/v8/include/v8-profiler.h: In constructor 'v8::HeapProfiler::HeapSnapshotOptions::HeapSnapshotOptions()':844../../deps/v8/include/v8-profiler.h:1128:27: warning: 'v8::HeapProfiler::HeapSnapshotOptions::global_object_name_resolver' is deprecated: Use context_name_resolver callback instead. [-Wdeprecated-declarations]845 1128 | HeapSnapshotOptions() {}846 | ^847../../deps/v8/include/v8-profiler.h:1142:25: note: declared here848 1142 | ObjectNameResolver* global_object_name_resolver = nullptr;849 | ^~~~~~~~~~~~~~~~~~~~~~~~~~~850../../deps/v8/include/v8-profiler.h:1128:27: warning: 'v8::HeapProfiler::HeapSnapshotOptions::global_object_name_resolver' is deprecated: Use context_name_resolver callback instead. [-Wdeprecated-declarations]851 1128 | HeapSnapshotOptions() {}852 | ^853../../deps/v8/include/v8-profiler.h:1142:25: note: declared here854 1142 | ObjectNameResolver* global_object_name_resolver = nullptr;855 | ^~~~~~~~~~~~~~~~~~~~~~~~~~~856../../src/node_file_utils.cc: In function 'int node::WriteFileSync(const char*, uv_buf_t*, size_t)':857../../src/node_file_utils.cc:62:32: warning: enumerated and non-enumerated type in conditional expression [-Wextra]858 62 | int err = req.result < 0 ? req.result : UV_EIO;859 | ~~~~~~~~~~~~~~~^~~~~~~~~~~~~~~~~~~~~860[176/1871] CXX obj/src/node_base.histogram.o861In file included from ../../src/memory_tracker.h:6,862 from ../../src/base_object.h:29,863 from ../../src/histogram.h:7,864 from ../../src/histogram.cc:1:865../../deps/v8/include/v8-profiler.h: In constructor 'v8::HeapProfiler::HeapSnapshotOptions::HeapSnapshotOptions()':866../../deps/v8/include/v8-profiler.h:1128:27: warning: 'v8::HeapProfiler::HeapSnapshotOptions::global_object_name_resolver' is deprecated: Use context_name_resolver callback instead. [-Wdeprecated-declarations]867 1128 | HeapSnapshotOptions() {}868 | ^869../../deps/v8/include/v8-profiler.h:1142:25: note: declared here870 1142 | ObjectNameResolver* global_object_name_resolver = nullptr;871 | ^~~~~~~~~~~~~~~~~~~~~~~~~~~872../../deps/v8/include/v8-profiler.h:1128:27: warning: 'v8::HeapProfiler::HeapSnapshotOptions::global_object_name_resolver' is deprecated: Use context_name_resolver callback instead. [-Wdeprecated-declarations]873 1128 | HeapSnapshotOptions() {}874 | ^875../../deps/v8/include/v8-profiler.h:1142:25: note: declared here876 1142 | ObjectNameResolver* global_object_name_resolver = nullptr;877 | ^~~~~~~~~~~~~~~~~~~~~~~~~~~878[177/1871] CXX obj/src/node_base.node_api.o879In file included from ../../src/memory_tracker.h:6,880 from ../../src/base_object.h:29,881 from ../../src/async_context_frame.h:6,882 from ../../src/node_api.cc:1:883../../deps/v8/include/v8-profiler.h: In constructor 'v8::HeapProfiler::HeapSnapshotOptions::HeapSnapshotOptions()':884../../deps/v8/include/v8-profiler.h:1128:27: warning: 'v8::HeapProfiler::HeapSnapshotOptions::global_object_name_resolver' is deprecated: Use context_name_resolver callback instead. [-Wdeprecated-declarations]885 1128 | HeapSnapshotOptions() {}886 | ^887../../deps/v8/include/v8-profiler.h:1142:25: note: declared here888 1142 | ObjectNameResolver* global_object_name_resolver = nullptr;889 | ^~~~~~~~~~~~~~~~~~~~~~~~~~~890../../deps/v8/include/v8-profiler.h:1128:27: warning: 'v8::HeapProfiler::HeapSnapshotOptions::global_object_name_resolver' is deprecated: Use context_name_resolver callback instead. [-Wdeprecated-declarations]891 1128 | HeapSnapshotOptions() {}892 | ^893../../deps/v8/include/v8-profiler.h:1142:25: note: declared here894 1142 | ObjectNameResolver* global_object_name_resolver = nullptr;895 | ^~~~~~~~~~~~~~~~~~~~~~~~~~~896[178/1871] CXX obj/gen/node_base.node_javascript.o897In file included from ../../src/memory_tracker.h:6,898 from ../../src/aliased_buffer.h:7,899 from ../../src/aliased_buffer-inl.h:6,900 from ../../src/env-inl.h:27,901 from gen/node_javascript.cc:2:902../../deps/v8/include/v8-profiler.h: In constructor 'v8::HeapProfiler::HeapSnapshotOptions::HeapSnapshotOptions()':903../../deps/v8/include/v8-profiler.h:1128:27: warning: 'v8::HeapProfiler::HeapSnapshotOptions::global_object_name_resolver' is deprecated: Use context_name_resolver callback instead. [-Wdeprecated-declarations]904 1128 | HeapSnapshotOptions() {}905 | ^906../../deps/v8/include/v8-profiler.h:1142:25: note: declared here907 1142 | ObjectNameResolver* global_object_name_resolver = nullptr;908 | ^~~~~~~~~~~~~~~~~~~~~~~~~~~909../../deps/v8/include/v8-profiler.h:1128:27: warning: 'v8::HeapProfiler::HeapSnapshotOptions::global_object_name_resolver' is deprecated: Use context_name_resolver callback instead. [-Wdeprecated-declarations]910 1128 | HeapSnapshotOptions() {}911 | ^912../../deps/v8/include/v8-profiler.h:1142:25: note: declared here913 1142 | ObjectNameResolver* global_object_name_resolver = nullptr;914 | ^~~~~~~~~~~~~~~~~~~~~~~~~~~915[179/1871] CXX obj/src/node_base.module_wrap.o916In file included from ../../src/memory_tracker.h:6,917 from ../../src/base_object.h:29,918 from ../../src/module_wrap.h:10,919 from ../../src/module_wrap.cc:1:920../../deps/v8/include/v8-profiler.h: In constructor 'v8::HeapProfiler::HeapSnapshotOptions::HeapSnapshotOptions()':921../../deps/v8/include/v8-profiler.h:1128:27: warning: 'v8::HeapProfiler::HeapSnapshotOptions::global_object_name_resolver' is deprecated: Use context_name_resolver callback instead. [-Wdeprecated-declarations]922 1128 | HeapSnapshotOptions() {}923 | ^924../../deps/v8/include/v8-profiler.h:1142:25: note: declared here925 1142 | ObjectNameResolver* global_object_name_resolver = nullptr;926 | ^~~~~~~~~~~~~~~~~~~~~~~~~~~927../../deps/v8/include/v8-profiler.h:1128:27: warning: 'v8::HeapProfiler::HeapSnapshotOptions::global_object_name_resolver' is deprecated: Use context_name_resolver callback instead. [-Wdeprecated-declarations]928 1128 | HeapSnapshotOptions() {}929 | ^930../../deps/v8/include/v8-profiler.h:1142:25: note: declared here931 1142 | ObjectNameResolver* global_object_name_resolver = nullptr;932 | ^~~~~~~~~~~~~~~~~~~~~~~~~~~933[180/1871] CXX obj/deps/v8/src/torque/torque_base.torque-parser.o934[181/1871] CXX obj/src/node_base.cares_wrap.o935In file included from ../../src/memory_tracker.h:6,936 from ../../src/base_object.h:29,937 from ../../src/async_wrap.h:27,938 from ../../src/cares_wrap.h:8,939 from ../../src/cares_wrap.cc:22:940../../deps/v8/include/v8-profiler.h: In constructor 'v8::HeapProfiler::HeapSnapshotOptions::HeapSnapshotOptions()':941../../deps/v8/include/v8-profiler.h:1128:27: warning: 'v8::HeapProfiler::HeapSnapshotOptions::global_object_name_resolver' is deprecated: Use context_name_resolver callback instead. [-Wdeprecated-declarations]942 1128 | HeapSnapshotOptions() {}943 | ^944../../deps/v8/include/v8-profiler.h:1142:25: note: declared here945 1142 | ObjectNameResolver* global_object_name_resolver = nullptr;946 | ^~~~~~~~~~~~~~~~~~~~~~~~~~~947../../deps/v8/include/v8-profiler.h:1128:27: warning: 'v8::HeapProfiler::HeapSnapshotOptions::global_object_name_resolver' is deprecated: Use context_name_resolver callback instead. [-Wdeprecated-declarations]948 1128 | HeapSnapshotOptions() {}949 | ^950../../deps/v8/include/v8-profiler.h:1142:25: note: declared here951 1142 | ObjectNameResolver* global_object_name_resolver = nullptr;952 | ^~~~~~~~~~~~~~~~~~~~~~~~~~~953../../src/cares_wrap.cc: In function 'v8::Maybe<int> node::cares_wrap::{anonymous}::ParseGeneralReply(node::Environment*, const unsigned char*, int, int*, v8::Local<v8::Array>, void*, int*)':954../../src/cares_wrap.cc:244:34: warning: 'int ares_parse_a_reply(const unsigned char*, int, hostent**, ares_addrttl*, int*)' is deprecated: Use ares_dns_parse instead [-Wdeprecated-declarations]955 244 | status = ares_parse_a_reply(buf,956 | ~~~~~~~~~~~~~~~~~~^~~~~957 245 | len,958 | ~~~~959 246 | &host,960 | ~~~~~~961 247 | static_cast<ares_addrttl*>(addrttls),962 | ~~~~~~~~~~~~~~~~~~~~~~~~~~~~~~~~~~~~~963 248 | naddrttls);964 | ~~~~~~~~~~965In file included from ../../src/cares_wrap.h:17:966/nix/store/j239p458yixap89j6wpfib9yjypd3ii5-c-ares-1.34.8-dev/include/ares.h:1106:55: note: declared here967 1106 | CARES_EXTERN CARES_DEPRECATED_FOR(ares_dns_parse) int ares_parse_a_reply(968 | ^~~~~~~~~~~~~~~~~~969../../src/cares_wrap.cc:251:37: warning: 'int ares_parse_aaaa_reply(const unsigned char*, int, hostent**, ares_addr6ttl*, int*)' is deprecated: Use ares_dns_parse instead [-Wdeprecated-declarations]970 251 | status = ares_parse_aaaa_reply(buf,971 | ~~~~~~~~~~~~~~~~~~~~~^~~~~972 252 | len,973 | ~~~~974 253 | &host,975 | ~~~~~~976 254 | static_cast<ares_addr6ttl*>(addrttls),977 | ~~~~~~~~~~~~~~~~~~~~~~~~~~~~~~~~~~~~~~978 255 | naddrttls);979 | ~~~~~~~~~~980/nix/store/j239p458yixap89j6wpfib9yjypd3ii5-c-ares-1.34.8-dev/include/ares.h:1110:55: note: declared here981 1110 | CARES_EXTERN CARES_DEPRECATED_FOR(ares_dns_parse) int ares_parse_aaaa_reply(982 | ^~~~~~~~~~~~~~~~~~~~~983../../src/cares_wrap.cc:258:35: warning: 'int ares_parse_ns_reply(const unsigned char*, int, hostent**)' is deprecated: Use ares_dns_parse instead [-Wdeprecated-declarations]984 258 | status = ares_parse_ns_reply(buf, len, &host);985 | ~~~~~~~~~~~~~~~~~~~^~~~~~~~~~~~~~~~~986/nix/store/j239p458yixap89j6wpfib9yjypd3ii5-c-ares-1.34.8-dev/include/ares.h:1121:55: note: declared here987 1121 | CARES_EXTERN CARES_DEPRECATED_FOR(ares_dns_parse) int ares_parse_ns_reply(988 | ^~~~~~~~~~~~~~~~~~~989../../src/cares_wrap.cc:261:36: warning: 'int ares_parse_ptr_reply(const unsigned char*, int, const void*, int, int, hostent**)' is deprecated: Use ares_dns_parse instead [-Wdeprecated-declarations]990 261 | status = ares_parse_ptr_reply(buf, len, nullptr, 0, AF_INET, &host);991 | ~~~~~~~~~~~~~~~~~~~~^~~~~~~~~~~~~~~~~~~~~~~~~~~~~~~~~~~~~~992/nix/store/j239p458yixap89j6wpfib9yjypd3ii5-c-ares-1.34.8-dev/include/ares.h:1117:55: note: declared here993 1117 | CARES_EXTERN CARES_DEPRECATED_FOR(ares_dns_parse) int ares_parse_ptr_reply(994 | ^~~~~~~~~~~~~~~~~~~~995../../src/cares_wrap.cc: In function 'v8::Maybe<int> node::cares_wrap::{anonymous}::ParseMxReply(node::Environment*, const unsigned char*, int, v8::Local<v8::Array>, bool)':996../../src/cares_wrap.cc:337:35: warning: 'int ares_parse_mx_reply(const unsigned char*, int, ares_mx_reply**)' is deprecated: Use ares_dns_parse instead [-Wdeprecated-declarations]997 337 | int status = ares_parse_mx_reply(buf, len, &mx_start);998 | ~~~~~~~~~~~~~~~~~~~^~~~~~~~~~~~~~~~~~~~~999/nix/store/j239p458yixap89j6wpfib9yjypd3ii5-c-ares-1.34.8-dev/include/ares.h:1127:55: note: declared here1000 1127 | CARES_EXTERN CARES_DEPRECATED_FOR(ares_dns_parse) int ares_parse_mx_reply(1001 | ^~~~~~~~~~~~~~~~~~~1002../../src/cares_wrap.cc: In function 'v8::Maybe<int> node::cares_wrap::{anonymous}::ParseCaaReply(node::Environment*, const unsigned char*, int, v8::Local<v8::Array>, bool)':1003../../src/cares_wrap.cc:383:36: warning: 'int ares_parse_caa_reply(const unsigned char*, int, ares_caa_reply**)' is deprecated: Use ares_dns_parse instead [-Wdeprecated-declarations]1004 383 | int status = ares_parse_caa_reply(buf, len, &caa_start);1005 | ~~~~~~~~~~~~~~~~~~~~^~~~~~~~~~~~~~~~~~~~~~1006/nix/store/j239p458yixap89j6wpfib9yjypd3ii5-c-ares-1.34.8-dev/include/ares.h:1114:55: note: declared here1007 1114 | CARES_EXTERN CARES_DEPRECATED_FOR(ares_dns_parse) int ares_parse_caa_reply(1008 | ^~~~~~~~~~~~~~~~~~~~1009../../src/cares_wrap.cc: In function 'v8::Maybe<int> node::cares_wrap::{anonymous}::ParseTxtReply(node::Environment*, const unsigned char*, int, v8::Local<v8::Array>, bool)':1010../../src/cares_wrap.cc:511:40: warning: 'int ares_parse_txt_reply_ext(const unsigned char*, int, ares_txt_ext**)' is deprecated: Use ares_dns_parse instead [-Wdeprecated-declarations]1011 511 | int status = ares_parse_txt_reply_ext(buf, len, &txt_out);1012 | ~~~~~~~~~~~~~~~~~~~~~~~~^~~~~~~~~~~~~~~~~~~~1013/nix/store/j239p458yixap89j6wpfib9yjypd3ii5-c-ares-1.34.8-dev/include/ares.h:1133:55: note: declared here1014 1133 | CARES_EXTERN CARES_DEPRECATED_FOR(ares_dns_parse) int ares_parse_txt_reply_ext(1015 | ^~~~~~~~~~~~~~~~~~~~~~~~1016../../src/cares_wrap.cc: In function 'v8::Maybe<int> node::cares_wrap::{anonymous}::ParseSrvReply(node::Environment*, const unsigned char*, int, v8::Local<v8::Array>, bool)':1017../../src/cares_wrap.cc:598:36: warning: 'int ares_parse_srv_reply(const unsigned char*, int, ares_srv_reply**)' is deprecated: Use ares_dns_parse instead [-Wdeprecated-declarations]1018 598 | int status = ares_parse_srv_reply(buf, len, &srv_start);1019 | ~~~~~~~~~~~~~~~~~~~~^~~~~~~~~~~~~~~~~~~~~~1020/nix/store/j239p458yixap89j6wpfib9yjypd3ii5-c-ares-1.34.8-dev/include/ares.h:1124:55: note: declared here1021 1124 | CARES_EXTERN CARES_DEPRECATED_FOR(ares_dns_parse) int ares_parse_srv_reply(1022 | ^~~~~~~~~~~~~~~~~~~~1023../../src/cares_wrap.cc: In function 'v8::Maybe<int> node::cares_wrap::{anonymous}::ParseNaptrReply(node::Environment*, const unsigned char*, int, v8::Local<v8::Array>, bool)':1024../../src/cares_wrap.cc:653:38: warning: 'int ares_parse_naptr_reply(const unsigned char*, int, ares_naptr_reply**)' is deprecated: Use ares_dns_parse instead [-Wdeprecated-declarations]1025 653 | int status = ares_parse_naptr_reply(buf, len, &naptr_start);1026 | ~~~~~~~~~~~~~~~~~~~~~~^~~~~~~~~~~~~~~~~~~~~~~~1027/nix/store/j239p458yixap89j6wpfib9yjypd3ii5-c-ares-1.34.8-dev/include/ares.h:1136:55: note: declared here1028 1136 | CARES_EXTERN CARES_DEPRECATED_FOR(ares_dns_parse) int ares_parse_naptr_reply(1029 | ^~~~~~~~~~~~~~~~~~~~~~1030../../src/cares_wrap.cc: In member function 'void node::cares_wrap::ChannelWrap::EnsureServers()':1031../../src/cares_wrap.cc:1000:25: warning: 'int ares_get_servers_ports(const ares_channel_t*, ares_addr_port_node**)' is deprecated: Use ares_get_servers_csv instead [-Wdeprecated-declarations]1032 1000 | ares_get_servers_ports(channel_, &servers);1033 | ~~~~~~~~~~~~~~~~~~~~~~^~~~~~~~~~~~~~~~~~~~1034/nix/store/j239p458yixap89j6wpfib9yjypd3ii5-c-ares-1.34.8-dev/include/ares.h:1196:28: note: declared here1035 1196 | int ares_get_servers_ports(const ares_channel_t *channel,1036 | ^~~~~~~~~~~~~~~~~~~~~~1037../../src/cares_wrap.cc: In static member function 'static v8::Maybe<int> node::cares_wrap::SoaTraits::Parse(node::cares_wrap::QuerySoaWrap*, const std::unique_ptr<node::cares_wrap::ResponseData>&)':1038../../src/cares_wrap.cc:1711:36: warning: 'int ares_parse_soa_reply(const unsigned char*, int, ares_soa_reply**)' is deprecated: Use ares_dns_parse instead [-Wdeprecated-declarations]1039 1711 | int status = ares_parse_soa_reply(buf, len, &soa_out);1040 | ~~~~~~~~~~~~~~~~~~~~^~~~~~~~~~~~~~~~~~~~1041/nix/store/j239p458yixap89j6wpfib9yjypd3ii5-c-ares-1.34.8-dev/include/ares.h:1139:55: note: declared here1042 1139 | CARES_EXTERN CARES_DEPRECATED_FOR(ares_dns_parse) int ares_parse_soa_reply(1043 | ^~~~~~~~~~~~~~~~~~~~1044../../src/cares_wrap.cc: In function 'void node::cares_wrap::{anonymous}::GetServers(const v8::FunctionCallbackInfo<v8::Value>&)':1045../../src/cares_wrap.cc:2092:33: warning: 'int ares_get_servers_ports(const ares_channel_t*, ares_addr_port_node**)' is deprecated: Use ares_get_servers_csv instead [-Wdeprecated-declarations]1046 2092 | int r = ares_get_servers_ports(channel->cares_channel(), &servers);1047 | ~~~~~~~~~~~~~~~~~~~~~~^~~~~~~~~~~~~~~~~~~~~~~~~~~~~~~~~~~~1048/nix/store/j239p458yixap89j6wpfib9yjypd3ii5-c-ares-1.34.8-dev/include/ares.h:1196:28: note: declared here1049 1196 | int ares_get_servers_ports(const ares_channel_t *channel,1050 | ^~~~~~~~~~~~~~~~~~~~~~1051../../src/cares_wrap.cc: In function 'void node::cares_wrap::{anonymous}::SetServers(const v8::FunctionCallbackInfo<v8::Value>&)':1052../../src/cares_wrap.cc:2137:30: warning: 'int ares_set_servers(ares_channel_t*, const ares_addr_node*)' is deprecated: Use ares_set_servers_csv instead [-Wdeprecated-declarations]1053 2137 | int rv = ares_set_servers(channel->cares_channel(), nullptr);1054 | ~~~~~~~~~~~~~~~~^~~~~~~~~~~~~~~~~~~~~~~~~~~~~~~~~~~1055/nix/store/j239p458yixap89j6wpfib9yjypd3ii5-c-ares-1.34.8-dev/include/ares.h:1176:61: note: declared here1056 1176 | CARES_EXTERN CARES_DEPRECATED_FOR(ares_set_servers_csv) int ares_set_servers(1057 | ^~~~~~~~~~~~~~~~1058../../src/cares_wrap.cc:2197:33: warning: 'int ares_set_servers_ports(ares_channel_t*, const ares_addr_port_node*)' is deprecated: Use ares_set_servers_ports_csv instead [-Wdeprecated-declarations]1059 2197 | err = ares_set_servers_ports(channel->cares_channel(), servers.data());1060 | ~~~~~~~~~~~~~~~~~~~~~~^~~~~~~~~~~~~~~~~~~~~~~~~~~~~~~~~~~~~~~~~~1061/nix/store/j239p458yixap89j6wpfib9yjypd3ii5-c-ares-1.34.8-dev/include/ares.h:1181:20: note: declared here1062 1181 | int ares_set_servers_ports(ares_channel_t *channel,1063 | ^~~~~~~~~~~~~~~~~~~~~~1064[182/1871] CXX obj/src/node_base.node_config.o1065In file included from ../../src/memory_tracker.h:6,1066 from ../../src/aliased_buffer.h:7,1067 from ../../src/aliased_buffer-inl.h:6,1068 from ../../src/env-inl.h:27,1069 from ../../src/node_config.cc:1:1070../../deps/v8/include/v8-profiler.h: In constructor 'v8::HeapProfiler::HeapSnapshotOptions::HeapSnapshotOptions()':1071../../deps/v8/include/v8-profiler.h:1128:27: warning: 'v8::HeapProfiler::HeapSnapshotOptions::global_object_name_resolver' is deprecated: Use context_name_resolver callback instead. [-Wdeprecated-declarations]1072 1128 | HeapSnapshotOptions() {}1073 | ^1074../../deps/v8/include/v8-profiler.h:1142:25: note: declared here1075 1142 | ObjectNameResolver* global_object_name_resolver = nullptr;1076 | ^~~~~~~~~~~~~~~~~~~~~~~~~~~1077../../deps/v8/include/v8-profiler.h:1128:27: warning: 'v8::HeapProfiler::HeapSnapshotOptions::global_object_name_resolver' is deprecated: Use context_name_resolver callback instead. [-Wdeprecated-declarations]1078 1128 | HeapSnapshotOptions() {}1079 | ^1080../../deps/v8/include/v8-profiler.h:1142:25: note: declared here1081 1142 | ObjectNameResolver* global_object_name_resolver = nullptr;1082 | ^~~~~~~~~~~~~~~~~~~~~~~~~~~1083[183/1871] CXX obj/src/node_base.node_constants.o1084In file included from ../../src/memory_tracker.h:6,1085 from ../../src/aliased_buffer.h:7,1086 from ../../src/aliased_buffer-inl.h:6,1087 from ../../src/env-inl.h:27,1088 from ../../src/node_constants.cc:22:1089../../deps/v8/include/v8-profiler.h: In constructor 'v8::HeapProfiler::HeapSnapshotOptions::HeapSnapshotOptions()':1090../../deps/v8/include/v8-profiler.h:1128:27: warning: 'v8::HeapProfiler::HeapSnapshotOptions::global_object_name_resolver' is deprecated: Use context_name_resolver callback instead. [-Wdeprecated-declarations]1091 1128 | HeapSnapshotOptions() {}1092 | ^1093../../deps/v8/include/v8-profiler.h:1142:25: note: declared here1094 1142 | ObjectNameResolver* global_object_name_resolver = nullptr;1095 | ^~~~~~~~~~~~~~~~~~~~~~~~~~~1096../../deps/v8/include/v8-profiler.h:1128:27: warning: 'v8::HeapProfiler::HeapSnapshotOptions::global_object_name_resolver' is deprecated: Use context_name_resolver callback instead. [-Wdeprecated-declarations]1097 1128 | HeapSnapshotOptions() {}1098 | ^1099../../deps/v8/include/v8-profiler.h:1142:25: note: declared here1100 1142 | ObjectNameResolver* global_object_name_resolver = nullptr;1101 | ^~~~~~~~~~~~~~~~~~~~~~~~~~~1102[184/1871] CXX obj/src/node_base.node_config_file.o1103In file included from ../../src/memory_tracker.h:6,1104 from ../../src/aliased_buffer.h:7,1105 from ../../src/env.h:27,1106 from ../../src/node_internals.h:27,1107 from ../../src/node_config_file.h:12,1108 from ../../src/node_config_file.cc:1:1109../../deps/v8/include/v8-profiler.h: In constructor 'v8::HeapProfiler::HeapSnapshotOptions::HeapSnapshotOptions()':1110../../deps/v8/include/v8-profiler.h:1128:27: warning: 'v8::HeapProfiler::HeapSnapshotOptions::global_object_name_resolver' is deprecated: Use context_name_resolver callback instead. [-Wdeprecated-declarations]1111 1128 | HeapSnapshotOptions() {}1112 | ^1113../../deps/v8/include/v8-profiler.h:1142:25: note: declared here1114 1142 | ObjectNameResolver* global_object_name_resolver = nullptr;1115 | ^~~~~~~~~~~~~~~~~~~~~~~~~~~1116../../deps/v8/include/v8-profiler.h:1128:27: warning: 'v8::HeapProfiler::HeapSnapshotOptions::global_object_name_resolver' is deprecated: Use context_name_resolver callback instead. [-Wdeprecated-declarations]1117 1128 | HeapSnapshotOptions() {}1118 | ^1119../../deps/v8/include/v8-profiler.h:1142:25: note: declared here1120 1142 | ObjectNameResolver* global_object_name_resolver = nullptr;1121 | ^~~~~~~~~~~~~~~~~~~~~~~~~~~1122[185/1871] CXX obj/src/node_base.node.o1123In file included from ../../src/memory_tracker.h:6,1124 from ../../src/aliased_buffer.h:7,1125 from ../../src/env.h:27,1126 from ../../src/node_internals.h:27,1127 from ../../src/node_config_file.h:12,1128 from ../../src/node.cc:23:1129../../deps/v8/include/v8-profiler.h: In constructor 'v8::HeapProfiler::HeapSnapshotOptions::HeapSnapshotOptions()':1130../../deps/v8/include/v8-profiler.h:1128:27: warning: 'v8::HeapProfiler::HeapSnapshotOptions::global_object_name_resolver' is deprecated: Use context_name_resolver callback instead. [-Wdeprecated-declarations]1131 1128 | HeapSnapshotOptions() {}1132 | ^1133../../deps/v8/include/v8-profiler.h:1142:25: note: declared here1134 1142 | ObjectNameResolver* global_object_name_resolver = nullptr;1135 | ^~~~~~~~~~~~~~~~~~~~~~~~~~~1136../../deps/v8/include/v8-profiler.h:1128:27: warning: 'v8::HeapProfiler::HeapSnapshotOptions::global_object_name_resolver' is deprecated: Use context_name_resolver callback instead. [-Wdeprecated-declarations]1137 1128 | HeapSnapshotOptions() {}1138 | ^1139../../deps/v8/include/v8-profiler.h:1142:25: note: declared here1140 1142 | ObjectNameResolver* global_object_name_resolver = nullptr;1141 | ^~~~~~~~~~~~~~~~~~~~~~~~~~~1142[186/1871] CXX obj/src/node_base.node_blob.o1143In file included from ../../src/memory_tracker.h:6,1144 from ../../src/base_object.h:29,1145 from ../../src/async_wrap.h:27,1146 from ../../src/node_blob.h:8,1147 from ../../src/node_blob.cc:1:1148../../deps/v8/include/v8-profiler.h: In constructor 'v8::HeapProfiler::HeapSnapshotOptions::HeapSnapshotOptions()':1149../../deps/v8/include/v8-profiler.h:1128:27: warning: 'v8::HeapProfiler::HeapSnapshotOptions::global_object_name_resolver' is deprecated: Use context_name_resolver callback instead. [-Wdeprecated-declarations]1150 1128 | HeapSnapshotOptions() {}1151 | ^1152../../deps/v8/include/v8-profiler.h:1142:25: note: declared here1153 1142 | ObjectNameResolver* global_object_name_resolver = nullptr;1154 | ^~~~~~~~~~~~~~~~~~~~~~~~~~~1155../../deps/v8/include/v8-profiler.h:1128:27: warning: 'v8::HeapProfiler::HeapSnapshotOptions::global_object_name_resolver' is deprecated: Use context_name_resolver callback instead. [-Wdeprecated-declarations]1156 1128 | HeapSnapshotOptions() {}1157 | ^1158../../deps/v8/include/v8-profiler.h:1142:25: note: declared here1159 1142 | ObjectNameResolver* global_object_name_resolver = nullptr;1160 | ^~~~~~~~~~~~~~~~~~~~~~~~~~~1161[187/1871] CXX obj/deps/v8/third_party/simdutf/simdutf.simdutf.o1162[188/1871] AR obj/tools/v8_gypfiles/libsimdutf.a1163[189/1871] CXX obj/src/node_base.node_credentials.o1164In file included from ../../src/memory_tracker.h:6,1165 from ../../src/aliased_buffer.h:7,1166 from ../../src/aliased_buffer-inl.h:6,1167 from ../../src/env-inl.h:27,1168 from ../../src/node_credentials.cc:1:1169../../deps/v8/include/v8-profiler.h: In constructor 'v8::HeapProfiler::HeapSnapshotOptions::HeapSnapshotOptions()':1170../../deps/v8/include/v8-profiler.h:1128:27: warning: 'v8::HeapProfiler::HeapSnapshotOptions::global_object_name_resolver' is deprecated: Use context_name_resolver callback instead. [-Wdeprecated-declarations]1171 1128 | HeapSnapshotOptions() {}1172 | ^1173../../deps/v8/include/v8-profiler.h:1142:25: note: declared here1174 1142 | ObjectNameResolver* global_object_name_resolver = nullptr;1175 | ^~~~~~~~~~~~~~~~~~~~~~~~~~~1176../../deps/v8/include/v8-profiler.h:1128:27: warning: 'v8::HeapProfiler::HeapSnapshotOptions::global_object_name_resolver' is deprecated: Use context_name_resolver callback instead. [-Wdeprecated-declarations]1177 1128 | HeapSnapshotOptions() {}1178 | ^1179../../deps/v8/include/v8-profiler.h:1142:25: note: declared here1180 1142 | ObjectNameResolver* global_object_name_resolver = nullptr;1181 | ^~~~~~~~~~~~~~~~~~~~~~~~~~~1182[190/1871] CXX obj/src/node_base.node_dir.o1183In file included from ../../src/memory_tracker.h:6,1184 from ../../src/aliased_buffer.h:7,1185 from ../../src/node_file.h:7,1186 from ../../src/node_dir.h:6,1187 from ../../src/node_dir.cc:1:1188../../deps/v8/include/v8-profiler.h: In constructor 'v8::HeapProfiler::HeapSnapshotOptions::HeapSnapshotOptions()':1189../../deps/v8/include/v8-profiler.h:1128:27: warning: 'v8::HeapProfiler::HeapSnapshotOptions::global_object_name_resolver' is deprecated: Use context_name_resolver callback instead. [-Wdeprecated-declarations]1190 1128 | HeapSnapshotOptions() {}1191 | ^1192../../deps/v8/include/v8-profiler.h:1142:25: note: declared here1193 1142 | ObjectNameResolver* global_object_name_resolver = nullptr;1194 | ^~~~~~~~~~~~~~~~~~~~~~~~~~~1195../../deps/v8/include/v8-profiler.h:1128:27: warning: 'v8::HeapProfiler::HeapSnapshotOptions::global_object_name_resolver' is deprecated: Use context_name_resolver callback instead. [-Wdeprecated-declarations]1196 1128 | HeapSnapshotOptions() {}1197 | ^1198../../deps/v8/include/v8-profiler.h:1142:25: note: declared here1199 1142 | ObjectNameResolver* global_object_name_resolver = nullptr;1200 | ^~~~~~~~~~~~~~~~~~~~~~~~~~~1201[191/1871] CXX obj/src/node_base.node_binding.o1202In file included from ../../src/memory_tracker.h:6,1203 from ../../src/aliased_buffer.h:7,1204 from ../../src/aliased_buffer-inl.h:6,1205 from ../../src/env-inl.h:27,1206 from ../../src/node_binding.cc:3:1207../../deps/v8/include/v8-profiler.h: In constructor 'v8::HeapProfiler::HeapSnapshotOptions::HeapSnapshotOptions()':1208../../deps/v8/include/v8-profiler.h:1128:27: warning: 'v8::HeapProfiler::HeapSnapshotOptions::global_object_name_resolver' is deprecated: Use context_name_resolver callback instead. [-Wdeprecated-declarations]1209 1128 | HeapSnapshotOptions() {}1210 | ^1211../../deps/v8/include/v8-profiler.h:1142:25: note: declared here1212 1142 | ObjectNameResolver* global_object_name_resolver = nullptr;1213 | ^~~~~~~~~~~~~~~~~~~~~~~~~~~1214../../deps/v8/include/v8-profiler.h:1128:27: warning: 'v8::HeapProfiler::HeapSnapshotOptions::global_object_name_resolver' is deprecated: Use context_name_resolver callback instead. [-Wdeprecated-declarations]1215 1128 | HeapSnapshotOptions() {}1216 | ^1217../../deps/v8/include/v8-profiler.h:1142:25: note: declared here1218 1142 | ObjectNameResolver* global_object_name_resolver = nullptr;1219 | ^~~~~~~~~~~~~~~~~~~~~~~~~~~1220[192/1871] CXX obj/src/node_base.node_external_reference.o1221In file included from ../../src/memory_tracker.h:6,1222 from ../../src/base_object.h:29,1223 from ../../src/base_object-inl.h:27,1224 from ../../src/node_external_reference.cc:4:1225../../deps/v8/include/v8-profiler.h: In constructor 'v8::HeapProfiler::HeapSnapshotOptions::HeapSnapshotOptions()':1226../../deps/v8/include/v8-profiler.h:1128:27: warning: 'v8::HeapProfiler::HeapSnapshotOptions::global_object_name_resolver' is deprecated: Use context_name_resolver callback instead. [-Wdeprecated-declarations]1227 1128 | HeapSnapshotOptions() {}1228 | ^1229../../deps/v8/include/v8-profiler.h:1142:25: note: declared here1230 1142 | ObjectNameResolver* global_object_name_resolver = nullptr;1231 | ^~~~~~~~~~~~~~~~~~~~~~~~~~~1232../../deps/v8/include/v8-profiler.h:1128:27: warning: 'v8::HeapProfiler::HeapSnapshotOptions::global_object_name_resolver' is deprecated: Use context_name_resolver callback instead. [-Wdeprecated-declarations]1233 1128 | HeapSnapshotOptions() {}1234 | ^1235../../deps/v8/include/v8-profiler.h:1142:25: note: declared here1236 1142 | ObjectNameResolver* global_object_name_resolver = nullptr;1237 | ^~~~~~~~~~~~~~~~~~~~~~~~~~~1238[193/1871] CXX obj/src/node_base.node_env_var.o1239In file included from ../../src/memory_tracker.h:6,1240 from ../../src/base_object.h:29,1241 from ../../src/async_wrap.h:27,1242 from ../../src/debug_utils.h:6,1243 from ../../src/debug_utils-inl.h:6,1244 from ../../src/node_env_var.cc:1:1245../../deps/v8/include/v8-profiler.h: In constructor 'v8::HeapProfiler::HeapSnapshotOptions::HeapSnapshotOptions()':1246../../deps/v8/include/v8-profiler.h:1128:27: warning: 'v8::HeapProfiler::HeapSnapshotOptions::global_object_name_resolver' is deprecated: Use context_name_resolver callback instead. [-Wdeprecated-declarations]1247 1128 | HeapSnapshotOptions() {}1248 | ^1249../../deps/v8/include/v8-profiler.h:1142:25: note: declared here1250 1142 | ObjectNameResolver* global_object_name_resolver = nullptr;1251 | ^~~~~~~~~~~~~~~~~~~~~~~~~~~1252../../deps/v8/include/v8-profiler.h:1128:27: warning: 'v8::HeapProfiler::HeapSnapshotOptions::global_object_name_resolver' is deprecated: Use context_name_resolver callback instead. [-Wdeprecated-declarations]1253 1128 | HeapSnapshotOptions() {}1254 | ^1255../../deps/v8/include/v8-profiler.h:1142:25: note: declared here1256 1142 | ObjectNameResolver* global_object_name_resolver = nullptr;1257 | ^~~~~~~~~~~~~~~~~~~~~~~~~~~1258[194/1871] CXX obj/src/node_base.node_builtins.o1259In file included from ../../src/util.h:29,1260 from ../../src/node_mutex.h:6,1261 from ../../src/node_builtins.h:16,1262 from ../../src/node_builtins.cc:1:1263../../deps/v8/include/v8-profiler.h: In constructor 'v8::HeapProfiler::HeapSnapshotOptions::HeapSnapshotOptions()':1264../../deps/v8/include/v8-profiler.h:1128:27: warning: 'v8::HeapProfiler::HeapSnapshotOptions::global_object_name_resolver' is deprecated: Use context_name_resolver callback instead. [-Wdeprecated-declarations]1265 1128 | HeapSnapshotOptions() {}1266 | ^1267../../deps/v8/include/v8-profiler.h:1142:25: note: declared here1268 1142 | ObjectNameResolver* global_object_name_resolver = nullptr;1269 | ^~~~~~~~~~~~~~~~~~~~~~~~~~~1270../../deps/v8/include/v8-profiler.h:1128:27: warning: 'v8::HeapProfiler::HeapSnapshotOptions::global_object_name_resolver' is deprecated: Use context_name_resolver callback instead. [-Wdeprecated-declarations]1271 1128 | HeapSnapshotOptions() {}1272 | ^1273../../deps/v8/include/v8-profiler.h:1142:25: note: declared here1274 1142 | ObjectNameResolver* global_object_name_resolver = nullptr;1275 | ^~~~~~~~~~~~~~~~~~~~~~~~~~~1276[195/1871] CXX obj/deps/v8/src/torque/torque_base.implementation-visitor.o1277[196/1871] AR obj/tools/v8_gypfiles/libtorque_base.a1278[197/1871] STAMP obj/tools/v8_gypfiles/torque.actions_depends.stamp1279[198/1871] CXX obj/src/node_base.node_profiling.o1280In file included from ../../src/node_profiling.h:6,1281 from ../../src/node_profiling.cc:1:1282../../deps/v8/include/v8-profiler.h: In constructor 'v8::HeapProfiler::HeapSnapshotOptions::HeapSnapshotOptions()':1283../../deps/v8/include/v8-profiler.h:1128:27: warning: 'v8::HeapProfiler::HeapSnapshotOptions::global_object_name_resolver' is deprecated: Use context_name_resolver callback instead. [-Wdeprecated-declarations]1284 1128 | HeapSnapshotOptions() {}1285 | ^1286../../deps/v8/include/v8-profiler.h:1142:25: note: declared here1287 1142 | ObjectNameResolver* global_object_name_resolver = nullptr;1288 | ^~~~~~~~~~~~~~~~~~~~~~~~~~~1289../../deps/v8/include/v8-profiler.h:1128:27: warning: 'v8::HeapProfiler::HeapSnapshotOptions::global_object_name_resolver' is deprecated: Use context_name_resolver callback instead. [-Wdeprecated-declarations]1290 1128 | HeapSnapshotOptions() {}1291 | ^1292../../deps/v8/include/v8-profiler.h:1142:25: note: declared here1293 1142 | ObjectNameResolver* global_object_name_resolver = nullptr;1294 | ^~~~~~~~~~~~~~~~~~~~~~~~~~~1295[199/1871] CXX obj/src/node_base.node_cjs_lexer.o1296In file included from ../../src/memory_tracker.h:6,1297 from ../../src/aliased_buffer.h:7,1298 from ../../src/aliased_buffer-inl.h:6,1299 from ../../src/env-inl.h:27,1300 from ../../src/node_cjs_lexer.cc:1:1301../../deps/v8/include/v8-profiler.h: In constructor 'v8::HeapProfiler::HeapSnapshotOptions::HeapSnapshotOptions()':1302../../deps/v8/include/v8-profiler.h:1128:27: warning: 'v8::HeapProfiler::HeapSnapshotOptions::global_object_name_resolver' is deprecated: Use context_name_resolver callback instead. [-Wdeprecated-declarations]1303 1128 | HeapSnapshotOptions() {}1304 | ^1305../../deps/v8/include/v8-profiler.h:1142:25: note: declared here1306 1142 | ObjectNameResolver* global_object_name_resolver = nullptr;1307 | ^~~~~~~~~~~~~~~~~~~~~~~~~~~1308../../deps/v8/include/v8-profiler.h:1128:27: warning: 'v8::HeapProfiler::HeapSnapshotOptions::global_object_name_resolver' is deprecated: Use context_name_resolver callback instead. [-Wdeprecated-declarations]1309 1128 | HeapSnapshotOptions() {}1310 | ^1311../../deps/v8/include/v8-profiler.h:1142:25: note: declared here1312 1142 | ObjectNameResolver* global_object_name_resolver = nullptr;1313 | ^~~~~~~~~~~~~~~~~~~~~~~~~~~1314[200/1871] CXX obj/src/node_base.node_http_parser.o1315In file included from ../../src/util.h:29,1316 from ../../src/node_http_parser.cc:24:1317../../deps/v8/include/v8-profiler.h: In constructor 'v8::HeapProfiler::HeapSnapshotOptions::HeapSnapshotOptions()':1318../../deps/v8/include/v8-profiler.h:1128:27: warning: 'v8::HeapProfiler::HeapSnapshotOptions::global_object_name_resolver' is deprecated: Use context_name_resolver callback instead. [-Wdeprecated-declarations]1319 1128 | HeapSnapshotOptions() {}1320 | ^1321../../deps/v8/include/v8-profiler.h:1142:25: note: declared here1322 1142 | ObjectNameResolver* global_object_name_resolver = nullptr;1323 | ^~~~~~~~~~~~~~~~~~~~~~~~~~~1324../../deps/v8/include/v8-profiler.h:1128:27: warning: 'v8::HeapProfiler::HeapSnapshotOptions::global_object_name_resolver' is deprecated: Use context_name_resolver callback instead. [-Wdeprecated-declarations]1325 1128 | HeapSnapshotOptions() {}1326 | ^1327../../deps/v8/include/v8-profiler.h:1142:25: note: declared here1328 1142 | ObjectNameResolver* global_object_name_resolver = nullptr;1329 | ^~~~~~~~~~~~~~~~~~~~~~~~~~~1330[201/1871] CXX obj/src/node_base.node_errors.o1331In file included from ../../src/memory_tracker.h:6,1332 from ../../src/base_object.h:29,1333 from ../../src/async_wrap.h:27,1334 from ../../src/debug_utils.h:6,1335 from ../../src/debug_utils-inl.h:6,1336 from ../../src/node_errors.cc:6:1337../../deps/v8/include/v8-profiler.h: In constructor 'v8::HeapProfiler::HeapSnapshotOptions::HeapSnapshotOptions()':1338../../deps/v8/include/v8-profiler.h:1128:27: warning: 'v8::HeapProfiler::HeapSnapshotOptions::global_object_name_resolver' is deprecated: Use context_name_resolver callback instead. [-Wdeprecated-declarations]1339 1128 | HeapSnapshotOptions() {}1340 | ^1341../../deps/v8/include/v8-profiler.h:1142:25: note: declared here1342 1142 | ObjectNameResolver* global_object_name_resolver = nullptr;1343 | ^~~~~~~~~~~~~~~~~~~~~~~~~~~1344../../deps/v8/include/v8-profiler.h:1128:27: warning: 'v8::HeapProfiler::HeapSnapshotOptions::global_object_name_resolver' is deprecated: Use context_name_resolver callback instead. [-Wdeprecated-declarations]1345 1128 | HeapSnapshotOptions() {}1346 | ^1347../../deps/v8/include/v8-profiler.h:1142:25: note: declared here1348 1142 | ObjectNameResolver* global_object_name_resolver = nullptr;1349 | ^~~~~~~~~~~~~~~~~~~~~~~~~~~1350[202/1871] CXX obj/src/node_base.node_dotenv.o1351In file included from ../../src/util.h:29,1352 from ../../src/util-inl.h:33,1353 from ../../src/node_dotenv.h:6,1354 from ../../src/node_dotenv.cc:1:1355../../deps/v8/include/v8-profiler.h: In constructor 'v8::HeapProfiler::HeapSnapshotOptions::HeapSnapshotOptions()':1356../../deps/v8/include/v8-profiler.h:1128:27: warning: 'v8::HeapProfiler::HeapSnapshotOptions::global_object_name_resolver' is deprecated: Use context_name_resolver callback instead. [-Wdeprecated-declarations]1357 1128 | HeapSnapshotOptions() {}1358 | ^1359../../deps/v8/include/v8-profiler.h:1142:25: note: declared here1360 1142 | ObjectNameResolver* global_object_name_resolver = nullptr;1361 | ^~~~~~~~~~~~~~~~~~~~~~~~~~~1362../../deps/v8/include/v8-profiler.h:1128:27: warning: 'v8::HeapProfiler::HeapSnapshotOptions::global_object_name_resolver' is deprecated: Use context_name_resolver callback instead. [-Wdeprecated-declarations]1363 1128 | HeapSnapshotOptions() {}1364 | ^1365../../deps/v8/include/v8-profiler.h:1142:25: note: declared here1366 1142 | ObjectNameResolver* global_object_name_resolver = nullptr;1367 | ^~~~~~~~~~~~~~~~~~~~~~~~~~~1368[203/1871] LINK torque1369[204/1871] CXX obj/src/node_base.node_ipc_serdes.o1370In file included from ../../src/memory_tracker.h:6,1371 from ../../src/aliased_buffer.h:7,1372 from ../../src/aliased_buffer-inl.h:6,1373 from ../../src/env-inl.h:27,1374 from ../../src/node_ipc_serdes.cc:1:1375../../deps/v8/include/v8-profiler.h: In constructor 'v8::HeapProfiler::HeapSnapshotOptions::HeapSnapshotOptions()':1376../../deps/v8/include/v8-profiler.h:1128:27: warning: 'v8::HeapProfiler::HeapSnapshotOptions::global_object_name_resolver' is deprecated: Use context_name_resolver callback instead. [-Wdeprecated-declarations]1377 1128 | HeapSnapshotOptions() {}1378 | ^1379../../deps/v8/include/v8-profiler.h:1142:25: note: declared here1380 1142 | ObjectNameResolver* global_object_name_resolver = nullptr;1381 | ^~~~~~~~~~~~~~~~~~~~~~~~~~~1382../../deps/v8/include/v8-profiler.h:1128:27: warning: 'v8::HeapProfiler::HeapSnapshotOptions::global_object_name_resolver' is deprecated: Use context_name_resolver callback instead. [-Wdeprecated-declarations]1383 1128 | HeapSnapshotOptions() {}1384 | ^1385../../deps/v8/include/v8-profiler.h:1142:25: note: declared here1386 1142 | ObjectNameResolver* global_object_name_resolver = nullptr;1387 | ^~~~~~~~~~~~~~~~~~~~~~~~~~~1388[205/1871] CXX obj/src/node_base.node_buffer.o1389In file included from ../../src/memory_tracker.h:6,1390 from ../../src/base_object.h:29,1391 from ../../src/async_wrap.h:27,1392 from ../../src/node_blob.h:8,1393 from ../../src/node_buffer.cc:24:1394../../deps/v8/include/v8-profiler.h: In constructor 'v8::HeapProfiler::HeapSnapshotOptions::HeapSnapshotOptions()':1395../../deps/v8/include/v8-profiler.h:1128:27: warning: 'v8::HeapProfiler::HeapSnapshotOptions::global_object_name_resolver' is deprecated: Use context_name_resolver callback instead. [-Wdeprecated-declarations]1396 1128 | HeapSnapshotOptions() {}1397 | ^1398../../deps/v8/include/v8-profiler.h:1142:25: note: declared here1399 1142 | ObjectNameResolver* global_object_name_resolver = nullptr;1400 | ^~~~~~~~~~~~~~~~~~~~~~~~~~~1401../../deps/v8/include/v8-profiler.h:1128:27: warning: 'v8::HeapProfiler::HeapSnapshotOptions::global_object_name_resolver' is deprecated: Use context_name_resolver callback instead. [-Wdeprecated-declarations]1402 1128 | HeapSnapshotOptions() {}1403 | ^1404../../deps/v8/include/v8-profiler.h:1142:25: note: declared here1405 1142 | ObjectNameResolver* global_object_name_resolver = nullptr;1406 | ^~~~~~~~~~~~~~~~~~~~~~~~~~~1407[206/1871] CXX obj/src/node_base.node_i18n.o1408In file included from ../../src/memory_tracker.h:6,1409 from ../../src/base_object.h:29,1410 from ../../src/node_i18n.h:29,1411 from ../../src/node_i18n.cc:43:1412../../deps/v8/include/v8-profiler.h: In constructor 'v8::HeapProfiler::HeapSnapshotOptions::HeapSnapshotOptions()':1413../../deps/v8/include/v8-profiler.h:1128:27: warning: 'v8::HeapProfiler::HeapSnapshotOptions::global_object_name_resolver' is deprecated: Use context_name_resolver callback instead. [-Wdeprecated-declarations]1414 1128 | HeapSnapshotOptions() {}1415 | ^1416../../deps/v8/include/v8-profiler.h:1142:25: note: declared here1417 1142 | ObjectNameResolver* global_object_name_resolver = nullptr;1418 | ^~~~~~~~~~~~~~~~~~~~~~~~~~~1419../../deps/v8/include/v8-profiler.h:1128:27: warning: 'v8::HeapProfiler::HeapSnapshotOptions::global_object_name_resolver' is deprecated: Use context_name_resolver callback instead. [-Wdeprecated-declarations]1420 1128 | HeapSnapshotOptions() {}1421 | ^1422../../deps/v8/include/v8-profiler.h:1142:25: note: declared here1423 1142 | ObjectNameResolver* global_object_name_resolver = nullptr;1424 | ^~~~~~~~~~~~~~~~~~~~~~~~~~~1425[207/1871] CXX obj/src/node_base.node_contextify.o1426In file included from ../../src/memory_tracker.h:6,1427 from ../../src/base_object.h:29,1428 from ../../src/base_object-inl.h:27,1429 from ../../src/node_contextify.h:6,1430 from ../../src/node_contextify.cc:22:1431../../deps/v8/include/v8-profiler.h: In constructor 'v8::HeapProfiler::HeapSnapshotOptions::HeapSnapshotOptions()':1432../../deps/v8/include/v8-profiler.h:1128:27: warning: 'v8::HeapProfiler::HeapSnapshotOptions::global_object_name_resolver' is deprecated: Use context_name_resolver callback instead. [-Wdeprecated-declarations]1433 1128 | HeapSnapshotOptions() {}1434 | ^1435../../deps/v8/include/v8-profiler.h:1142:25: note: declared here1436 1142 | ObjectNameResolver* global_object_name_resolver = nullptr;1437 | ^~~~~~~~~~~~~~~~~~~~~~~~~~~1438../../deps/v8/include/v8-profiler.h:1128:27: warning: 'v8::HeapProfiler::HeapSnapshotOptions::global_object_name_resolver' is deprecated: Use context_name_resolver callback instead. [-Wdeprecated-declarations]1439 1128 | HeapSnapshotOptions() {}1440 | ^1441../../deps/v8/include/v8-profiler.h:1142:25: note: declared here1442 1142 | ObjectNameResolver* global_object_name_resolver = nullptr;1443 | ^~~~~~~~~~~~~~~~~~~~~~~~~~~1444[208/1871] CXX obj/src/node_base.node_diagnostics_channel.o1445In file included from ../../src/memory_tracker.h:6,1446 from ../../src/aliased_buffer.h:7,1447 from ../../src/node_diagnostics_channel.h:11,1448 from ../../src/node_diagnostics_channel.cc:1:1449../../deps/v8/include/v8-profiler.h: In constructor 'v8::HeapProfiler::HeapSnapshotOptions::HeapSnapshotOptions()':1450../../deps/v8/include/v8-profiler.h:1128:27: warning: 'v8::HeapProfiler::HeapSnapshotOptions::global_object_name_resolver' is deprecated: Use context_name_resolver callback instead. [-Wdeprecated-declarations]1451 1128 | HeapSnapshotOptions() {}1452 | ^1453../../deps/v8/include/v8-profiler.h:1142:25: note: declared here1454 1142 | ObjectNameResolver* global_object_name_resolver = nullptr;1455 | ^~~~~~~~~~~~~~~~~~~~~~~~~~~1456../../deps/v8/include/v8-profiler.h:1128:27: warning: 'v8::HeapProfiler::HeapSnapshotOptions::global_object_name_resolver' is deprecated: Use context_name_resolver callback instead. [-Wdeprecated-declarations]1457 1128 | HeapSnapshotOptions() {}1458 | ^1459../../deps/v8/include/v8-profiler.h:1142:25: note: declared here1460 1142 | ObjectNameResolver* global_object_name_resolver = nullptr;1461 | ^~~~~~~~~~~~~~~~~~~~~~~~~~~1462[209/1871] CXX obj/src/node_base.node_metadata.o1463In file included from ../../src/util.h:29,1464 from ../../src/node_metadata.cc:22:1465../../deps/v8/include/v8-profiler.h: In constructor 'v8::HeapProfiler::HeapSnapshotOptions::HeapSnapshotOptions()':1466../../deps/v8/include/v8-profiler.h:1128:27: warning: 'v8::HeapProfiler::HeapSnapshotOptions::global_object_name_resolver' is deprecated: Use context_name_resolver callback instead. [-Wdeprecated-declarations]1467 1128 | HeapSnapshotOptions() {}1468 | ^1469../../deps/v8/include/v8-profiler.h:1142:25: note: declared here1470 1142 | ObjectNameResolver* global_object_name_resolver = nullptr;1471 | ^~~~~~~~~~~~~~~~~~~~~~~~~~~1472../../deps/v8/include/v8-profiler.h:1128:27: warning: 'v8::HeapProfiler::HeapSnapshotOptions::global_object_name_resolver' is deprecated: Use context_name_resolver callback instead. [-Wdeprecated-declarations]1473 1128 | HeapSnapshotOptions() {}1474 | ^1475../../deps/v8/include/v8-profiler.h:1142:25: note: declared here1476 1142 | ObjectNameResolver* global_object_name_resolver = nullptr;1477 | ^~~~~~~~~~~~~~~~~~~~~~~~~~~1478[210/1871] CXX obj/src/node_base.node_locks.o1479In file included from ../../src/memory_tracker.h:6,1480 from ../../src/base_object.h:29,1481 from ../../src/node_locks.h:11,1482 from ../../src/node_locks.cc:1:1483../../deps/v8/include/v8-profiler.h: In constructor 'v8::HeapProfiler::HeapSnapshotOptions::HeapSnapshotOptions()':1484../../deps/v8/include/v8-profiler.h:1128:27: warning: 'v8::HeapProfiler::HeapSnapshotOptions::global_object_name_resolver' is deprecated: Use context_name_resolver callback instead. [-Wdeprecated-declarations]1485 1128 | HeapSnapshotOptions() {}1486 | ^1487../../deps/v8/include/v8-profiler.h:1142:25: note: declared here1488 1142 | ObjectNameResolver* global_object_name_resolver = nullptr;1489 | ^~~~~~~~~~~~~~~~~~~~~~~~~~~1490../../deps/v8/include/v8-profiler.h:1128:27: warning: 'v8::HeapProfiler::HeapSnapshotOptions::global_object_name_resolver' is deprecated: Use context_name_resolver callback instead. [-Wdeprecated-declarations]1491 1128 | HeapSnapshotOptions() {}1492 | ^1493../../deps/v8/include/v8-profiler.h:1142:25: note: declared here1494 1142 | ObjectNameResolver* global_object_name_resolver = nullptr;1495 | ^~~~~~~~~~~~~~~~~~~~~~~~~~~1496[211/1871] CXX obj/src/node_base.node_main_instance.o1497In file included from ../../src/util.h:29,1498 from ../../src/node_main_instance.h:11,1499 from ../../src/node_main_instance.cc:1:1500../../deps/v8/include/v8-profiler.h: In constructor 'v8::HeapProfiler::HeapSnapshotOptions::HeapSnapshotOptions()':1501../../deps/v8/include/v8-profiler.h:1128:27: warning: 'v8::HeapProfiler::HeapSnapshotOptions::global_object_name_resolver' is deprecated: Use context_name_resolver callback instead. [-Wdeprecated-declarations]1502 1128 | HeapSnapshotOptions() {}1503 | ^1504../../deps/v8/include/v8-profiler.h:1142:25: note: declared here1505 1142 | ObjectNameResolver* global_object_name_resolver = nullptr;1506 | ^~~~~~~~~~~~~~~~~~~~~~~~~~~1507../../deps/v8/include/v8-profiler.h:1128:27: warning: 'v8::HeapProfiler::HeapSnapshotOptions::global_object_name_resolver' is deprecated: Use context_name_resolver callback instead. [-Wdeprecated-declarations]1508 1128 | HeapSnapshotOptions() {}1509 | ^1510../../deps/v8/include/v8-profiler.h:1142:25: note: declared here1511 1142 | ObjectNameResolver* global_object_name_resolver = nullptr;1512 | ^~~~~~~~~~~~~~~~~~~~~~~~~~~1513[212/1871] CXX obj/src/node_base.node_perf.o1514In file included from ../../src/memory_tracker.h:6,1515 from ../../src/base_object.h:29,1516 from ../../src/base_object-inl.h:27,1517 from ../../src/node_perf.h:6,1518 from ../../src/node_perf.cc:1:1519../../deps/v8/include/v8-profiler.h: In constructor 'v8::HeapProfiler::HeapSnapshotOptions::HeapSnapshotOptions()':1520../../deps/v8/include/v8-profiler.h:1128:27: warning: 'v8::HeapProfiler::HeapSnapshotOptions::global_object_name_resolver' is deprecated: Use context_name_resolver callback instead. [-Wdeprecated-declarations]1521 1128 | HeapSnapshotOptions() {}1522 | ^1523../../deps/v8/include/v8-profiler.h:1142:25: note: declared here1524 1142 | ObjectNameResolver* global_object_name_resolver = nullptr;1525 | ^~~~~~~~~~~~~~~~~~~~~~~~~~~1526../../deps/v8/include/v8-profiler.h:1128:27: warning: 'v8::HeapProfiler::HeapSnapshotOptions::global_object_name_resolver' is deprecated: Use context_name_resolver callback instead. [-Wdeprecated-declarations]1527 1128 | HeapSnapshotOptions() {}1528 | ^1529../../deps/v8/include/v8-profiler.h:1142:25: note: declared here1530 1142 | ObjectNameResolver* global_object_name_resolver = nullptr;1531 | ^~~~~~~~~~~~~~~~~~~~~~~~~~~1532[213/1871] CXX obj/src/node_base.node_os.o1533In file included from ../../src/memory_tracker.h:6,1534 from ../../src/aliased_buffer.h:7,1535 from ../../src/aliased_buffer-inl.h:6,1536 from ../../src/env-inl.h:27,1537 from ../../src/node_os.cc:22:1538../../deps/v8/include/v8-profiler.h: In constructor 'v8::HeapProfiler::HeapSnapshotOptions::HeapSnapshotOptions()':1539../../deps/v8/include/v8-profiler.h:1128:27: warning: 'v8::HeapProfiler::HeapSnapshotOptions::global_object_name_resolver' is deprecated: Use context_name_resolver callback instead. [-Wdeprecated-declarations]1540 1128 | HeapSnapshotOptions() {}1541 | ^1542../../deps/v8/include/v8-profiler.h:1142:25: note: declared here1543 1142 | ObjectNameResolver* global_object_name_resolver = nullptr;1544 | ^~~~~~~~~~~~~~~~~~~~~~~~~~~1545../../deps/v8/include/v8-profiler.h:1128:27: warning: 'v8::HeapProfiler::HeapSnapshotOptions::global_object_name_resolver' is deprecated: Use context_name_resolver callback instead. [-Wdeprecated-declarations]1546 1128 | HeapSnapshotOptions() {}1547 | ^1548../../deps/v8/include/v8-profiler.h:1142:25: note: declared here1549 1142 | ObjectNameResolver* global_object_name_resolver = nullptr;1550 | ^~~~~~~~~~~~~~~~~~~~~~~~~~~1551[214/1871] CXX obj/src/node_base.node_report_utils.o1552In file included from ../../src/memory_tracker.h:6,1553 from ../../src/aliased_buffer.h:7,1554 from ../../src/env.h:27,1555 from ../../src/node_internals.h:27,1556 from ../../src/node_report_utils.cc:2:1557../../deps/v8/include/v8-profiler.h: In constructor 'v8::HeapProfiler::HeapSnapshotOptions::HeapSnapshotOptions()':1558../../deps/v8/include/v8-profiler.h:1128:27: warning: 'v8::HeapProfiler::HeapSnapshotOptions::global_object_name_resolver' is deprecated: Use context_name_resolver callback instead. [-Wdeprecated-declarations]1559 1128 | HeapSnapshotOptions() {}1560 | ^1561../../deps/v8/include/v8-profiler.h:1142:25: note: declared here1562 1142 | ObjectNameResolver* global_object_name_resolver = nullptr;1563 | ^~~~~~~~~~~~~~~~~~~~~~~~~~~1564../../deps/v8/include/v8-profiler.h:1128:27: warning: 'v8::HeapProfiler::HeapSnapshotOptions::global_object_name_resolver' is deprecated: Use context_name_resolver callback instead. [-Wdeprecated-declarations]1565 1128 | HeapSnapshotOptions() {}1566 | ^1567../../deps/v8/include/v8-profiler.h:1142:25: note: declared here1568 1142 | ObjectNameResolver* global_object_name_resolver = nullptr;1569 | ^~~~~~~~~~~~~~~~~~~~~~~~~~~1570[215/1871] CXX obj/src/node_base.node_process_object.o1571In file included from ../../src/memory_tracker.h:6,1572 from ../../src/aliased_buffer.h:7,1573 from ../../src/aliased_buffer-inl.h:6,1574 from ../../src/env-inl.h:27,1575 from ../../src/node_process_object.cc:1:1576../../deps/v8/include/v8-profiler.h: In constructor 'v8::HeapProfiler::HeapSnapshotOptions::HeapSnapshotOptions()':1577../../deps/v8/include/v8-profiler.h:1128:27: warning: 'v8::HeapProfiler::HeapSnapshotOptions::global_object_name_resolver' is deprecated: Use context_name_resolver callback instead. [-Wdeprecated-declarations]1578 1128 | HeapSnapshotOptions() {}1579 | ^1580../../deps/v8/include/v8-profiler.h:1142:25: note: declared here1581 1142 | ObjectNameResolver* global_object_name_resolver = nullptr;1582 | ^~~~~~~~~~~~~~~~~~~~~~~~~~~1583../../deps/v8/include/v8-profiler.h:1128:27: warning: 'v8::HeapProfiler::HeapSnapshotOptions::global_object_name_resolver' is deprecated: Use context_name_resolver callback instead. [-Wdeprecated-declarations]1584 1128 | HeapSnapshotOptions() {}1585 | ^1586../../deps/v8/include/v8-profiler.h:1142:25: note: declared here1587 1142 | ObjectNameResolver* global_object_name_resolver = nullptr;1588 | ^~~~~~~~~~~~~~~~~~~~~~~~~~~1589[216/1871] CXX obj/src/node_base.node_postmortem_metadata.o1590In file included from ../../src/memory_tracker.h:6,1591 from ../../src/base_object.h:29,1592 from ../../src/base_object-inl.h:27,1593 from ../../src/node_postmortem_metadata.cc:1:1594../../deps/v8/include/v8-profiler.h: In constructor 'v8::HeapProfiler::HeapSnapshotOptions::HeapSnapshotOptions()':1595../../deps/v8/include/v8-profiler.h:1128:27: warning: 'v8::HeapProfiler::HeapSnapshotOptions::global_object_name_resolver' is deprecated: Use context_name_resolver callback instead. [-Wdeprecated-declarations]1596 1128 | HeapSnapshotOptions() {}1597 | ^1598../../deps/v8/include/v8-profiler.h:1142:25: note: declared here1599 1142 | ObjectNameResolver* global_object_name_resolver = nullptr;1600 | ^~~~~~~~~~~~~~~~~~~~~~~~~~~1601../../deps/v8/include/v8-profiler.h:1128:27: warning: 'v8::HeapProfiler::HeapSnapshotOptions::global_object_name_resolver' is deprecated: Use context_name_resolver callback instead. [-Wdeprecated-declarations]1602 1128 | HeapSnapshotOptions() {}1603 | ^1604../../deps/v8/include/v8-profiler.h:1142:25: note: declared here1605 1142 | ObjectNameResolver* global_object_name_resolver = nullptr;1606 | ^~~~~~~~~~~~~~~~~~~~~~~~~~~1607[217/1871] CXX obj/src/node_base.node_platform.o1608In file included from ../../src/util.h:29,1609 from ../../src/node_mutex.h:6,1610 from ../../src/node_platform.h:15,1611 from ../../src/node_platform.cc:1:1612../../deps/v8/include/v8-profiler.h: In constructor 'v8::HeapProfiler::HeapSnapshotOptions::HeapSnapshotOptions()':1613../../deps/v8/include/v8-profiler.h:1128:27: warning: 'v8::HeapProfiler::HeapSnapshotOptions::global_object_name_resolver' is deprecated: Use context_name_resolver callback instead. [-Wdeprecated-declarations]1614 1128 | HeapSnapshotOptions() {}1615 | ^1616../../deps/v8/include/v8-profiler.h:1142:25: note: declared here1617 1142 | ObjectNameResolver* global_object_name_resolver = nullptr;1618 | ^~~~~~~~~~~~~~~~~~~~~~~~~~~1619../../deps/v8/include/v8-profiler.h:1128:27: warning: 'v8::HeapProfiler::HeapSnapshotOptions::global_object_name_resolver' is deprecated: Use context_name_resolver callback instead. [-Wdeprecated-declarations]1620 1128 | HeapSnapshotOptions() {}1621 | ^1622../../deps/v8/include/v8-profiler.h:1142:25: note: declared here1623 1142 | ObjectNameResolver* global_object_name_resolver = nullptr;1624 | ^~~~~~~~~~~~~~~~~~~~~~~~~~~1625[218/1871] CXX obj/src/node_base.node_process_events.o1626In file included from ../../src/memory_tracker.h:6,1627 from ../../src/aliased_buffer.h:7,1628 from ../../src/aliased_buffer-inl.h:6,1629 from ../../src/env-inl.h:27,1630 from ../../src/node_process_events.cc:3:1631../../deps/v8/include/v8-profiler.h: In constructor 'v8::HeapProfiler::HeapSnapshotOptions::HeapSnapshotOptions()':1632../../deps/v8/include/v8-profiler.h:1128:27: warning: 'v8::HeapProfiler::HeapSnapshotOptions::global_object_name_resolver' is deprecated: Use context_name_resolver callback instead. [-Wdeprecated-declarations]1633 1128 | HeapSnapshotOptions() {}1634 | ^1635../../deps/v8/include/v8-profiler.h:1142:25: note: declared here1636 1142 | ObjectNameResolver* global_object_name_resolver = nullptr;1637 | ^~~~~~~~~~~~~~~~~~~~~~~~~~~1638../../deps/v8/include/v8-profiler.h:1128:27: warning: 'v8::HeapProfiler::HeapSnapshotOptions::global_object_name_resolver' is deprecated: Use context_name_resolver callback instead. [-Wdeprecated-declarations]1639 1128 | HeapSnapshotOptions() {}1640 | ^1641../../deps/v8/include/v8-profiler.h:1142:25: note: declared here1642 1142 | ObjectNameResolver* global_object_name_resolver = nullptr;1643 | ^~~~~~~~~~~~~~~~~~~~~~~~~~~1644[219/1871] CXX obj/src/node_base.node_messaging.o1645In file included from ../../src/memory_tracker.h:6,1646 from ../../src/aliased_buffer.h:7,1647 from ../../src/env.h:27,1648 from ../../src/node_messaging.h:6,1649 from ../../src/node_messaging.cc:1:1650../../deps/v8/include/v8-profiler.h: In constructor 'v8::HeapProfiler::HeapSnapshotOptions::HeapSnapshotOptions()':1651../../deps/v8/include/v8-profiler.h:1128:27: warning: 'v8::HeapProfiler::HeapSnapshotOptions::global_object_name_resolver' is deprecated: Use context_name_resolver callback instead. [-Wdeprecated-declarations]1652 1128 | HeapSnapshotOptions() {}1653 | ^1654../../deps/v8/include/v8-profiler.h:1142:25: note: declared here1655 1142 | ObjectNameResolver* global_object_name_resolver = nullptr;1656 | ^~~~~~~~~~~~~~~~~~~~~~~~~~~1657../../deps/v8/include/v8-profiler.h:1128:27: warning: 'v8::HeapProfiler::HeapSnapshotOptions::global_object_name_resolver' is deprecated: Use context_name_resolver callback instead. [-Wdeprecated-declarations]1658 1128 | HeapSnapshotOptions() {}1659 | ^1660../../deps/v8/include/v8-profiler.h:1142:25: note: declared here1661 1142 | ObjectNameResolver* global_object_name_resolver = nullptr;1662 | ^~~~~~~~~~~~~~~~~~~~~~~~~~~1663[220/1871] CXX obj/src/node_base.node_report_module.o1664In file included from ../../src/memory_tracker.h:6,1665 from ../../src/aliased_buffer.h:7,1666 from ../../src/env.h:27,1667 from ../../src/node_report_module.cc:1:1668../../deps/v8/include/v8-profiler.h: In constructor 'v8::HeapProfiler::HeapSnapshotOptions::HeapSnapshotOptions()':1669../../deps/v8/include/v8-profiler.h:1128:27: warning: 'v8::HeapProfiler::HeapSnapshotOptions::global_object_name_resolver' is deprecated: Use context_name_resolver callback instead. [-Wdeprecated-declarations]1670 1128 | HeapSnapshotOptions() {}1671 | ^1672../../deps/v8/include/v8-profiler.h:1142:25: note: declared here1673 1142 | ObjectNameResolver* global_object_name_resolver = nullptr;1674 | ^~~~~~~~~~~~~~~~~~~~~~~~~~~1675../../deps/v8/include/v8-profiler.h:1128:27: warning: 'v8::HeapProfiler::HeapSnapshotOptions::global_object_name_resolver' is deprecated: Use context_name_resolver callback instead. [-Wdeprecated-declarations]1676 1128 | HeapSnapshotOptions() {}1677 | ^1678../../deps/v8/include/v8-profiler.h:1142:25: note: declared here1679 1142 | ObjectNameResolver* global_object_name_resolver = nullptr;1680 | ^~~~~~~~~~~~~~~~~~~~~~~~~~~1681[221/1871] CXX obj/src/node_base.node_modules.o1682In file included from ../../src/memory_tracker.h:6,1683 from ../../src/aliased_buffer.h:7,1684 from ../../src/node_snapshotable.h:7,1685 from ../../src/node_modules.h:7,1686 from ../../src/node_modules.cc:1:1687../../deps/v8/include/v8-profiler.h: In constructor 'v8::HeapProfiler::HeapSnapshotOptions::HeapSnapshotOptions()':1688../../deps/v8/include/v8-profiler.h:1128:27: warning: 'v8::HeapProfiler::HeapSnapshotOptions::global_object_name_resolver' is deprecated: Use context_name_resolver callback instead. [-Wdeprecated-declarations]1689 1128 | HeapSnapshotOptions() {}1690 | ^1691../../deps/v8/include/v8-profiler.h:1142:25: note: declared here1692 1142 | ObjectNameResolver* global_object_name_resolver = nullptr;1693 | ^~~~~~~~~~~~~~~~~~~~~~~~~~~1694../../deps/v8/include/v8-profiler.h:1128:27: warning: 'v8::HeapProfiler::HeapSnapshotOptions::global_object_name_resolver' is deprecated: Use context_name_resolver callback instead. [-Wdeprecated-declarations]1695 1128 | HeapSnapshotOptions() {}1696 | ^1697../../deps/v8/include/v8-profiler.h:1142:25: note: declared here1698 1142 | ObjectNameResolver* global_object_name_resolver = nullptr;1699 | ^~~~~~~~~~~~~~~~~~~~~~~~~~~1700[222/1871] CXX obj/src/node_base.env.o1701In file included from ../../src/memory_tracker.h:6,1702 from ../../src/aliased_buffer.h:7,1703 from ../../src/env.h:27,1704 from ../../src/env.cc:1:1705../../deps/v8/include/v8-profiler.h: In constructor 'v8::HeapProfiler::HeapSnapshotOptions::HeapSnapshotOptions()':1706../../deps/v8/include/v8-profiler.h:1128:27: warning: 'v8::HeapProfiler::HeapSnapshotOptions::global_object_name_resolver' is deprecated: Use context_name_resolver callback instead. [-Wdeprecated-declarations]1707 1128 | HeapSnapshotOptions() {}1708 | ^1709../../deps/v8/include/v8-profiler.h:1142:25: note: declared here1710 1142 | ObjectNameResolver* global_object_name_resolver = nullptr;1711 | ^~~~~~~~~~~~~~~~~~~~~~~~~~~1712../../deps/v8/include/v8-profiler.h:1128:27: warning: 'v8::HeapProfiler::HeapSnapshotOptions::global_object_name_resolver' is deprecated: Use context_name_resolver callback instead. [-Wdeprecated-declarations]1713 1128 | HeapSnapshotOptions() {}1714 | ^1715../../deps/v8/include/v8-profiler.h:1142:25: note: declared here1716 1142 | ObjectNameResolver* global_object_name_resolver = nullptr;1717 | ^~~~~~~~~~~~~~~~~~~~~~~~~~~1718[223/1871] CXX obj/src/node_base.node_realm.o1719In file included from ../../src/memory_tracker.h:6,1720 from ../../src/cleanup_queue.h:11,1721 from ../../src/node_realm.h:8,1722 from ../../src/node_realm.cc:1:1723../../deps/v8/include/v8-profiler.h: In constructor 'v8::HeapProfiler::HeapSnapshotOptions::HeapSnapshotOptions()':1724../../deps/v8/include/v8-profiler.h:1128:27: warning: 'v8::HeapProfiler::HeapSnapshotOptions::global_object_name_resolver' is deprecated: Use context_name_resolver callback instead. [-Wdeprecated-declarations]1725 1128 | HeapSnapshotOptions() {}1726 | ^1727../../deps/v8/include/v8-profiler.h:1142:25: note: declared here1728 1142 | ObjectNameResolver* global_object_name_resolver = nullptr;1729 | ^~~~~~~~~~~~~~~~~~~~~~~~~~~1730../../deps/v8/include/v8-profiler.h:1128:27: warning: 'v8::HeapProfiler::HeapSnapshotOptions::global_object_name_resolver' is deprecated: Use context_name_resolver callback instead. [-Wdeprecated-declarations]1731 1128 | HeapSnapshotOptions() {}1732 | ^1733../../deps/v8/include/v8-profiler.h:1142:25: note: declared here1734 1142 | ObjectNameResolver* global_object_name_resolver = nullptr;1735 | ^~~~~~~~~~~~~~~~~~~~~~~~~~~1736[224/1871] CXX obj/src/node_base.node_stat_watcher.o1737In file included from ../../src/memory_tracker.h:6,1738 from ../../src/base_object.h:29,1739 from ../../src/async_wrap.h:27,1740 from ../../src/handle_wrap.h:27,1741 from ../../src/node_stat_watcher.h:28,1742 from ../../src/node_stat_watcher.cc:22:1743../../deps/v8/include/v8-profiler.h: In constructor 'v8::HeapProfiler::HeapSnapshotOptions::HeapSnapshotOptions()':1744../../deps/v8/include/v8-profiler.h:1128:27: warning: 'v8::HeapProfiler::HeapSnapshotOptions::global_object_name_resolver' is deprecated: Use context_name_resolver callback instead. [-Wdeprecated-declarations]1745 1128 | HeapSnapshotOptions() {}1746 | ^1747../../deps/v8/include/v8-profiler.h:1142:25: note: declared here1748 1142 | ObjectNameResolver* global_object_name_resolver = nullptr;1749 | ^~~~~~~~~~~~~~~~~~~~~~~~~~~1750../../deps/v8/include/v8-profiler.h:1128:27: warning: 'v8::HeapProfiler::HeapSnapshotOptions::global_object_name_resolver' is deprecated: Use context_name_resolver callback instead. [-Wdeprecated-declarations]1751 1128 | HeapSnapshotOptions() {}1752 | ^1753../../deps/v8/include/v8-profiler.h:1142:25: note: declared here1754 1142 | ObjectNameResolver* global_object_name_resolver = nullptr;1755 | ^~~~~~~~~~~~~~~~~~~~~~~~~~~1756[225/1871] CXX obj/src/node_base.node_serdes.o1757In file included from ../../src/memory_tracker.h:6,1758 from ../../src/base_object.h:29,1759 from ../../src/base_object-inl.h:27,1760 from ../../src/node_serdes.cc:1:1761../../deps/v8/include/v8-profiler.h: In constructor 'v8::HeapProfiler::HeapSnapshotOptions::HeapSnapshotOptions()':1762../../deps/v8/include/v8-profiler.h:1128:27: warning: 'v8::HeapProfiler::HeapSnapshotOptions::global_object_name_resolver' is deprecated: Use context_name_resolver callback instead. [-Wdeprecated-declarations]1763 1128 | HeapSnapshotOptions() {}1764 | ^1765../../deps/v8/include/v8-profiler.h:1142:25: note: declared here1766 1142 | ObjectNameResolver* global_object_name_resolver = nullptr;1767 | ^~~~~~~~~~~~~~~~~~~~~~~~~~~1768../../deps/v8/include/v8-profiler.h:1128:27: warning: 'v8::HeapProfiler::HeapSnapshotOptions::global_object_name_resolver' is deprecated: Use context_name_resolver callback instead. [-Wdeprecated-declarations]1769 1128 | HeapSnapshotOptions() {}1770 | ^1771../../deps/v8/include/v8-profiler.h:1142:25: note: declared here1772 1142 | ObjectNameResolver* global_object_name_resolver = nullptr;1773 | ^~~~~~~~~~~~~~~~~~~~~~~~~~~1774[226/1871] CXX obj/src/node_base.node_http2.o1775In file included from ../../src/memory_tracker.h:6,1776 from ../../src/aliased_buffer.h:7,1777 from ../../src/env.h:27,1778 from ../../src/node_http2.h:11,1779 from ../../src/node_http2.cc:1:1780../../deps/v8/include/v8-profiler.h: In constructor 'v8::HeapProfiler::HeapSnapshotOptions::HeapSnapshotOptions()':1781../../deps/v8/include/v8-profiler.h:1128:27: warning: 'v8::HeapProfiler::HeapSnapshotOptions::global_object_name_resolver' is deprecated: Use context_name_resolver callback instead. [-Wdeprecated-declarations]1782 1128 | HeapSnapshotOptions() {}1783 | ^1784../../deps/v8/include/v8-profiler.h:1142:25: note: declared here1785 1142 | ObjectNameResolver* global_object_name_resolver = nullptr;1786 | ^~~~~~~~~~~~~~~~~~~~~~~~~~~1787../../deps/v8/include/v8-profiler.h:1128:27: warning: 'v8::HeapProfiler::HeapSnapshotOptions::global_object_name_resolver' is deprecated: Use context_name_resolver callback instead. [-Wdeprecated-declarations]1788 1128 | HeapSnapshotOptions() {}1789 | ^1790../../deps/v8/include/v8-profiler.h:1142:25: note: declared here1791 1142 | ObjectNameResolver* global_object_name_resolver = nullptr;1792 | ^~~~~~~~~~~~~~~~~~~~~~~~~~~1793[227/1871] CXX obj/src/node_base.node_shadow_realm.o1794In file included from ../../src/memory_tracker.h:6,1795 from ../../src/cleanup_queue.h:11,1796 from ../../src/node_realm.h:8,1797 from ../../src/node_shadow_realm.h:6,1798 from ../../src/node_shadow_realm.cc:1:1799../../deps/v8/include/v8-profiler.h: In constructor 'v8::HeapProfiler::HeapSnapshotOptions::HeapSnapshotOptions()':1800../../deps/v8/include/v8-profiler.h:1128:27: warning: 'v8::HeapProfiler::HeapSnapshotOptions::global_object_name_resolver' is deprecated: Use context_name_resolver callback instead. [-Wdeprecated-declarations]1801 1128 | HeapSnapshotOptions() {}1802 | ^1803../../deps/v8/include/v8-profiler.h:1142:25: note: declared here1804 1142 | ObjectNameResolver* global_object_name_resolver = nullptr;1805 | ^~~~~~~~~~~~~~~~~~~~~~~~~~~1806../../deps/v8/include/v8-profiler.h:1128:27: warning: 'v8::HeapProfiler::HeapSnapshotOptions::global_object_name_resolver' is deprecated: Use context_name_resolver callback instead. [-Wdeprecated-declarations]1807 1128 | HeapSnapshotOptions() {}1808 | ^1809../../deps/v8/include/v8-profiler.h:1142:25: note: declared here1810 1142 | ObjectNameResolver* global_object_name_resolver = nullptr;1811 | ^~~~~~~~~~~~~~~~~~~~~~~~~~~1812[228/1871] CXX obj/src/node_base.node_symbols.o1813In file included from ../../src/memory_tracker.h:6,1814 from ../../src/aliased_buffer.h:7,1815 from ../../src/aliased_buffer-inl.h:6,1816 from ../../src/env-inl.h:27,1817 from ../../src/node_symbols.cc:1:1818../../deps/v8/include/v8-profiler.h: In constructor 'v8::HeapProfiler::HeapSnapshotOptions::HeapSnapshotOptions()':1819../../deps/v8/include/v8-profiler.h:1128:27: warning: 'v8::HeapProfiler::HeapSnapshotOptions::global_object_name_resolver' is deprecated: Use context_name_resolver callback instead. [-Wdeprecated-declarations]1820 1128 | HeapSnapshotOptions() {}1821 | ^1822../../deps/v8/include/v8-profiler.h:1142:25: note: declared here1823 1142 | ObjectNameResolver* global_object_name_resolver = nullptr;1824 | ^~~~~~~~~~~~~~~~~~~~~~~~~~~1825../../deps/v8/include/v8-profiler.h:1128:27: warning: 'v8::HeapProfiler::HeapSnapshotOptions::global_object_name_resolver' is deprecated: Use context_name_resolver callback instead. [-Wdeprecated-declarations]1826 1128 | HeapSnapshotOptions() {}1827 | ^1828../../deps/v8/include/v8-profiler.h:1142:25: note: declared here1829 1142 | ObjectNameResolver* global_object_name_resolver = nullptr;1830 | ^~~~~~~~~~~~~~~~~~~~~~~~~~~1831[229/1871] CXX obj/src/node_base.node_process_methods.o1832In file included from ../../src/memory_tracker.h:6,1833 from ../../src/base_object.h:29,1834 from ../../src/async_wrap.h:27,1835 from ../../src/async_wrap-inl.h:27,1836 from ../../src/node_process_methods.cc:1:1837../../deps/v8/include/v8-profiler.h: In constructor 'v8::HeapProfiler::HeapSnapshotOptions::HeapSnapshotOptions()':1838../../deps/v8/include/v8-profiler.h:1128:27: warning: 'v8::HeapProfiler::HeapSnapshotOptions::global_object_name_resolver' is deprecated: Use context_name_resolver callback instead. [-Wdeprecated-declarations]1839 1128 | HeapSnapshotOptions() {}1840 | ^1841../../deps/v8/include/v8-profiler.h:1142:25: note: declared here1842 1142 | ObjectNameResolver* global_object_name_resolver = nullptr;1843 | ^~~~~~~~~~~~~~~~~~~~~~~~~~~1844../../deps/v8/include/v8-profiler.h:1128:27: warning: 'v8::HeapProfiler::HeapSnapshotOptions::global_object_name_resolver' is deprecated: Use context_name_resolver callback instead. [-Wdeprecated-declarations]1845 1128 | HeapSnapshotOptions() {}1846 | ^1847../../deps/v8/include/v8-profiler.h:1142:25: note: declared here1848 1142 | ObjectNameResolver* global_object_name_resolver = nullptr;1849 | ^~~~~~~~~~~~~~~~~~~~~~~~~~~1850[230/1871] CXX obj/src/node_base.node_sockaddr.o1851In file included from ../../src/memory_tracker.h:6,1852 from ../../src/base_object.h:29,1853 from ../../src/node_sockaddr.h:6,1854 from ../../src/node_sockaddr.cc:1:1855../../deps/v8/include/v8-profiler.h: In constructor 'v8::HeapProfiler::HeapSnapshotOptions::HeapSnapshotOptions()':1856../../deps/v8/include/v8-profiler.h:1128:27: warning: 'v8::HeapProfiler::HeapSnapshotOptions::global_object_name_resolver' is deprecated: Use context_name_resolver callback instead. [-Wdeprecated-declarations]1857 1128 | HeapSnapshotOptions() {}1858 | ^1859../../deps/v8/include/v8-profiler.h:1142:25: note: declared here1860 1142 | ObjectNameResolver* global_object_name_resolver = nullptr;1861 | ^~~~~~~~~~~~~~~~~~~~~~~~~~~1862../../deps/v8/include/v8-profiler.h:1128:27: warning: 'v8::HeapProfiler::HeapSnapshotOptions::global_object_name_resolver' is deprecated: Use context_name_resolver callback instead. [-Wdeprecated-declarations]1863 1128 | HeapSnapshotOptions() {}1864 | ^1865../../deps/v8/include/v8-profiler.h:1142:25: note: declared here1866 1142 | ObjectNameResolver* global_object_name_resolver = nullptr;1867 | ^~~~~~~~~~~~~~~~~~~~~~~~~~~1868[231/1871] CXX obj/src/node_base.node_file.o1869In file included from ../../src/memory_tracker.h:6,1870 from ../../src/aliased_buffer.h:7,1871 from ../../src/node_file.h:7,1872 from ../../src/node_file.cc:21:1873../../deps/v8/include/v8-profiler.h: In constructor 'v8::HeapProfiler::HeapSnapshotOptions::HeapSnapshotOptions()':1874../../deps/v8/include/v8-profiler.h:1128:27: warning: 'v8::HeapProfiler::HeapSnapshotOptions::global_object_name_resolver' is deprecated: Use context_name_resolver callback instead. [-Wdeprecated-declarations]1875 1128 | HeapSnapshotOptions() {}1876 | ^1877../../deps/v8/include/v8-profiler.h:1142:25: note: declared here1878 1142 | ObjectNameResolver* global_object_name_resolver = nullptr;1879 | ^~~~~~~~~~~~~~~~~~~~~~~~~~~1880../../deps/v8/include/v8-profiler.h:1128:27: warning: 'v8::HeapProfiler::HeapSnapshotOptions::global_object_name_resolver' is deprecated: Use context_name_resolver callback instead. [-Wdeprecated-declarations]1881 1128 | HeapSnapshotOptions() {}1882 | ^1883../../deps/v8/include/v8-profiler.h:1142:25: note: declared here1884 1142 | ObjectNameResolver* global_object_name_resolver = nullptr;1885 | ^~~~~~~~~~~~~~~~~~~~~~~~~~~1886[232/1871] CXX obj/src/node_base.node_report.o1887In file included from ../../src/util.h:29,1888 from ../../src/node_report.h:9,1889 from ../../src/node_report.cc:1:1890../../deps/v8/include/v8-profiler.h: In constructor 'v8::HeapProfiler::HeapSnapshotOptions::HeapSnapshotOptions()':1891../../deps/v8/include/v8-profiler.h:1128:27: warning: 'v8::HeapProfiler::HeapSnapshotOptions::global_object_name_resolver' is deprecated: Use context_name_resolver callback instead. [-Wdeprecated-declarations]1892 1128 | HeapSnapshotOptions() {}1893 | ^1894../../deps/v8/include/v8-profiler.h:1142:25: note: declared here1895 1142 | ObjectNameResolver* global_object_name_resolver = nullptr;1896 | ^~~~~~~~~~~~~~~~~~~~~~~~~~~1897../../deps/v8/include/v8-profiler.h:1128:27: warning: 'v8::HeapProfiler::HeapSnapshotOptions::global_object_name_resolver' is deprecated: Use context_name_resolver callback instead. [-Wdeprecated-declarations]1898 1128 | HeapSnapshotOptions() {}1899 | ^1900../../deps/v8/include/v8-profiler.h:1142:25: note: declared here1901 1142 | ObjectNameResolver* global_object_name_resolver = nullptr;1902 | ^~~~~~~~~~~~~~~~~~~~~~~~~~~1903[233/1871] CXX obj/src/node_base.node_types.o1904In file included from ../../src/memory_tracker.h:6,1905 from ../../src/aliased_buffer.h:7,1906 from ../../src/aliased_buffer-inl.h:6,1907 from ../../src/env-inl.h:27,1908 from ../../src/node_types.cc:1:1909../../deps/v8/include/v8-profiler.h: In constructor 'v8::HeapProfiler::HeapSnapshotOptions::HeapSnapshotOptions()':1910../../deps/v8/include/v8-profiler.h:1128:27: warning: 'v8::HeapProfiler::HeapSnapshotOptions::global_object_name_resolver' is deprecated: Use context_name_resolver callback instead. [-Wdeprecated-declarations]1911 1128 | HeapSnapshotOptions() {}1912 | ^1913../../deps/v8/include/v8-profiler.h:1142:25: note: declared here1914 1142 | ObjectNameResolver* global_object_name_resolver = nullptr;1915 | ^~~~~~~~~~~~~~~~~~~~~~~~~~~1916../../deps/v8/include/v8-profiler.h:1128:27: warning: 'v8::HeapProfiler::HeapSnapshotOptions::global_object_name_resolver' is deprecated: Use context_name_resolver callback instead. [-Wdeprecated-declarations]1917 1128 | HeapSnapshotOptions() {}1918 | ^1919../../deps/v8/include/v8-profiler.h:1142:25: note: declared here1920 1142 | ObjectNameResolver* global_object_name_resolver = nullptr;1921 | ^~~~~~~~~~~~~~~~~~~~~~~~~~~1922[234/1871] CXX obj/src/node_base.node_trace_events.o1923In file included from ../../src/memory_tracker.h:6,1924 from ../../src/base_object.h:29,1925 from ../../src/base_object-inl.h:27,1926 from ../../src/node_trace_events.cc:1:1927../../deps/v8/include/v8-profiler.h: In constructor 'v8::HeapProfiler::HeapSnapshotOptions::HeapSnapshotOptions()':1928../../deps/v8/include/v8-profiler.h:1128:27: warning: 'v8::HeapProfiler::HeapSnapshotOptions::global_object_name_resolver' is deprecated: Use context_name_resolver callback instead. [-Wdeprecated-declarations]1929 1128 | HeapSnapshotOptions() {}1930 | ^1931../../deps/v8/include/v8-profiler.h:1142:25: note: declared here1932 1142 | ObjectNameResolver* global_object_name_resolver = nullptr;1933 | ^~~~~~~~~~~~~~~~~~~~~~~~~~~1934../../deps/v8/include/v8-profiler.h:1128:27: warning: 'v8::HeapProfiler::HeapSnapshotOptions::global_object_name_resolver' is deprecated: Use context_name_resolver callback instead. [-Wdeprecated-declarations]1935 1128 | HeapSnapshotOptions() {}1936 | ^1937../../deps/v8/include/v8-profiler.h:1142:25: note: declared here1938 1142 | ObjectNameResolver* global_object_name_resolver = nullptr;1939 | ^~~~~~~~~~~~~~~~~~~~~~~~~~~1940[235/1871] CXX obj/src/node_base.node_task_queue.o1941In file included from ../../src/memory_tracker.h:6,1942 from ../../src/base_object.h:29,1943 from ../../src/async_wrap.h:27,1944 from ../../src/node_task_queue.cc:1:1945../../deps/v8/include/v8-profiler.h: In constructor 'v8::HeapProfiler::HeapSnapshotOptions::HeapSnapshotOptions()':1946../../deps/v8/include/v8-profiler.h:1128:27: warning: 'v8::HeapProfiler::HeapSnapshotOptions::global_object_name_resolver' is deprecated: Use context_name_resolver callback instead. [-Wdeprecated-declarations]1947 1128 | HeapSnapshotOptions() {}1948 | ^1949../../deps/v8/include/v8-profiler.h:1142:25: note: declared here1950 1142 | ObjectNameResolver* global_object_name_resolver = nullptr;1951 | ^~~~~~~~~~~~~~~~~~~~~~~~~~~1952../../deps/v8/include/v8-profiler.h:1128:27: warning: 'v8::HeapProfiler::HeapSnapshotOptions::global_object_name_resolver' is deprecated: Use context_name_resolver callback instead. [-Wdeprecated-declarations]1953 1128 | HeapSnapshotOptions() {}1954 | ^1955../../deps/v8/include/v8-profiler.h:1142:25: note: declared here1956 1142 | ObjectNameResolver* global_object_name_resolver = nullptr;1957 | ^~~~~~~~~~~~~~~~~~~~~~~~~~~1958[236/1871] CXX obj/src/node_base.node_options.o1959In file included from ../../src/util.h:29,1960 from ../../src/node_mutex.h:6,1961 from ../../src/node_options.h:11,1962 from ../../src/node_options.cc:1:1963../../deps/v8/include/v8-profiler.h: In constructor 'v8::HeapProfiler::HeapSnapshotOptions::HeapSnapshotOptions()':1964../../deps/v8/include/v8-profiler.h:1128:27: warning: 'v8::HeapProfiler::HeapSnapshotOptions::global_object_name_resolver' is deprecated: Use context_name_resolver callback instead. [-Wdeprecated-declarations]1965 1128 | HeapSnapshotOptions() {}1966 | ^1967../../deps/v8/include/v8-profiler.h:1142:25: note: declared here1968 1142 | ObjectNameResolver* global_object_name_resolver = nullptr;1969 | ^~~~~~~~~~~~~~~~~~~~~~~~~~~1970../../deps/v8/include/v8-profiler.h:1128:27: warning: 'v8::HeapProfiler::HeapSnapshotOptions::global_object_name_resolver' is deprecated: Use context_name_resolver callback instead. [-Wdeprecated-declarations]1971 1128 | HeapSnapshotOptions() {}1972 | ^1973../../deps/v8/include/v8-profiler.h:1142:25: note: declared here1974 1142 | ObjectNameResolver* global_object_name_resolver = nullptr;1975 | ^~~~~~~~~~~~~~~~~~~~~~~~~~~1976[237/1871] ACTION run_torque: run_torque_action_cea83c9e621e0e182fdfeec0429b2fb789657831bb31bd721b9a7d823e9ef3a81977[238/1871] STAMP obj/tools/v8_gypfiles/run_torque.actions_rules_copies.stamp1978[239/1871] STAMP obj/tools/v8_gypfiles/v8_internal_headers.compile_depends.stamp1979[240/1871] ACTION postmortem-metadata: gen-postmortem-metadata_63ceec4fe112e619d2413cab4d13e9ecf973439b0b10d648a5f58422165276881980[241/1871] STAMP obj/tools/v8_gypfiles/v8_internal_headers.actions_depends.stamp1981[242/1871] STAMP obj/tools/v8_gypfiles/torque_generated_definitions.compile_depends.stamp1982[243/1871] STAMP obj/tools/v8_gypfiles/torque_generated_definitions.actions_depends.stamp1983[244/1871] STAMP obj/tools/v8_gypfiles/v8_base_without_compiler.compile_depends.stamp1984[245/1871] STAMP obj/tools/v8_gypfiles/v8_base_without_compiler.actions_depends.stamp1985[246/1871] CXX obj/src/node_base.node_sea.o1986In file included from ../../src/memory_tracker.h:6,1987 from ../../src/base_object.h:29,1988 from ../../src/async_wrap.h:27,1989 from ../../src/debug_utils.h:6,1990 from ../../src/debug_utils-inl.h:6,1991 from ../../src/blob_serializer_deserializer-inl.h:14,1992 from ../../src/node_sea.cc:3:1993../../deps/v8/include/v8-profiler.h: In constructor 'v8::HeapProfiler::HeapSnapshotOptions::HeapSnapshotOptions()':1994../../deps/v8/include/v8-profiler.h:1128:27: warning: 'v8::HeapProfiler::HeapSnapshotOptions::global_object_name_resolver' is deprecated: Use context_name_resolver callback instead. [-Wdeprecated-declarations]1995 1128 | HeapSnapshotOptions() {}1996 | ^1997../../deps/v8/include/v8-profiler.h:1142:25: note: declared here1998 1142 | ObjectNameResolver* global_object_name_resolver = nullptr;1999 | ^~~~~~~~~~~~~~~~~~~~~~~~~~~2000../../deps/v8/include/v8-profiler.h:1128:27: warning: 'v8::HeapProfiler::HeapSnapshotOptions::global_object_name_resolver' is deprecated: Use context_name_resolver callback instead. [-Wdeprecated-declarations]26278ok 5022 sea/test-build-sea-missing-main # skip Running the resultant binary fails with `/home/iojs/node-tmp/.tmp.2379/sea: error while loading shared libraries: libicui18n.so.71: cannot open shared object file: No such file or directory`.26279 ---26280 duration_ms: 69.4870026281 ...26282ok 5023 sea/test-build-sea-missing-output # skip Running the resultant binary fails with `/home/iojs/node-tmp/.tmp.2379/sea: error while loading shared libraries: libicui18n.so.71: cannot open shared object file: No such file or directory`.26283 ---26284 duration_ms: 69.2610026285 ...26286ok 5024 test-runner/test-output-timeout-in-before-each26287 ---26288 duration_ms: 1508.3790026289 ...26290ok 5025 sea/test-single-executable-application # skip Running the resultant binary fails with `/home/iojs/node-tmp/.tmp.2379/sea: error while loading shared libraries: libicui18n.so.71: cannot open shared object file: No such file or directory`.26291 ---26292 duration_ms: 69.2240026293 ...26294ok 5026 sea/test-build-sea-vfs-incompatible-options # skip Running the resultant binary fails with `/home/iojs/node-tmp/.tmp.2379/sea: error while loading shared libraries: libicui18n.so.71: cannot open shared object file: No such file or directory`.26295 ---26296 duration_ms: 69.6960026297 ...26298ok 5027 sea/test-single-executable-application-asset-keys # skip Running the resultant binary fails with `/home/iojs/node-tmp/.tmp.2379/sea: error while loading shared libraries: libicui18n.so.71: cannot open shared object file: No such file or directory`.26299 ---26300 duration_ms: 69.5100026301 ...26302ok 5028 sea/test-single-executable-application-asset-keys-empty # skip Running the resultant binary fails with `/home/iojs/node-tmp/.tmp.2379/sea: error while loading shared libraries: libicui18n.so.71: cannot open shared object file: No such file or directory`.26303 ---26304 duration_ms: 69.4390026305 ...26306ok 5029 sea/test-single-executable-application-assets # skip Running the resultant binary fails with `/home/iojs/node-tmp/.tmp.2379/sea: error while loading shared libraries: libicui18n.so.71: cannot open shared object file: No such file or directory`.26307 ---26308 duration_ms: 69.3960026309 ...26310ok 5030 sea/test-single-executable-application-assets-raw # skip Running the resultant binary fails with `/home/iojs/node-tmp/.tmp.2379/sea: error while loading shared libraries: libicui18n.so.71: cannot open shared object file: No such file or directory`.26311 ---26312 duration_ms: 69.4820026313 ...26314ok 5031 sea/test-single-executable-application-disable-experimental-sea-warning # skip Running the resultant binary fails with `/home/iojs/node-tmp/.tmp.2379/sea: error while loading shared libraries: libicui18n.so.71: cannot open shared object file: No such file or directory`.26315 ---26316 duration_ms: 86.2690026317 ...26318ok 5032 sea/test-single-executable-application-assets-nonexistent-file26319 ---26320 duration_ms: 107.8510026321 ...26322ok 5033 sea/test-single-executable-application-assets-invalid-type26323 ---26324 duration_ms: 108.1230026325 ...26326ok 5034 sea/test-single-executable-application-empty # skip Running the resultant binary fails with `/home/iojs/node-tmp/.tmp.2379/sea: error while loading shared libraries: libicui18n.so.71: cannot open shared object file: No such file or directory`.26327 ---26328 duration_ms: 69.2540026329 ...26330ok 5035 test-runner/test-watch-create-isolation-process26331 ---26332 duration_ms: 1306.9890026333 ...26334ok 5036 sea/test-single-executable-application-esm # skip Running the resultant binary fails with `/home/iojs/node-tmp/.tmp.2379/sea: error while loading shared libraries: libicui18n.so.71: cannot open shared object file: No such file or directory`.26335 ---26336 duration_ms: 69.3730026337 ...26338ok 5037 test-runner/test-run-watch-create26339 ---26340 duration_ms: 1607.1230026341 ...26342ok 5038 sea/test-single-executable-application-esm-code-cache # skip Running the resultant binary fails with `/home/iojs/node-tmp/.tmp.2379/sea: error while loading shared libraries: libicui18n.so.71: cannot open shared object file: No such file or directory`.26343 ---26344 duration_ms: 69.5710026345 ...26346ok 5039 sea/test-single-executable-application-exec-argv # skip Running the resultant binary fails with `/home/iojs/node-tmp/.tmp.2379/sea: error while loading shared libraries: libicui18n.so.71: cannot open shared object file: No such file or directory`.26347 ---26348 duration_ms: 69.7310026349 ...26350ok 5040 sea/test-single-executable-application-exec-argv-empty # skip Running the resultant binary fails with `/home/iojs/node-tmp/.tmp.2379/sea: error while loading shared libraries: libicui18n.so.71: cannot open shared object file: No such file or directory`.26351 ---26352 duration_ms: 70.0940026353 ...26354ok 5041 sea/test-single-executable-application-exec-argv-extension-cli # skip Running the resultant binary fails with `/home/iojs/node-tmp/.tmp.2379/sea: error while loading shared libraries: libicui18n.so.71: cannot open shared object file: No such file or directory`.26355 ---26356 duration_ms: 69.2990026357 ...26358ok 5042 test-runner/test-output-test-runner-plan-timeout26359 ---26360 duration_ms: 1807.2380026361 ...26362ok 5043 test-runner/test-run-watch-dependency-repeatedly26363 ---26364 duration_ms: 1607.9120026365 ...26366ok 5044 sea/test-single-executable-application-exec-argv-extension-none # skip Running the resultant binary fails with `/home/iojs/node-tmp/.tmp.2379/sea: error while loading shared libraries: libicui18n.so.71: cannot open shared object file: No such file or directory`.26367 ---26368 duration_ms: 69.4500026369 ...26370ok 5045 sea/test-single-executable-application-exec-argv-extension-env # skip Running the resultant binary fails with `/home/iojs/node-tmp/.tmp.2379/sea: error while loading shared libraries: libicui18n.so.71: cannot open shared object file: No such file or directory`.26371 ---26372 duration_ms: 86.5610026373 ...26374ok 5046 sea/test-single-executable-application-inspect # skip Running the resultant binary fails with `/home/iojs/node-tmp/.tmp.2379/sea: error while loading shared libraries: libicui18n.so.71: cannot open shared object file: No such file or directory`.26375 ---26376 duration_ms: 86.4860026377 ...26378ok 5047 sea/test-single-executable-application-inspect-in-sea-flags # skip Running the resultant binary fails with `/home/iojs/node-tmp/.tmp.2379/sea: error while loading shared libraries: libicui18n.so.71: cannot open shared object file: No such file or directory`.26379 ---26380 duration_ms: 86.6670026381 ...26382ok 5048 sea/test-single-executable-application-snapshot-worker # skip Running the resultant binary fails with `/home/iojs/node-tmp/.tmp.2379/sea: error while loading shared libraries: libicui18n.so.71: cannot open shared object file: No such file or directory`.26383 ---26384 duration_ms: 69.5760026385 ...26386ok 5049 test-runner/test-run-watch-different-cwd-rename26387 ---26388 duration_ms: 1607.8490026389 ...26390ok 5050 test-runner/test-run-watch-different-cwd-dependency26391 ---26392 duration_ms: 1609.4550026393 ...26394ok 5051 test-runner/test-run-watch-different-runner-cwd26395 ---26396 duration_ms: 1606.9570026397 ...26398ok 5052 sea/test-single-executable-application-snapshot # skip Running the resultant binary fails with `/home/iojs/node-tmp/.tmp.2379/sea: error while loading shared libraries: libicui18n.so.71: cannot open shared object file: No such file or directory`.26399 ---26400 duration_ms: 87.2780026401 ...26402ok 5053 sea/test-single-executable-application-snapshot-and-code-cache # skip Running the resultant binary fails with `/home/iojs/node-tmp/.tmp.2379/sea: error while loading shared libraries: libicui18n.so.71: cannot open shared object file: No such file or directory`.26403 ---26404 duration_ms: 87.1650026405 ...26406ok 5054 sea/test-single-executable-application-use-code-cache # skip Running the resultant binary fails with `/home/iojs/node-tmp/.tmp.2379/sea: error while loading shared libraries: libicui18n.so.71: cannot open shared object file: No such file or directory`.26407 ---26408 duration_ms: 69.4680026409 ...26410ok 5055 sea/test-single-executable-application-vfs-esm # skip Running the resultant binary fails with `/home/iojs/node-tmp/.tmp.2379/sea: error while loading shared libraries: libicui18n.so.71: cannot open shared object file: No such file or directory`.26411 ---26412 duration_ms: 69.4780026413 ...26414ok 5056 sea/test-single-executable-application-vfs # skip Running the resultant binary fails with `/home/iojs/node-tmp/.tmp.2379/sea: error while loading shared libraries: libicui18n.so.71: cannot open shared object file: No such file or directory`.26415 ---26416 duration_ms: 86.5930026417 ...26418ok 5057 test-runner/test-watch-dependency-isolation-none26419 ---26420 duration_ms: 1306.8280026421 ...26422ok 5058 test-runner/test-watch-dependency-isolation-process26423 ---26424 duration_ms: 1306.6880026425 ...26426ok 5059 test-runner/test-watch-esm-dependency-isolation-none26427 ---26428 duration_ms: 1307.1660026429 ...26430ok 5060 wasi/test-return-on-exit26431 ---26432 duration_ms: 86.7350026433 ...26434ok 5061 test-runner/test-run-watch-different-runner-cwd-isolation-process26435 ---26436 duration_ms: 1607.0810026437 ...26438ok 5062 test-runner/test-run-watch-esm-dependency26439 ---26440 duration_ms: 1606.8900026441 ...26442ok 5063 test-runner/test-run-watch-rename26443 ---26444 duration_ms: 1607.2210026445 ...26446ok 5064 test-runner/test-run-watch-repeatedly26447 ---26448 duration_ms: 1607.2390026449 ...26450ok 5065 wasi/test-wasi-initialize-validation26451 ---26452 duration_ms: 86.5280026453 ...26454ok 5066 test-runner/test-run-watch-run-duration26455 ---26456 duration_ms: 1607.0680026457 ...26458ok 5067 test-runner/test-run-watch-without-file26459 ---26460 duration_ms: 1608.8920026461 ...26462ok 5068 test-runner/test-watch-esm-dependency-isolation-process26463 ---26464 duration_ms: 1306.4950026465 ...26466ok 5069 wasi/test-wasi-options-validation26467 ---26468 duration_ms: 86.6940026469 ...26470ok 5070 test-runner/test-watch-no-file-isolation-none26471 ---26472 duration_ms: 1306.6900026473 ...26474ok 5071 sea/test-single-executable-blob-config26475 ---26476 duration_ms: 261.9570026477 ...26478ok 5072 wasi/test-wasi-start-validation26479 ---26480 duration_ms: 107.8190026481 ...26482ok 5073 wasi/test-wasi-stdio26483 ---26484 duration_ms: 89.2700026485 ...26486ok 5074 test-runner/test-watch-no-file-isolation-process26487 ---26488 duration_ms: 1306.4260026489 ...26490ok 5075 wasi/test-wasi-not-started26491 ---26492 duration_ms: 209.0200026493 ...26494ok 5076 test-runner/test-watch-rename-isolation-none26495 ---26496 duration_ms: 1306.9020026497 ...26498ok 5077 test-runner/test-watch-rename-isolation-process26499 ---26500 duration_ms: 1307.0310026501 ...26502ok 5078 wasi/test-wasi-cant_dotdot26503 ---26504 duration_ms: 325.0930026505 ...26506ok 5079 wasi/test-wasi-clock_getres26507 ---26508 duration_ms: 325.6750026509 ...26510ok 5080 report/test-report-config26511 ---26512 duration_ms: 69.8910026513 ...26514ok 5081 wasi/test-wasi-fd_prestat_get_refresh26515 ---26516 duration_ms: 325.9120026517 ...26518ok 5082 wasi/test-wasi-ftruncate26519 ---26520 duration_ms: 325.6040026521 ...26522ok 5083 wasi/test-wasi-getentropy26523 ---26524 duration_ms: 325.6030026525 ...26526ok 5084 test-runner/test-watch-run-repeatedly-isolation-none26527 ---26528 duration_ms: 1306.4070026529 ...26530ok 5085 wasi/test-wasi-getrusage26531 ---26532 duration_ms: 325.4810026533 ...26534ok 5086 test-runner/test-watch-run-repeatedly-isolation-process26535 ---26536 duration_ms: 1306.9070026537 ...26538ok 5087 wasi/test-wasi-gettimeofday26539 ---26540 duration_ms: 325.3380026541 ...26542ok 5088 wasi/test-wasi-main_args26543 ---26544 duration_ms: 325.5600026545 ...26546ok 5089 wasi/test-wasi-notdir26547 ---26548 duration_ms: 325.7080026549 ...26550ok 5090 report/test-report-getreport26551 ---26552 duration_ms: 107.7800026553 ...26554ok 5091 wasi/test-wasi-worker-terminate26555 ---26556 duration_ms: 209.4480026557 ...26558ok 5092 report/test-report-signal26559 ---26560 duration_ms: 107.8370026561 ...26562ok 5093 wasi/test-wasi-preopen_populates26563 ---26564 duration_ms: 326.0060026565 ...26566ok 5094 report/test-report-uncaught-exception-handled26567 ---26568 duration_ms: 107.7620026569 ...26570ok 5095 wasi/test-wasi-readdir26571 ---26572 duration_ms: 326.6360026573 ...26574ok 5096 report/test-report-uncaught-exception-override26575 ---26576 duration_ms: 108.2410026577 ...26578ok 5097 wasi/test-wasi-sock26579 ---26580 duration_ms: 328.7260026581 ...26582ok 5098 wasi/test-wasi-stat26583 ---26584 duration_ms: 325.8250026585 ...26586ok 5099 sea/test-single-executable-blob-config-errors26587 ---26588 duration_ms: 505.9610026589 ...26590ok 5100 report/test-report-exclude-network26591 ---26592 duration_ms: 260.5900026593 ...26594ok 5101 report/test-report-uncaught-exception-compat26595 ---26596 duration_ms: 208.8870026597 ...26598ok 5102 report/test-report-uncaught-exception26599 ---26600 duration_ms: 212.1690026601 ...26602ok 5103 report/test-report-uncaught-exception-symbols26603 ---26604 duration_ms: 211.7490026605 ...26606ok 5104 wasi/test-wasi-write_file26607 ---26608 duration_ms: 326.4060026609 ...26610ok 5105 report/test-report-worker26611 ---26612 duration_ms: 170.5110026613 ...26614ok 5106 report/test-report-writereport-exclude-env26615 ---26616 duration_ms: 137.9920026617 ...26618ok 5107 client-proxy/test-http-proxy-perf-hooks26619 ---26620 duration_ms: 142.1080026621 ...26622ok 5108 client-proxy/test-http-proxy-request-invalid-char-in-options26623 ---26624 duration_ms: 110.7200026625 ...26626ok 5109 client-proxy/test-http-proxy-request-authority-construction26627 ---26628 duration_ms: 140.2210026629 ...26630ok 5110 report/test-report-fatalerror-oomerror-compact26631 ---26632 duration_ms: 327.7570026633 ...26634ok 5111 report/test-report-uncaught-exception-primitives26635 ---26636 duration_ms: 264.2610026637 ...26638ok 5112 report/test-report-fatalerror-oomerror-directory26639 ---26640 duration_ms: 325.5040026641 ...26642ok 5113 client-proxy/test-http-proxy-request-absolute-path-authority-match26643 ---26644 duration_ms: 172.9820026645 ...26646ok 5114 report/test-report-fatalerror-oomerror-not-set26647 ---26648 duration_ms: 325.4760026649 ...26650ok 5115 test-runner/test-run-watch-delete26651 ---26652 duration_ms: 2308.0520026653 ...26654ok 5116 client-proxy/test-http-proxy-request-invalid-credentials26655 ---26656 duration_ms: 109.5010026657 ...26658ok 5117 report/test-report-uv-handles26659 ---26660 duration_ms: 263.1500026661 ...26662ok 5118 client-proxy/test-http-proxy-request-invalid-proxy26663 ---26664 duration_ms: 108.4910026665 ...26666ok 5119 report/test-report-fatalerror-oomerror-set26667 ---26668 duration_ms: 327.5860026669 ...26670ok 5120 client-proxy/test-http-proxy-request-connection-refused26671 ---26672 duration_ms: 218.6670026673 ...26674ok 5121 report/test-report-fatalerror-oomerror-filename26675 ---26676 duration_ms: 406.5170026677 ...26678ok 5122 client-proxy/test-http-proxy-request-max-sockets26679 ---26680 duration_ms: 134.7610026681 ...26682ok 5123 wasi/test-wasi-exitcode26683 ---26684 duration_ms: 707.3340026685 ...26686ok 5124 client-proxy/test-http-proxy-request-invalid-char-in-url26687 ---26688 duration_ms: 209.1130026689 ...26690ok 5125 client-proxy/test-http-proxy-request-https-proxy26691 ---26692 duration_ms: 265.0810026693 ...26694ok 5126 client-proxy/test-http-proxy-request-origin-form-path26695 ---26696 duration_ms: 135.9340026697 ...26698ok 5127 client-proxy/test-http-proxy-request-ipv626699 ---26700 duration_ms: 209.5110026701 ...26702ok 5128 client-proxy/test-http-proxy-request-validation-errors26703 ---26704 duration_ms: 136.4920026705 ...26706ok 5129 client-proxy/test-http-proxy-request-socket-keep-alive26707 ---26708 duration_ms: 167.8120026709 ...26710ok 5130 wasi/test-wasi-symlinks26711 ---26712 duration_ms: 607.4580026713 ...26714ok 5131 client-proxy/test-http-proxy-request-invalid-url26715 ---26716 duration_ms: 260.9220026717 ...26718ok 5132 client-proxy/test-http-proxy-request-no-proxy-asterisk26719 ---26720 duration_ms: 260.6720026721 ...26722ok 5133 report/test-report-writereport26723 ---26724 duration_ms: 412.2300026725 ...26726ok 5134 client-proxy/test-http-request-proxy-post26727 ---26728 duration_ms: 212.7320026729 ...26730ok 5135 client-proxy/test-http-proxy-request-proxy-failure-50026731 ---26732 duration_ms: 260.7170026733 ...26734ok 5136 client-proxy/test-http-proxy-request-proxy-failure-hang-up26735 ---26736 duration_ms: 261.3580026737 ...26738ok 5137 client-proxy/test-http-proxy-request-no-proxy26739 ---26740 duration_ms: 325.6140026741 ...26742ok 5138 test-runner/test-watch-delete-isolation-none26743 ---26744 duration_ms: 2307.6710026745 ...26746ok 5139 client-proxy/test-http-set-global-proxy-from-env-http-request-empty26747 ---26748 duration_ms: 167.7320026749 ...26750ok 5140 client-proxy/test-http-set-global-proxy-from-env-fetch26751 ---26752 duration_ms: 261.3200026753 ...26754ok 5141 client-proxy/test-http-request-proxy-post-server-failure26755 ---26756 duration_ms: 263.3780026757 ...26758ok 5142 client-proxy/test-http-set-global-proxy-from-env-fetch-default26759 ---26760 duration_ms: 261.9780026761 ...26762ok 5143 client-proxy/test-http-set-global-proxy-from-env-fetch-no-proxy26763 ---26764 duration_ms: 210.8950026765 ...26766ok 5144 client-proxy/test-http-proxy-request-no-proxy-ip26767 ---26768 duration_ms: 327.1060026769 ...26770ok 5145 client-proxy/test-http-set-global-proxy-from-env-invalid-type26771 ---26772 duration_ms: 108.3110026773 ...26774ok 5146 client-proxy/test-http-set-global-proxy-from-env-invalid-url26775 ---26776 duration_ms: 108.2980026777 ...26778ok 5147 client-proxy/test-http-set-global-proxy-from-env-fetch-empty26779 ---26780 duration_ms: 260.7710026781 ...26782ok 5148 client-proxy/test-http-set-global-proxy-from-env-http-request26783 ---26784 duration_ms: 209.5590026785 ...26786ok 5149 client-proxy/test-http-proxy-fetch26787 ---26788 duration_ms: 507.3240026789 ...26790ok 5150 client-proxy/test-http-proxy-request26791 ---26792 duration_ms: 516.4250026793 ...26794ok 5151 wasi/test-wasi-io26795 ---26796 duration_ms: 906.6180026797 ...26798ok 5152 client-proxy/test-http-set-global-proxy-from-env-fetch-https26799 ---26800 duration_ms: 263.6760026801 ...26802ok 5153 client-proxy/test-http-set-global-proxy-from-env-fetch-restore26803 ---26804 duration_ms: 261.0530026805 ...26806ok 5154 client-proxy/test-http-set-global-proxy-from-env-http-request-restore26807 ---26808 duration_ms: 209.3100026809 ...26810ok 5155 test-runner/test-watch-delete-isolation-process26811 ---26812 duration_ms: 2309.6230026813 ...26814ok 5156 client-proxy/test-http-set-global-proxy-from-env-http-request-default26815 ---26816 duration_ms: 262.2100026817 ...26818ok 5157 client-proxy/test-http-proxy-request-no-proxy-port-specific26819 ---26820 duration_ms: 410.4750026821 ...26822ok 5158 client-proxy/test-https-proxy-request-invalid-credentials26823 ---26824 duration_ms: 108.3160026825 ...26826ok 5159 client-proxy/test-https-proxy-request-invalid-char-in-options26827 ---26828 duration_ms: 110.8390026829 ...26830ok 5160 client-proxy/test-http-set-global-proxy-from-env-no-proxy26831 ---26832 duration_ms: 209.0930026833 ...26834ok 5161 client-proxy/test-http-set-global-proxy-from-env-https-request26835 ---26836 duration_ms: 263.7700026837 ...26838ok 5162 client-proxy/test-http-set-global-proxy-from-env-override-fetch26839 ---26840 duration_ms: 209.1690026841 ...26842ok 5163 client-proxy/test-https-proxy-request-invalid-char-in-url26843 ---26844 duration_ms: 169.6290026845 ...26846ok 5164 client-proxy/test-http-set-global-proxy-from-env-override-http26847 ---26848 duration_ms: 261.5640026849 ...26850ok 5165 client-proxy/test-https-proxy-request-max-sockets26851 ---26852 duration_ms: 168.0580026853 ...26854ok 5166 client-proxy/test-https-proxy-request-invalid-url26855 ---26856 duration_ms: 209.3980026857 ...26858ok 5167 client-proxy/test-https-proxy-request-socket-keep-alive26859 ---26860 duration_ms: 136.3450026861 ...26862ok 5168 client-proxy/test-https-proxy-request-auth-failure26863 ---26864 duration_ms: 261.2290026865 ...26866ok 5169 client-proxy/test-https-proxy-request-connection-refused26867 ---26868 duration_ms: 260.8240026869 ...26870ok 5170 client-proxy/test-https-proxy-request-https-proxy26871 ---26872 duration_ms: 261.2500026873 ...26874ok 5171 client-proxy/test-https-proxy-request-empty-response26875 ---26876 duration_ms: 265.2770026877 ...26878ok 5172 client-proxy/test-https-proxy-request-handshake-failure26879 ---26880 duration_ms: 265.4770026881 ...26882ok 5173 async-hooks/test-async-await26883 ---26884 duration_ms: 108.6410026885 ...26886ok 5174 client-proxy/test-https-proxy-request-malformed-response26887 ---26888 duration_ms: 263.2460026889 ...26890ok 5175 async-hooks/test-async-exec-resource-http26891 ---26892 duration_ms: 108.4140026893 ...26894ok 5176 client-proxy/test-https-proxy-request-no-proxy26895 ---26896 duration_ms: 261.8390026897 ...26898ok 5177 client-proxy/test-https-proxy-request-proxy-failure-40426899 ---26900 duration_ms: 263.4500026901 ...26902ok 5178 async-hooks/test-async-exec-resource-match26903 ---26904 duration_ms: 86.9700026905 ...26906ok 5179 client-proxy/test-https-proxy-request-proxy-failure-50226907 ---26908 duration_ms: 263.2010026909 ...26910ok 5180 client-proxy/test-https-proxy-request-proxy-failure-50026911 ---26912 duration_ms: 264.8340026913 ...26914ok 5181 async-hooks/test-async-exec-resource-http-agent26915 ---26916 duration_ms: 110.0470026917 ...26918ok 5182 client-proxy/test-https-proxy-request-proxy-failure-hang-up26919 ---26920 duration_ms: 262.9650026921 ...26922ok 5183 client-proxy/test-https-proxy-request-server-failure-hang-up26923 ---26924 duration_ms: 263.8140026925 ...26926ok 5184 async-hooks/test-async-local-storage-async-await26927 ---26928 duration_ms: 87.4420026929 ...26930ok 5185 async-hooks/test-async-local-storage-args26931 ---26932 duration_ms: 108.4190026933 ...26934ok 5186 async-hooks/test-async-local-storage-async-functions26935 ---26936 duration_ms: 87.5970026937 ...26938ok 5187 async-hooks/test-async-local-storage-enable-disable26939 ---26940 duration_ms: 86.8390026941 ...26942ok 5188 async-hooks/test-async-local-storage-dgram26943 ---26944 duration_ms: 108.3380026945 ...26946ok 5189 async-hooks/test-async-local-storage-errors26947 ---26948 duration_ms: 86.6740026949 ...26950ok 5190 client-proxy/test-https-request-proxy-post26951 ---26952 duration_ms: 268.0840026953 ...26954ok 5191 client-proxy/test-http-proxy-request-no-proxy-domain26955 ---26956 duration_ms: 707.2320026957 ...26958ok 5192 async-hooks/test-async-local-storage-enter-with26959 ---26960 duration_ms: 107.5160026961 ...26962ok 5193 async-hooks/test-async-local-storage-http-agent26963 ---26964 duration_ms: 86.7190026965 ...26966ok 5194 async-hooks/test-async-local-storage-misc-stores26967 ---26968 duration_ms: 87.0030026969 ...26970ok 5195 async-hooks/test-async-local-storage-nested26971 ---26972 duration_ms: 86.7000026973 ...26974ok 5196 client-proxy/test-https-proxy-request-header-overflow26975 ---26976 duration_ms: 407.7560026977 ...26978ok 5197 async-hooks/test-async-local-storage-gcable26979 ---26980 duration_ms: 107.6410026981 ...26982ok 5198 async-hooks/test-async-local-storage-promises26983 ---26984 duration_ms: 86.9490026985 ...26986ok 5199 async-hooks/test-async-local-storage-http26987 ---26988 duration_ms: 107.7480026989 ...26990ok 5200 async-hooks/test-async-local-storage-socket26991 ---26992 duration_ms: 86.9930026993 ...26994ok 5201 async-hooks/test-async-local-storage-stream-finished26995 ---26996 duration_ms: 87.2820026997 ...26998ok 5202 async-hooks/test-async-local-storage-thenable26999 ---27000 duration_ms: 88.3940027001 ...27002ok 5203 client-proxy/test-https-proxy-request-ipv627003 ---27004 duration_ms: 406.4200027005 ...27006ok 5204 async-hooks/test-async-wrap-providers27007 ---27008 duration_ms: 86.9860027009 ...27010ok 5205 async-hooks/test-async-local-storage-tlssocket27011 ---27012 duration_ms: 108.0680027013 ...27014ok 5206 async-hooks/test-crypto-pbkdf227015 ---27016 duration_ms: 86.7630027017 ...27018ok 5207 async-hooks/test-crypto-randomBytes27019 ---27020 duration_ms: 86.7430027021 ...27022ok 5208 client-proxy/test-https-proxy-request27023 ---27024 duration_ms: 511.0560027025 ...27026ok 5209 async-hooks/test-embedder.api.async-resource27027 ---27028 duration_ms: 86.6800027029 ...27030ok 5210 async-hooks/test-embedder.api.async-resource.runInAsyncScope27031 ---27032 duration_ms: 86.3510027033 ...27034ok 5211 async-hooks/test-disable-in-init27035 ---27036 duration_ms: 107.4980027037 ...27038ok 5212 async-hooks/test-enable-disable27039 ---27040 duration_ms: 87.2200027041 ...27042ok 5213 async-hooks/test-enable-in-init27043 ---27044 duration_ms: 86.5360027045 ...27046ok 5214 async-hooks/test-fsreqcallback-readFile27047 ---27048 duration_ms: 69.6770027049 ...27050ok 5215 async-hooks/test-fseventwrap27051 ---27052 duration_ms: 86.6180027053 ...27054ok 5216 async-hooks/test-fsreqcallback-access27055 ---27056 duration_ms: 86.2430027057 ...27058ok 5217 async-hooks/test-emit-before-after27059 ---27060 duration_ms: 107.6170027061 ...27062ok 5218 async-hooks/test-destroy-not-blocked27063 ---27064 duration_ms: 134.5570027065 ...27066ok 5219 async-hooks/test-emit-init27067 ---27068 duration_ms: 108.4140027069 ...27070ok 5220 client-proxy/test-use-env-proxy-cli-http27071 ---27072 duration_ms: 410.1500027073 ...27074ok 5221 async-hooks/test-getaddrinforeqwrap27075 ---27076 duration_ms: 87.0350027077 ...27078ok 5222 client-proxy/test-use-env-proxy-cli-https27079 ---27080 duration_ms: 409.4880027081 ...27082ok 5223 async-hooks/test-getnameinforeqwrap27083 ---27084 duration_ms: 86.7810027085 ...27086ok 5224 async-hooks/test-graph.fsreq-readFile27087 ---27088 duration_ms: 86.6950027089 ...27090ok 5225 async-hooks/test-filehandle-no-reuse27091 ---27092 duration_ms: 134.5570027093 ...27094ok 5226 client-proxy/test-https-proxy-fetch27095 ---27096 duration_ms: 606.8680027097 ...27098ok 5227 async-hooks/test-graph.intervals27099 ---27100 duration_ms: 86.5830027101 ...27102ok 5228 async-hooks/test-embedder.api.async-resource-no-type27103 ---27104 duration_ms: 167.1880027105 ...27106ok 5229 async-hooks/test-emit-after-on-destroyed27107 ---27108 duration_ms: 167.4800027109 ...27110ok 5230 async-hooks/test-graph.pipeconnect27111 ---27112 duration_ms: 86.5920027113 ...27114ok 5231 async-hooks/test-graph.statwatcher27115 ---27116 duration_ms: 86.7450027117 ...27118ok 5232 async-hooks/test-graph.timeouts27119 ---27120 duration_ms: 86.5010027121 ...27122ok 5233 async-hooks/test-graph.http27123 ---27124 duration_ms: 134.5340027125 ...27126ok 5234 async-hooks/test-graph.shutdown27127 ---27128 duration_ms: 108.1440027129 ...27130ok 5235 async-hooks/test-graph.signal27131 ---27132 duration_ms: 108.9970027133 ...27134ok 5236 async-hooks/test-graph.tcp27135 ---27136 duration_ms: 107.9440027137 ...27138ok 5237 async-hooks/test-emit-before-on-destroyed27139 ---27140 duration_ms: 208.9080027141 ...27142ok 5238 async-hooks/test-graph.tls-write27143 ---27144 duration_ms: 107.7890027145 ...27146ok 5239 async-hooks/test-graph.tls-write-1227147 ---27148 duration_ms: 107.8100027149 ...27150ok 5240 async-hooks/test-httpparser.response27151 ---27152 duration_ms: 86.5740027153 ...27154ok 5241 async-hooks/test-immediate27155 ---27156 duration_ms: 86.7440027157 ...27158ok 5242 client-proxy/test-use-env-proxy-precedence27159 ---27160 duration_ms: 507.0190027161 ...27162ok 5243 async-hooks/test-late-hook-enable27163 ---27164 duration_ms: 86.8400027165 ...27166ok 5244 async-hooks/test-httpparser.request27167 ---27168 duration_ms: 108.4720027169 ...27170ok 5245 async-hooks/test-http-agent-handle-reuse-parallel27171 ---27172 duration_ms: 134.2890027173 ...27174ok 5246 async-hooks/test-http-agent-handle-reuse-serial27175 ---27176 duration_ms: 134.1220027177 ...27178ok 5247 async-hooks/test-no-assert-when-disabled27179 ---27180 duration_ms: 86.8460027181 ...27182ok 5248 async-hooks/test-net-get-connections27183 ---27184 duration_ms: 108.1180027185 ...27186ok 5249 async-hooks/test-nexttick-default-trigger27187 ---27188 duration_ms: 107.6410027189 ...27190ok 5250 async-hooks/test-promise27191 ---27192 duration_ms: 86.7270027193 ...27194ok 5251 async-hooks/test-promise.chain-promise-before-init-hooks27195 ---27196 duration_ms: 87.1300027197 ...27198ok 5252 async-hooks/test-promise.promise-before-init-hooks27199 ---27200 duration_ms: 86.6070027201 ...27202ok 5253 async-hooks/test-pipeconnectwrap27203 ---27204 duration_ms: 109.3680027205 ...27206ok 5254 async-hooks/test-queue-microtask27207 ---27208 duration_ms: 86.5510027209 ...27210ok 5255 async-hooks/test-improper-order27211 ---27212 duration_ms: 167.6910027213 ...27214ok 5256 async-hooks/test-improper-unwind27215 ---27216 duration_ms: 168.0210027217 ...27218ok 5257 async-hooks/test-shutdownwrap27219 ---27220 duration_ms: 108.2460027221 ...27222ok 5258 async-hooks/test-signalwrap27223 ---27224 duration_ms: 107.8520027225 ...27226ok 5259 async-hooks/test-tcpwrap27227 ---27228 duration_ms: 108.3860027229 ...27230ok 5260 async-hooks/test-track-promises-false27231 ---27232 duration_ms: 86.4880027233 ...27234ok 5261 async-hooks/test-graph.pipe27235 ---27236 duration_ms: 260.7990027237 ...27238ok 5262 async-hooks/test-track-promises-false-check27239 ---27240 duration_ms: 86.7020027241 ...27242ok 5263 async-hooks/test-track-promises-true27243 ---27244 duration_ms: 86.4610027245 ...27246ok 5264 async-hooks/test-track-promises-default27247 ---27248 duration_ms: 108.0640027249 ...27250ok 5265 async-hooks/test-pipewrap27251 ---27252 duration_ms: 167.7010027253 ...27254ok 5266 async-hooks/test-track-promises-validation27255 ---27256 duration_ms: 87.0400027257 ...27258ok 5267 async-hooks/test-ttywrap.readstream # skip no valid readable TTY available27259 ---27260 duration_ms: 87.6350027261 ...27262ok 5268 async-hooks/test-udpsendwrap27263 ---27264 duration_ms: 88.0800027265 ...27266ok 5269 async-hooks/test-udpwrap27267 ---27268 duration_ms: 87.6410027269 ...27270ok 5270 async-hooks/test-unhandled-exception-valid-ids27271 ---27272 duration_ms: 86.4200027273 ...27274ok 5271 async-hooks/test-unhandled-rejection-context27275 ---27276 duration_ms: 86.4820027277 ...27278ok 5272 async-hooks/test-zlib.zlib-binding.deflate27279 ---27280 duration_ms: 86.7390027281 ...27282ok 5273 async-hooks/test-async-local-storage-no-mix-contexts27283 ---27284 duration_ms: 507.0260027285 ...27286ok 5274 es-module/test-cjs-defer-static-import-eval27287 ---27288 duration_ms: 107.8870027289 ...27290ok 5275 async-hooks/test-callback-error27291 ---27292 duration_ms: 506.6700027293 ...27294ok 5276 es-module/test-cjs-prototype-pollution27295 ---27296 duration_ms: 108.8160027297 ...27298ok 5277 test426/test-source-map-spec27299 ---27300 duration_ms: 134.9090027301 ...27302ok 5278 es-module/test-defer-import-eval27303 ---27304 duration_ms: 108.0290027305 ...27306ok 5279 es-module/test-defer-import-eval-with-tla27307 ---27308 duration_ms: 107.8810027309 ...27310ok 5280 es-module/test-esm-assert-strict27311 ---27312 duration_ms: 87.0780027313 ...27314ok 5281 es-module/test-defer-import-with-module-tree27315 ---27316 duration_ms: 109.2730027317 ...27318ok 5282 es-module/test-defer-import-with-regular-import27319 ---27320 duration_ms: 108.6650027321 ...27322ok 5283 es-module/test-esm-basic-imports27323 ---27324 duration_ms: 86.4960027325 ...27326ok 5284 es-module/test-cjs-legacyMainResolve27327 ---27328 duration_ms: 134.3530027329 ...27330ok 5285 es-module/test-disable-require-module-with-detection27331 ---27332 duration_ms: 108.6180027333 ...27334ok 5286 async-hooks/test-writewrap27335 ---27336 duration_ms: 167.5660027337 ...27338ok 5287 es-module/test-dynamic-import-script-lifetime27339 ---27340 duration_ms: 108.4490027341 ...27342ok 5288 es-module/test-esm-assertionless-json-import27343 ---27344 duration_ms: 134.6110027345 ...27346ok 5289 async-hooks/test-httpparser-reuse27347 ---27348 duration_ms: 407.4750027349 ...27350ok 5290 es-module/test-cjs-esm-warn27351 ---27352 duration_ms: 209.2400027353 ...27354ok 5291 es-module/test-esm-custom-exports27355 ---27356 duration_ms: 86.4020027357 ...27358ok 5292 es-module/test-esm-data-urls27359 ---27360 duration_ms: 87.2880027361 ...27362ok 5293 es-module/test-esm-cjs-named-error27363 ---27364 duration_ms: 107.7600027365 ...27366ok 5294 es-module/test-esm-dynamic-import27367 ---27368 duration_ms: 87.4250027369 ...27370ok 5295 es-module/test-esm-dynamic-import-attribute27371 ---27372 duration_ms: 87.5100027373 ...27374ok 5296 es-module/test-esm-child-process-fork-main27375 ---27376 duration_ms: 167.8680027377 ...27378ok 5297 es-module/test-esm-cyclic-dynamic-import27379 ---27380 duration_ms: 108.0220027381 ...27382ok 5298 es-module/test-esm-dynamic-import-attribute27383 ---27384 duration_ms: 86.3960027385 ...27386ok 5299 es-module/test-esm-default-type27387 ---27388 duration_ms: 107.9530027389 ...27390ok 5300 es-module/test-esm-dns-promises27391 ---27392 duration_ms: 107.6560027393 ...27394ok 5301 es-module/test-esm-double-encoding27395 ---27396 duration_ms: 107.6070027397 ...27398ok 5302 es-module/test-esm-cjs-builtins27399 ---27400 duration_ms: 167.7270027401 ...27402ok 5303 es-module/test-esm-dynamic-import-commonjs27403 ---27404 duration_ms: 86.5300027405 ...27406ok 5304 async-hooks/test-querywrap27407 ---27408 duration_ms: 406.7010027409 ...27410ok 5305 es-module/test-esm-cjs-main27411 ---27412 duration_ms: 167.5970027413 ...27414ok 5306 async-hooks/test-statwatcher27415 ---27416 duration_ms: 407.8310027417 ...27418ok 5307 es-module/test-esm-dynamic-import-mutating-fs27419 ---27420 duration_ms: 86.7700027421 ...27422ok 5308 es-module/test-esm-encoded-path27423 ---27424 duration_ms: 86.5240027425 ...27426ok 5309 es-module/test-esm-dynamic-import-commonjs27427 ---27428 duration_ms: 108.3950027429 ...27430ok 5310 async-hooks/test-timers.setInterval27431 ---27432 duration_ms: 406.9090027433 ...27434ok 5311 async-hooks/test-timers.setTimeout27435 ---27436 duration_ms: 406.6170027437 ...27438ok 5312 async-hooks/test-tlswrap27439 ---27440 duration_ms: 406.6960027441 ...27442ok 5313 es-module/test-esm-error-cache27443 ---27444 duration_ms: 87.0410027445 ...27446ok 5314 es-module/test-esm-example-loader27447 ---27448 duration_ms: 87.2410027449 ...27450ok 5315 es-module/test-esm-forbidden-globals27451 ---27452 duration_ms: 86.6560027453 ...27454ok 5316 es-module/test-esm-exports27455 ---27456 duration_ms: 108.3380027457 ...27458ok 5317 es-module/test-esm-fs-promises27459 ---27460 duration_ms: 86.7760027461 ...27462ok 5318 es-module/test-esm-cjs-exports27463 ---27464 duration_ms: 261.0260027465 ...27466ok 5319 es-module/test-esm-exports-deprecations27467 ---27468 duration_ms: 134.8010027469 ...27470ok 5320 es-module/test-esm-dynamic-import-mutating-fs27471 ---27472 duration_ms: 167.3670027473 ...27474ok 5321 es-module/test-esm-import-attributes-227475 ---27476 duration_ms: 87.0110027477 ...27478ok 5322 es-module/test-esm-import-attributes-327479 ---27480 duration_ms: 86.7120027481 ...27482ok 5323 es-module/test-esm-import-attributes-127483 ---27484 duration_ms: 108.2850027485 ...27486ok 5324 es-module/test-esm-encoded-path-native27487 ---27488 duration_ms: 167.5440027489 ...27490ok 5325 es-module/test-esm-import-attributes-validation-text27491 ---27492 duration_ms: 86.9220027493 ...27494ok 5326 es-module/test-esm-import-attributes-errors27495 ---27496 duration_ms: 107.9850027497 ...27498ok 5327 es-module/test-esm-import-attributes-errors27499 ---27500 duration_ms: 107.9490027501 ...27502ok 5328 es-module/test-esm-import-attributes-identity27503 ---27504 duration_ms: 108.3650027505 ...27506ok 5329 es-module/test-esm-import-attributes-validation27507 ---27508 duration_ms: 109.1660027509 ...27510ok 5330 es-module/test-esm-import-meta27511 ---27512 duration_ms: 87.0250027513 ...27514ok 5331 es-module/test-esm-import-meta-main27515 ---27516 duration_ms: 134.9360027517 ...27518ok 5332 es-module/test-esm-import-meta-resolve-hooks27519 ---27520 duration_ms: 108.2490027521 ...27522ok 5333 es-module/test-esm-import-text27523 ---27524 duration_ms: 108.2430027525 ...27526ok 5334 es-module/test-esm-import-assertion-warning27527 ---27528 duration_ms: 209.1440027529 ...27530ok 5335 es-module/test-esm-import-text-disabled27531 ---27532 duration_ms: 108.2810027533 ...27534ok 5336 es-module/test-esm-experimental-warnings27535 ---27536 duration_ms: 261.4350027537 ...27538ok 5337 es-module/test-esm-export-not-found27539 ---27540 duration_ms: 261.0410027541 ...27542ok 5338 es-module/test-esm-imports-deprecations27543 ---27544 duration_ms: 110.7580027545 ...27546ok 5339 es-module/test-esm-in-require-cache27547 ---27548 duration_ms: 108.5630027549 ...27550ok 5340 es-module/test-esm-json-cache27551 ---27552 duration_ms: 87.0850027553 ...27554ok 5341 es-module/test-esm-in-require-cache-227555 ---27556 duration_ms: 109.8450027557 ...27558ok 5342 es-module/test-esm-imports27559 ---27560 duration_ms: 134.3930027561 ...27562ok 5343 es-module/test-esm-invalid-data-urls27563 ---27564 duration_ms: 109.2940027565 ...27566ok 5344 es-module/test-esm-import-json-named-export27567 ---27568 duration_ms: 209.5050027569 ...27570ok 5345 client-proxy/test-https-proxy-request-incomplete-headers27571 ---27572 duration_ms: 1309.2410027573 ...27574ok 5346 es-module/test-esm-loader-cache-clearing27575 ---27576 duration_ms: 87.4010027577 ...27578ok 5347 es-module/test-esm-invalid-pjson27579 ---27580 duration_ms: 168.4580027581 ...27582ok 5348 es-module/test-esm-live-binding27583 ---27584 duration_ms: 109.4710027585 ...27586ok 5349 es-module/test-esm-json27587 ---27588 duration_ms: 168.8470027589 ...27590ok 5350 es-module/test-esm-loader27591 ---27592 duration_ms: 134.6840027593 ...27594ok 5351 es-module/test-esm-initialization27595 ---27596 duration_ms: 209.2800027597 ...27598ok 5352 es-module/test-esm-loader-custom-condition27599 ---27600 duration_ms: 134.3210027601 ...27602ok 5353 es-module/test-esm-loader-dependency27603 ---27604 duration_ms: 134.4400027605 ...27606ok 5354 es-module/test-esm-loader-modulemap27607 ---27608 duration_ms: 107.7880027609 ...27610ok 5355 es-module/test-esm-loader-event-loop27611 ---27612 duration_ms: 136.1710027613 ...27614ok 5356 es-module/test-esm-loader-invalid-format27615 ---27616 duration_ms: 135.5160027617 ...27618ok 5357 es-module/test-esm-extensionless-esm-and-wasm27619 ---27620 duration_ms: 406.3360027621 ...27622ok 5358 es-module/test-esm-loader-mock27623 ---27624 duration_ms: 135.1930027625 ...27626ok 5359 async-hooks/test-async-exec-resource-http-3206027627 ---27628 duration_ms: 1208.2990027629 ...27630ok 5360 client-proxy/test-https-proxy-request-tunnel-timeout27631 ---27632 duration_ms: 1308.3210027633 ...27634ok 5361 es-module/test-esm-loader-invalid-url27635 ---27636 duration_ms: 168.3310027637 ...27638ok 5362 client-proxy/test-https-proxy-request-tunnel-timeout-agent27639 ---27640 duration_ms: 1316.5280027641 ...27642ok 5363 es-module/test-esm-loader-search27643 ---27644 duration_ms: 110.1900027645 ...27646ok 5364 es-module/test-cjs-legacyMainResolve-permission27647 ---27648 duration_ms: 707.6210027649 ...27650ok 5365 es-module/test-esm-cjs-load-error-note27651 ---27652 duration_ms: 607.3220027653 ...27654ok 5366 es-module/test-esm-loader-text-format27655 ---27656 duration_ms: 108.1440027657 ...27658ok 5367 es-module/test-esm-loader-stringify-text27659 ---27660 duration_ms: 135.5830027661 ...27662ok 5368 es-module/test-esm-loader-not-found27663 ---27664 duration_ms: 212.8760027665 ...27666ok 5369 es-module/test-esm-long-path-win # skip this test is Windows-specific.27667 ---27668 duration_ms: 112.0450027669 ...27670ok 5370 es-module/test-esm-extension-lookup-deprecation27671 ---27672 duration_ms: 507.2520027673 ...27674ok 5371 es-module/test-esm-main-lookup27675 ---27676 duration_ms: 110.1680027677 ...27678ok 5372 es-module/test-esm-loader-with-source27679 ---27680 duration_ms: 134.6370027681 ...27682ok 5373 es-module/test-esm-namespace27683 ---27684 duration_ms: 108.0890027685 ...27686ok 5374 es-module/test-esm-named-exports27687 ---27688 duration_ms: 135.1770027689 ...27690ok 5375 es-module/test-esm-no-addons27691 ---27692 duration_ms: 136.3000027693 ...27694ok 5376 es-module/test-esm-loader-resolve-type27695 ---27696 duration_ms: 261.5790027697 ...27698ok 5377 es-module/test-esm-non-js27699 ---27700 duration_ms: 168.9200027701 ...27702ok 5378 es-module/test-esm-path-posix27703 ---27704 duration_ms: 88.5390027705 ...27706ok 5379 es-module/test-esm-loader-with-syntax-error27707 ---27708 duration_ms: 210.8750027709 ...27710ok 5380 es-module/test-esm-path-win3227711 ---27712 duration_ms: 108.4510027713 ...27714ok 5381 wasi/test-wasi-pthread27715 ---27716 duration_ms: 2409.6860027717 ...27718ok 5382 es-module/test-esm-import-meta-resolve27719 ---27720 duration_ms: 512.2570027721 ...27722ok 5383 es-module/test-esm-pkgname27723 ---27724 duration_ms: 116.1760027725 ...27726ok 5384 es-module/test-esm-preserve-symlinks-not-found27727 ---27728 duration_ms: 111.9810027729 ...27730ok 5385 es-module/test-esm-loader-entry-url27731 ---27732 duration_ms: 412.3400027733 ...27734ok 5386 es-module/test-esm-package-map-symlink27735 ---27736 duration_ms: 172.8770027737 ...27738ok 5387 es-module/test-esm-preserve-symlinks27739 ---27740 duration_ms: 168.6050027741 ...27742ok 5388 es-module/test-esm-nowarn-exports27743 ---27744 duration_ms: 264.9590027745 ...27746ok 5389 es-module/test-esm-process27747 ---27748 duration_ms: 109.0060027749 ...27750ok 5390 es-module/test-esm-preserve-symlinks-not-found-plain27751 ---27752 duration_ms: 110.4140027753 ...27754ok 5391 es-module/test-esm-prototype-pollution27755 ---27756 duration_ms: 109.1260027757 ...27758ok 5392 es-module/test-esm-recursive-cjs-dependencies27759 ---27760 duration_ms: 109.7100027761 ...27762ok 5393 es-module/test-esm-package-map-version-fork27763 ---27764 duration_ms: 215.3170027765 ...27766ok 5394 es-module/test-esm-package-map-boundaries27767 ---27768 duration_ms: 265.4020027769 ...27770ok 5395 es-module/test-esm-package-map-exports27771 ---27772 duration_ms: 264.7040027773 ...27774ok 5396 es-module/test-esm-require-cache27775 ---27776 duration_ms: 108.3010027777 ...27778ok 5397 es-module/test-esm-package-map-flag27779 ---27780 duration_ms: 265.7580027781 ...27782ok 5398 es-module/test-esm-loader-default-resolver27783 ---27784 duration_ms: 508.4890027785 ...27786ok 5399 es-module/test-esm-package-map-basic27787 ---27788 duration_ms: 327.1910027789 ...27790ok 5400 es-module/test-esm-require-race-condition27791 ---27792 duration_ms: 108.4560027793 ...27794ok 5401 es-module/test-esm-resolve-type27795 ---27796 duration_ms: 109.0140027797 ...27798ok 5402 es-module/test-esm-scope-node-modules27799 ---27800 duration_ms: 109.1260027801 ...27802ok 5403 es-module/test-esm-loader-thenable27803 ---27804 duration_ms: 408.2070027805 ...27806ok 5404 es-module/test-esm-repl27807 ---27808 duration_ms: 168.5980027809 ...27810ok 5405 es-module/test-esm-snapshot27811 ---27812 duration_ms: 91.2610027813 ...27814ok 5406 es-module/test-esm-shebang27815 ---27816 duration_ms: 109.2410027817 ...27818ok 5407 es-module/test-esm-shared-loader-dep27819 ---27820 duration_ms: 135.5450027821 ...27822ok 5408 es-module/test-esm-repl-imports27823 ---27824 duration_ms: 209.3700027825 ...27826ok 5409 es-module/test-esm-throw-undefined27827 ---27828 duration_ms: 111.0080027829 ...27830ok 5410 es-module/test-esm-preserve-symlinks-main27831 ---27832 duration_ms: 330.8410027833 ...27834ok 5411 es-module/test-esm-symlink-main27835 ---27836 duration_ms: 173.9120027837 ...27838ok 5412 es-module/test-esm-symlink27839 ---27840 duration_ms: 178.6660027841 ...27842ok 5413 es-module/test-esm-type-field-errors-227843 ---27844 duration_ms: 105.5740027845 ...27846ok 5414 es-module/test-esm-type-field27847 ---27848 duration_ms: 118.6600027849 ...27850ok 5415 es-module/test-esm-type-main27851 ---27852 duration_ms: 114.3300027853 ...27854ok 5416 es-module/test-esm-undefined-cjs-global-like-variables27855 ---27856 duration_ms: 120.6350027857 ...27858ok 5417 es-module/test-esm-url-extname27859 ---27860 duration_ms: 117.1210027861 ...27862ok 5418 es-module/test-esm-import-meta-main-eval27863 ---27864 duration_ms: 807.7830027865 ...27866ok 5419 es-module/test-esm-util-types27867 ---27868 duration_ms: 116.6000027869 ...27870ok 5420 es-module/test-esm-virtual-json27871 ---27872 duration_ms: 140.5430027873 ...27874ok 5421 es-module/test-esm-symlink-type27875 ---27876 duration_ms: 265.5120027877 ...27878ok 5422 es-module/test-esm-syntax-error27879 ---27880 duration_ms: 263.6710027881 ...27882ok 5423 es-module/test-esm-type-field-errors27883 ---27884 duration_ms: 224.5640027885 ...27886ok 5424 es-module/test-esm-package-map-paths27887 ---27888 duration_ms: 518.0000027889 ...27890ok 5425 es-module/test-esm-module-not-found-commonjs-hint27891 ---27892 duration_ms: 613.7250027893 ...27894ok 5426 es-module/test-esm-wasm-escape-import-names27895 ---27896 duration_ms: 187.5420027897 ...27898ok 5427 es-module/test-esm-wasm-globals-all-types27899 ---27900 duration_ms: 174.4160027901 ...27902ok 5428 es-module/test-esm-wasm-js-string-builtins27903 ---27904 duration_ms: 179.6840027905 ...27906ok 5429 es-module/test-esm-wasm-module-instances-warning27907 ---27908 duration_ms: 176.7910027909 ...27910ok 5430 es-module/test-esm-wasm-no-code-injection27911 ---27912 duration_ms: 176.0350027913 ...27914ok 5431 es-module/test-esm-wasm-load-exports27915 ---27916 duration_ms: 182.9730027917 ...27918ok 5432 es-module/test-esm-wasm-reject-wasm-export-names27919 ---27920 duration_ms: 178.4490027921 ...27922ok 5433 es-module/test-esm-unknown-extension27923 ---27924 duration_ms: 282.6820027925 ...27926ok 5434 es-module/test-esm-package-map-errors27927 ---27928 duration_ms: 612.0250027929 ...27930ok 5435 es-module/test-esm-wasm-reject-wasm-import-names27931 ---27932 duration_ms: 175.7480027933 ...27934ok 5436 es-module/test-esm-import-flag27935 ---27936 duration_ms: 1012.4910027937 ...27938ok 5437 es-module/test-esm-wasm-reject-wasm-js-import-module27939 ---27940 duration_ms: 170.3860027941 ...27942ok 5438 es-module/test-esm-wasm-reject-wasm-js-export-names27943 ---27944 duration_ms: 180.4160027945 ...27946ok 5439 es-module/test-esm-wasm-reject-wasm-js-import-names27947 ---27948 duration_ms: 167.7930027949 ...27950ok 5440 es-module/test-esm-wasm-non-identifier-exports27951 ---27952 duration_ms: 217.9830027953 ...27954ok 5441 es-module/test-esm-register-deprecation27955 ---27956 duration_ms: 509.5780027957 ...27958ok 5442 es-module/test-esm-wasm-source-phase-dynamic27959 ---27960 duration_ms: 167.8350027961 ...27962ok 5443 es-module/test-esm-wasm-source-phase-identity27963 ---27964 duration_ms: 170.1990027965 ...27966ok 5444 es-module/test-esm-tla27967 ---27968 duration_ms: 412.3040027969 ...27970ok 5445 es-module/test-esm-wasm-source-phase-no-execute-dynamic27971 ---27972 duration_ms: 168.7920027973 ...27974ok 5446 es-module/test-esm-windows27975 ---27976 duration_ms: 108.9680027977 ...27978ok 5447 es-module/test-esm-wasm-source-phase-not-defined-dynamic27979 ---27980 duration_ms: 170.5790027981 ...27982ok 5448 es-module/test-import-module-retry-require-errored27983 ---27984 duration_ms: 94.5200027985 ...27986ok 5449 es-module/test-esm-wasm-source-phase-not-defined-static27987 ---27988 duration_ms: 168.0810027989 ...27990ok 5450 es-module/test-import-module-conditional-exports-module27991 ---27992 duration_ms: 108.8180027993 ...27994ok 5451 es-module/test-esm-wasm-source-phase-no-execute27995 ---27996 duration_ms: 209.3950027997 ...27998ok 5452 es-module/test-esm-wasm-source-phase-static27999 ---28000 duration_ms: 169.9010028001 ...28002ok 5453 es-module/test-loaders-hidden-from-users28003 ---28004 duration_ms: 110.6040028005 ...28006ok 5454 es-module/test-esm-wasm-top-level-execution28007 ---28008 duration_ms: 172.0330028009 ...28010ok 5455 es-module/test-import-cjs-jitless28011 ---28012 duration_ms: 134.8090028013 ...28014ok 5456 es-module/test-esm-wasm-vm-source-phase-dynamic28015 ---28016 duration_ms: 167.8090028017 ...28018ok 5457 es-module/test-esm-wasm-vm-source-phase-static28019 ---28020 duration_ms: 169.3220028021 ...28022ok 5458 es-module/test-loaders-unknown-builtin-module28023 ---28024 duration_ms: 138.9500028025 ...28026ok 5459 es-module/test-require-module28027 ---28028 duration_ms: 108.5130028029 ...28030ok 5460 es-module/test-require-module-cached-tla28031 ---28032 duration_ms: 89.2040028033 ...28034ok 5461 es-module/test-require-as-esm-interop28035 ---28036 duration_ms: 137.9010028037 ...28038ok 5462 es-module/test-require-module-conditional-exports28039 ---28040 duration_ms: 88.6940028041 ...28042ok 5463 es-module/test-require-module-conditional-exports-module28043 ---28044 duration_ms: 108.3710028045 ...28046ok 5464 es-module/test-require-module-cycle-cjs-esm-esm28047 ---28048 duration_ms: 108.9900028049 ...28050ok 5465 es-module/test-import-preload-require-cycle28051 ---28052 duration_ms: 210.0380028053 ...28054ok 5466 es-module/test-import-require-tla-twice28055 ---28056 duration_ms: 211.7480028057 ...28058ok 5467 es-module/test-require-module-default-extension28059 ---28060 duration_ms: 111.3110028061 ...28062ok 5468 es-module/test-require-module-defined-esmodule28063 ---28064 duration_ms: 110.8290028065 ...28066ok 5469 es-module/test-require-module-detect-entry-point28067 ---28068 duration_ms: 108.4070028069 ...28070ok 5470 es-module/test-require-module-dont-detect-cjs28071 ---28072 duration_ms: 108.1170028073 ...28074ok 5471 es-module/test-require-module-dynamic-import-328075 ---28076 duration_ms: 87.1860028077 ...28078ok 5472 es-module/test-esm-source-map28079 ---28080 duration_ms: 618.7960028081 ...28082ok 5473 es-module/test-extensionless-esm-type-commonjs28083 ---28084 duration_ms: 260.9050028085 ...28086ok 5474 es-module/test-require-module-dynamic-import-128087 ---28088 duration_ms: 108.3240028089 ...28090ok 5475 es-module/test-require-module-dynamic-import-228091 ---28092 duration_ms: 108.7360028093 ...28094ok 5476 es-module/test-require-module-detect-entry-point-aou28095 ---28096 duration_ms: 135.3500028097 ...28098ok 5477 es-module/test-require-module-dynamic-import-428099 ---28100 duration_ms: 109.8380028101 ...28102ok 5478 es-module/test-require-module-error-catching28103 ---28104 duration_ms: 110.3540028105 ...28106ok 5479 es-module/test-require-module-implicit28107 ---28108 duration_ms: 108.6320028109 ...28110ok 5480 es-module/test-require-module-instantiated28111 ---28112 duration_ms: 109.6160028113 ...28114ok 5481 es-module/test-require-esm-from-imported-cjs28115 ---28116 duration_ms: 265.0220028117 ...28118ok 5482 es-module/test-require-module-retry-import-errored-228119 ---28120 duration_ms: 89.8870028121 ...28122ok 5483 es-module/test-require-module-retry-import-errored28123 ---28124 duration_ms: 109.6380028125 ...28126ok 5484 es-module/test-require-module-retry-import-evaluating28127 ---28128 duration_ms: 108.5750028129 ...28130ok 5485 es-module/test-require-module-synchronous-rejection-handling28131 ---28132 duration_ms: 108.1960028133 ...28134ok 5486 es-module/test-esm-loader-programmatically28135 ---28136 duration_ms: 1109.6370028137 ...28138ok 5487 es-module/test-require-module-tla-instantiation-error28139 ---28140 duration_ms: 110.4830028141 ...28142ok 5488 es-module/test-require-module-tla-nested28143 ---28144 duration_ms: 109.2510028145 ...28146ok 5489 es-module/test-require-module-tla-rejected28147 ---28148 duration_ms: 110.7590028149 ...28150ok 5490 es-module/test-require-module-tla-error-metadata28151 ---28152 duration_ms: 137.9580028153 ...28154ok 5491 es-module/test-require-module-tla-resolved28155 ---28156 duration_ms: 109.7930028157 ...28158ok 5492 es-module/test-require-module-tla-retry-import28159 ---28160 duration_ms: 115.2520028161 ...28162ok 5493 es-module/test-require-module-tla-unresolved28163 ---28164 duration_ms: 93.0720028165 ...28166ok 5494 es-module/test-require-module-tla-execution28167 ---28168 duration_ms: 171.0230028169 ...28170ok 5495 es-module/test-require-module-tla-retry-import-228171 ---28172 duration_ms: 109.9980028173 ...28174ok 5496 es-module/test-require-module-tla-retry-require28175 ---28176 duration_ms: 111.1660028177 ...28178ok 5497 es-module/test-require-module-cycle-esm-cjs-esm-esm28179 ---28180 duration_ms: 328.7290028181 ...28182ok 5498 es-module/test-require-module-cycle-esm-esm-cjs-esm-esm28183 ---28184 duration_ms: 328.2210028185 ...28186ok 5499 es-module/test-require-module-twice28187 ---28188 duration_ms: 113.5090028189 ...28190ok 5500 es-module/test-require-module-with-detection28191 ---28192 duration_ms: 108.1480028193 ...28194ok 5501 es-module/test-require-module-tla-print-execution28195 ---28196 duration_ms: 209.5360028197 ...28198ok 5502 es-module/test-require-module-errors28199 ---28200 duration_ms: 328.5590028201 ...28202ok 5503 es-module/test-require-module-feature-detect28203 ---28204 duration_ms: 328.1810028205 ...28206ok 5504 es-module/test-vm-compile-function-lineoffset28207 ---28208 duration_ms: 108.6450028209 ...28210ok 5505 es-module/test-require-module-cycle-esm-cjs-esm28211 ---28212 duration_ms: 406.7070028213 ...28214ok 5506 es-module/test-require-module-cycle-esm-esm-cjs-esm28215 ---28216 duration_ms: 408.0130028217 ...28218ok 5507 es-module/test-vm-compile-function-leak28219 ---28220 duration_ms: 135.4640028221 ...28222ok 5508 es-module/test-vm-main-context-default-loader28223 ---28224 duration_ms: 108.0080028225 ...28226ok 5509 es-module/test-vm-main-context-default-loader-eval28227 ---28228 duration_ms: 108.4840028229 ...28230ok 5510 es-module/test-vm-synthetic-module-leak28231 ---28232 duration_ms: 107.6990028233 ...28234ok 5511 es-module/test-vm-contextified-script-leak28235 ---28236 duration_ms: 134.9060028237 ...28238ok 5512 es-module/test-require-module-warning28239 ---28240 duration_ms: 209.3100028241 ...28242ok 5513 es-module/test-wasm-memory-out-of-bound28243 ---28244 duration_ms: 108.7230028245 ...28246ok 5514 es-module/test-wasm-simple28247 ---28248 duration_ms: 108.3930028249 ...28250ok 5515 es-module/test-require-module-transpiled28251 ---28252 duration_ms: 328.8890028253 ...28254ok 5516 es-module/test-require-node-modules-warning28255 ---28256 duration_ms: 327.7340028257 ...28258ok 5517 es-module/test-vm-source-text-module-leak28259 ---28260 duration_ms: 266.7980028261 ...28262ok 5518 es-module/test-esm-tla-unfinished28263 ---28264 duration_ms: 1023.2730028265 ...28266ok 5519 es-module/test-require-module-tla-error-snapshot28267 ---28268 duration_ms: 507.3140028269 ...28270ok 5520 es-module/test-esm-loader-spawn-promisified28271 ---28272 duration_ms: 1512.1770028273 ...28274ok 5521 es-module/test-require-module-preload28275 ---28276 duration_ms: 607.8430028277 ...28278ok 5522 es-module/test-loaders-workers-spawned28279 ---28280 duration_ms: 911.6950028281 ...28282ok 5523 es-module/test-esm-loader-chaining28283 ---28284 duration_ms: 1812.1280028285 ...28286ok 5524 es-module/test-esm-detect-ambiguous28287 ---28288 duration_ms: 2216.2910028289 ...28290ok 5525 pummel/test-array-hash-collision28291 ---28292 duration_ms: 325.4590028293 ...28294ok 5526 es-module/test-typescript-module28295 ---28296 duration_ms: 907.8930028297 ...28298ok 5527 es-module/test-typescript-commonjs28299 ---28300 duration_ms: 1107.7300028301 ...28302ok 5528 es-module/test-typescript-eval28303 ---28304 duration_ms: 1607.9410028305 ...28306ok 5529 es-module/test-esm-tla-syntax-errors-not-recognized-as-tla-error28307 ---28308 duration_ms: 2518.8700028309 ...28310ok 5530 es-module/test-typescript28311 ---28312 duration_ms: 2207.9190028313 ...28314ok 5531 pummel/test-blob-slice-with-large-size28315 ---28316 duration_ms: 1607.2290028317 ...28318ok 5532 wasi/test-wasi-poll28319 ---28320 duration_ms: 6413.8300028321 ...28322ok 5533 es-module/test-wasm-web-api28323 ---28324 duration_ms: 3408.2420028325 ...28326ok 5534 pummel/test-buffer-large-size-buffer-alloc28327 ---28328 duration_ms: 1506.9910028329 ...28330ok 5535 pummel/test-buffer-large-size-buffer-alloc-unsafe28331 ---28332 duration_ms: 1507.1660028333 ...28334ok 5536 pummel/test-buffer-large-size-buffer-alloc-unsafe-slow28335 ---28336 duration_ms: 1506.9660028337 ...28338ok 5537 pummel/test-buffer-large-size-buffer-write28339 ---28340 duration_ms: 69.3510028341 ...28342ok 5538 pummel/test-buffer-large-size-copy28343 ---28344 duration_ms: 2508.4840028345 ...28346ok 5539 parallel/test-runner-execution-ordered-bypass28347 ---28348 duration_ms: 30386.0210028349 ...28350ok 5540 pummel/test-buffer-large-size-slowbuffer28351 ---28352 duration_ms: 1507.4120028353 ...28354ok 5541 pummel/test-child-process-spawn-loop28355 ---28356 duration_ms: 806.6020028357 ...28358ok 5542 pummel/test-crypto-argon2-nonblocking-constructor28359 ---28360 duration_ms: 1307.3640028361 ...28362ok 5543 pummel/test-crypto-dh-hash28363 ---28364 duration_ms: 134.4780028365 ...28366ok 5544 pummel/test-crypto-dh-keys28367 ---28368 duration_ms: 208.8210028369 ...28370ok 5545 pummel/test-crypto-pqc-sign-verify-slh-dsa28371 ---28372 duration_ms: 7111.9510028373 ...28374ok 5546 pummel/test-dh-regr28375 ---28376 duration_ms: 15619.0480028377 ...28378ok 5547 pummel/test-fs-largefile28379 ---28380 duration_ms: 69.5760028381 ...28382ok 5548 pummel/test-fs-read-file-sync-utf8-memory28383 ---28384 duration_ms: 606.2630028385 ...28386ok 5549 pummel/test-fs-readfile-tostring-fail28387 ---28388 duration_ms: 906.5250028389 ...28390ok 5550 pummel/test-heap-profile-and-snapshot-near-heap-limit28391 ---28392 duration_ms: 706.7090028393 ...28394ok 5551 pummel/test-heap-profile-near-heap-limit28395 ---28396 duration_ms: 606.5690028397 ...28398ok 5552 pummel/test-heapdump-dns28399 ---28400 duration_ms: 1307.1010028401 ...28402ok 5553 pummel/test-heapdump-env28403 ---28404 duration_ms: 506.5980028405 ...28406ok 5554 pummel/test-heapdump-fs-promise28407 ---28408 duration_ms: 908.5500028409 ...28410ok 5555 pummel/test-heapdump-http228411 ---28412 duration_ms: 1607.4420028413 ...28414ok 5556 pummel/test-heapdump-inspector28415 ---28416 duration_ms: 906.7250028417 ...28418ok 5557 pummel/test-heapdump-shadow-realm28419 ---28420 duration_ms: 2107.4310028421 ...28422ok 5558 pummel/test-heapdump-tls28423 ---28424 duration_ms: 1007.3220028425 ...28426ok 5559 pummel/test-heapdump-urlpattern28427 ---28428 duration_ms: 907.0590028429 ...28430ok 5560 pummel/test-heapdump-vm-script28431 ---28432 duration_ms: 606.6410028433 ...28434ok 5561 pummel/test-heapdump-worker28435 ---28436 duration_ms: 906.8270028437 ...28438ok 5562 pummel/test-heapdump-zlib28439 ---28440 duration_ms: 8312.9650028441 ...28442ok 5563 pummel/test-heapdump-zstd28443 ---28444 duration_ms: 1307.3350028445 ...28446ok 5564 pummel/test-heapsnapshot-near-heap-limit28447 ---28448 duration_ms: 1907.5690028449 ...28450ok 5565 pummel/test-heapsnapshot-near-heap-limit-big28451 ---28452 duration_ms: 1807.4270028453 ...28454ok 5566 pummel/test-heapsnapshot-near-heap-limit-bounded28455 ---28456 duration_ms: 1707.5330028457 ...28458ok 5567 pummel/test-heapsnapshot-near-heap-limit-by-api28459 ---28460 duration_ms: 2608.2240028461 ...28462ok 5568 pummel/test-http-many-keep-alive-connections28463 ---28464 duration_ms: 706.7580028465 ...28466ok 5569 pummel/test-http-upload-timeout28467 ---28468 duration_ms: 3308.6750028469 ...28470ok 5570 pummel/test-https-large-response28471 ---28472 duration_ms: 167.5370028473 ...28474ok 5571 pummel/test-https-no-reader28475 ---28476 duration_ms: 2307.2370028477 ...28478ok 5572 pummel/test-keep-alive # skip test requires `wrk` to be installed first28479 ---28480 duration_ms: 69.5990028481 ...28482ok 5573 pummel/test-net-many-clients28483 ---28484 duration_ms: 167.4790028485 ...28486ok 5574 pummel/test-net-pause28487 ---28488 duration_ms: 2207.7630028489 ...28490ok 5575 pummel/test-net-pingpong28491 ---28492 duration_ms: 210.0100028493 ...28494ok 5576 pummel/test-net-pingpong-delay28495 ---28496 duration_ms: 406.4350028497 ...28498ok 5577 pummel/test-net-timeout28499 ---28500 duration_ms: 3708.8490028501 ...28502ok 5578 pummel/test-net-timeout228503 ---28504 duration_ms: 5210.1520028505 ...28506ok 5579 pummel/test-net-write-callbacks28507 ---28508 duration_ms: 706.7860028509 ...28510ok 5580 pummel/test-next-tick-infinite-calls28511 ---28512 duration_ms: 4009.1710028513 ...28514ok 5581 pummel/test-process-cpuUsage28515 ---28516 duration_ms: 706.5040028517 ...28518ok 5582 pummel/test-process-hrtime28519 ---28520 duration_ms: 2207.7350028521 ...28522ok 5583 pummel/test-regress-GH-89228523 ---28524 duration_ms: 261.1520028525 ...28526ok 5584 pummel/test-repl-paste-big-data28527 ---28528 duration_ms: 506.1760028529 ...28530ok 5585 pummel/test-stream-pipe-multi28531 ---28532 duration_ms: 821.7800028533 ...28534ok 5586 pummel/test-string-decoder-large-buffer28535 ---28536 duration_ms: 86.3820028537 ...28538ok 5587 pummel/test-structuredclone-jstransferable28539 ---28540 duration_ms: 806.5350028541 ...28542ok 5588 pummel/test-timers28543 ---28544 duration_ms: 3208.3400028545 ...28546ok 5589 pummel/test-tls-server-large-request28547 ---28548 duration_ms: 208.9700028549 ...28550ok 5590 pummel/test-tls-throttle28551 ---28552 duration_ms: 134.5520028553 ...28554ok 5591 pummel/test-vm-memleak28555 ---28556 duration_ms: 5410.7800028557 ...28558ok 5592 pummel/test-vm-race28559 ---28560 duration_ms: 5210.1210028561 ...28562ok 5593 pummel/test-watch-file28563 ---28564 duration_ms: 5210.0880028565 ...28566ok 5594 pummel/test-webcrypto-derivebits-pbkdf228567 ---28568 duration_ms: 2707.5240028569 ...28570ok 5595 pummel/test-webcrypto-kangarootwelve-32bit-overflow # skip only relevant when kMaxLength < 2^3228571 ---28572 duration_ms: 69.4920028573 ...28574ok 5596 pummel/test-worker-take-heapsnapshot28575 ---28576 duration_ms: 406.0980028577 ...28578ok 5597 pummel/test-zlib-zip-slow28579 ---28580 duration_ms: 15304.6990028581 ...28582ok 5598 wasm-allocation/test-wasm-allocation28583 ---28584 duration_ms: 197.5840028585 ...28586ok 5599 wasm-allocation/test-wasm-allocation-auto-adapt28587 ---28588 duration_ms: 132.6290028589 ...28590ok 5600 wasm-allocation/test-wasm-allocation-disable-trap-handler28591 ---28592 duration_ms: 129.6010028593 ...28594ok 5601 wasm-allocation/test-wasm-allocation-memory6428595 ---28596 duration_ms: 169.4670028597 ...28598ok 5602 wpt/test-abort28599 ---28600 duration_ms: 2463.5890028601 ...28602ok 5603 wpt/test-atob28603 ---28604 duration_ms: 356.5220028605 ...28606ok 5604 wpt/test-blob28607 ---28608 duration_ms: 754.2860028609 ...28610ok 5605 wpt/test-broadcastchannel28611 ---28612 duration_ms: 301.0610028613 ...28614ok 5606 wpt/test-compression28615 ---28616 duration_ms: 1548.0810028617 ...28618ok 5607 wpt/test-console28619 ---28620 duration_ms: 651.0150028621 ...28622ok 5608 wpt/test-encoding28623 ---28624 duration_ms: 1667.0620028625 ...28626ok 5609 wpt/test-events28627 ---28628 duration_ms: 636.0920028629 ...28630ok 5610 wpt/test-file28631 ---28632 duration_ms: 294.1950028633 ...28634ok 5611 wpt/test-hr-time28635 ---28636 duration_ms: 2474.2710028637 ...28638ok 5612 wpt/test-microtask-queuing28639 ---28640 duration_ms: 279.0550028641 ...28642ok 5613 wpt/test-performance-timeline28643 ---28644 duration_ms: 2940.8630028645 ...28646ok 5614 wpt/test-resource-timing28647 ---28648 duration_ms: 632.4520028649 ...28650ok 5615 wpt/test-streams28651 ---28652 duration_ms: 3377.0150028653 ...28654ok 5616 wpt/test-structured-clone28655 ---28656 duration_ms: 339.1260028657 ...28658ok 5617 wpt/test-timers28659 ---28660 duration_ms: 1150.6620028661 ...28662ok 5618 wpt/test-url # skip Different versions of Ada affect the WPT tests28663 ---28664 duration_ms: 115.6490028665 ...28666ok 5619 wpt/test-urlpattern28667 ---28668 duration_ms: 517.3360028669 ...28670ok 5620 wpt/test-wasm-jsapi28671 ---28672 duration_ms: 2652.6780028673 ...28674ok 5621 wpt/test-wasm-webapi28675 ---28676 duration_ms: 619.9730028677 ...28678ok 5622 wpt/test-web-locks28679 ---28680 duration_ms: 2746.7750028681 ...28682ok 5623 wpt/test-webcrypto28683 ---28684 duration_ms: 10086.1720028685 ...28686ok 5624 wpt/test-webidl28687 ---28688 duration_ms: 409.5260028689 ...28690ok 5625 wpt/test-webstorage28691 ---28692 duration_ms: 1612.0470028693 ...28694ok 5626 wpt/test-workers28695 ---28696 duration_ms: 708.5220028697 ...28698ok 5627 abort/test-abort-backtrace28699 ---28700 duration_ms: 213.3040028701 ...28702ok 5628 abort/test-abort-fatal-error28703 ---28704 duration_ms: 265.8980028705 ...28706ok 5629 abort/test-abort-uncaught-exception28707 ---28708 duration_ms: 266.8590028709 ...28710ok 5630 abort/test-addon-register-signal-handler # skip binding not built yet28711 ---28712 duration_ms: 74.6260028713 ...28714ok 5631 abort/test-addon-uv-handle-leak # skip binding not built yet28715 ---28716 duration_ms: 72.4540028717 ...28718ok 5632 abort/test-http-parser-consume28719 ---28720 duration_ms: 211.2180028721 ...28722ok 5633 abort/test-process-abort-exitcode28723 ---28724 duration_ms: 211.7920028725 ...28726ok 5634 abort/test-signal-handler28727 ---28728 duration_ms: 212.1100028729 ...28730ok 5635 abort/test-worker-abort-uncaught-exception28731 ---28732 duration_ms: 263.4850028733 ...28734ok 5636 abort/test-zlib-invalid-internals-usage28735 ---28736 duration_ms: 213.3590028737 ...28738ok 5637 sequential/test-async-wrap-getasyncid28739 ---28740 duration_ms: 209.6840028741 ...28742ok 5638 sequential/test-buffer-creation-regression28743 ---28744 duration_ms: 70.2270028745 ...28746ok 5639 sequential/test-child-process-emfile28747 ---28748 duration_ms: 134.2420028749 ...28750ok 5640 sequential/test-child-process-execsync28751 ---28752 duration_ms: 706.7760028753 ...28754ok 5641 sequential/test-child-process-exit28755 ---28756 duration_ms: 506.8880028757 ...28758ok 5642 sequential/test-child-process-pass-fd28759 ---28760 duration_ms: 608.8680028761 ...28762ok 5643 sequential/test-cli-syntax-bad28763 ---28764 duration_ms: 606.7680028765 ...28766ok 5644 sequential/test-cli-syntax-file-not-found28767 ---28768 duration_ms: 134.3760028769 ...28770ok 5645 sequential/test-cli-syntax-good28771 ---28772 duration_ms: 167.4140028773 ...28774ok 5646 sequential/test-cli-syntax-require28775 ---28776 duration_ms: 260.6570028777 ...28778ok 5647 sequential/test-cluster-inspect-brk28779 ---28780 duration_ms: 134.2150028781 ...28782ok 5648 sequential/test-cluster-net-listen-ipv6only-none28783 ---28784 duration_ms: 208.9950028785 ...28786ok 5649 sequential/test-cluster-net-listen-ipv6only-rr28787 ---28788 duration_ms: 167.5080028789 ...28790ok 5650 sequential/test-cluster-port-reuse-between-workers28791 ---28792 duration_ms: 260.7580028793 ...28794ok 5651 sequential/test-cluster-send-handle-large-payload28795 ---28796 duration_ms: 167.4520028797 ...28798ok 5652 sequential/test-cpu-prof-default28799 ---28800 duration_ms: 906.7010028801 ...28802ok 5653 sequential/test-cpu-prof-dir-absolute28803 ---28804 duration_ms: 906.8760028805 ...28806ok 5654 sequential/test-cpu-prof-dir-and-name28807 ---28808 duration_ms: 906.7470028809 ...28810ok 5655 sequential/test-cpu-prof-dir-relative28811 ---28812 duration_ms: 906.8710028813 ...28814ok 5656 sequential/test-cpu-prof-drained28815 ---28816 duration_ms: 906.6410028817 ...28818ok 5657 sequential/test-cpu-prof-exit28819 ---28820 duration_ms: 208.9320028821 ...28822ok 5658 sequential/test-cpu-prof-invalid-options28823 ---28824 duration_ms: 167.5080028825 ...28826ok 5659 sequential/test-cpu-prof-kill28827 ---28828 duration_ms: 208.9490028829 ...28830ok 5660 sequential/test-cpu-prof-name28831 ---28832 duration_ms: 1607.0930028833 ...28834ok 5661 sequential/test-cpu-prof-worker-argv28835 ---28836 duration_ms: 906.9600028837 ...28838ok 5662 sequential/test-crypto-timing-safe-equal28839 ---28840 duration_ms: 86.5520028841 ...28842ok 5663 sequential/test-crypto-timing-safe-equal-fast28843 ---28844 duration_ms: 107.6590028845 ...28846ok 5664 sequential/test-debug-prompt28847 ---28848 duration_ms: 606.5630028849 ...28850ok 5665 sequential/test-debugger-custom-port28851 ---28852 duration_ms: 606.7400028853 ...28854ok 5666 sequential/test-debugger-debug-brk28855 ---28856 duration_ms: 134.4910028857 ...28858ok 5667 sequential/test-debugger-invalid-args28859 ---28860 duration_ms: 5309.4660028861 ...28862ok 5668 sequential/test-debugger-launch28863 ---28864 duration_ms: 706.6270028865 ...28866ok 5669 sequential/test-debugger-pid28867 ---28868 duration_ms: 325.2960028869 ...28870ok 5670 sequential/test-deprecation-flags28871 ---28872 duration_ms: 134.3980028873 ...28874ok 5671 sequential/test-dgram-bind-shared-ports28875 ---28876 duration_ms: 208.7610028877 ...28878ok 5672 sequential/test-dgram-implicit-bind-failure28879 ---28880 duration_ms: 69.4390028881 ...28882ok 5673 sequential/test-dgram-pingpong28883 ---28884 duration_ms: 86.5240028885 ...28886ok 5674 sequential/test-diagnostic-dir-cpu-prof28887 ---28888 duration_ms: 1607.0090028889 ...28890ok 5675 sequential/test-diagnostic-dir-heap-prof28891 ---28892 duration_ms: 1206.9460028893 ...28894ok 5676 sequential/test-dtls-interop-openssl-client # skip DTLS is not enabled28895 ---28896 duration_ms: 69.5430028897 ...28898ok 5677 sequential/test-dtls-interop-openssl-server # skip DTLS is not enabled28899 ---28900 duration_ms: 69.3090028901 ...28902ok 5678 sequential/test-error-serdes28903 ---28904 duration_ms: 69.3360028905 ...28906ok 5679 sequential/test-fs-opendir-recursive28907 ---28908 duration_ms: 134.2360028909 ...28910ok 5680 sequential/test-fs-readdir-recursive28911 ---28912 duration_ms: 86.4580028913 ...28914ok 5681 sequential/test-fs-stat-sync-overflow28915 ---28916 duration_ms: 167.4060028917 ...28918ok 5682 sequential/test-gc-http-client28919 ---28920 duration_ms: 506.4420028921 ...28922ok 5683 sequential/test-gc-http-client-onerror28923 ---28924 duration_ms: 506.3930028925 ...28926ok 5684 sequential/test-gc-http-client-timeout28927 ---28928 duration_ms: 406.3940028929 ...28930ok 5685 sequential/test-get-heapsnapshot-options28931 ---28932 duration_ms: 1006.9670028933 ...28934ok 5686 sequential/test-heapdump28935 ---28936 duration_ms: 506.3340028937 ...28938ok 5687 sequential/test-heapdump-flag28939 ---28940 duration_ms: 406.2270028941 ...28942ok 5688 sequential/test-heapdump-flag-custom-dir28943 ---28944 duration_ms: 406.3640028945 ...28946ok 5689 sequential/test-http-econnrefused28947 ---28948 duration_ms: 107.6980028949 ...28950ok 5690 sequential/test-http-keep-alive-large-write28951 ---28952 duration_ms: 107.6770028953 ...28954ok 5691 sequential/test-http-keepalive-maxsockets28955 ---28956 duration_ms: 406.2960028957 ...28958ok 5692 sequential/test-http-regr-gh-292828959 ---28960 duration_ms: 86.5260028961 ...28962ok 5693 sequential/test-http-server-keep-alive-timeout-slow-client-headers28963 ---28964 duration_ms: 1907.3500028965 ...28966ok 5694 sequential/test-http-server-keep-alive-timeout-slow-server28967 ---28968 duration_ms: 706.5000028969 ...28970ok 5695 sequential/test-http2-max-session-memory28971 ---28972 duration_ms: 86.4940028973 ...28974ok 5696 sequential/test-http2-ping-flood28975 ---28976 duration_ms: 107.7400028977 ...28978ok 5697 sequential/test-http2-settings-flood28979 ---28980 duration_ms: 107.4810028981 ...28982ok 5698 sequential/test-http2-timeout-large-write28983 ---28984 duration_ms: 2807.7760028985 ...28986ok 5699 sequential/test-http2-timeout-large-write-file28987 ---28988 duration_ms: 2808.1650028989 ...28990ok 5700 sequential/test-https-connect-localport28991 ---28992 duration_ms: 6210.8470028993 ...28994ok 5701 sequential/test-https-server-keep-alive-timeout28995 ---28996 duration_ms: 1807.3220028997 ...28998ok 5702 sequential/test-init28999 ---29000 duration_ms: 167.6160029001 ...29002ok 5703 sequential/test-inspector-network-resource29003 ---29004 duration_ms: 1507.0700029005 ...29006ok 5704 sequential/test-inspector-open-dispose29007 ---29008 duration_ms: 167.4460029009 ...29010ok 5705 sequential/test-inspector-port-cluster29011 ---29012 duration_ms: 406.4000029013 ...29014ok 5706 sequential/test-module-loading29015 ---29016 duration_ms: 86.5810029017 ...29018ok 5707 sequential/test-net-GH-550429019 ---29020 duration_ms: 260.5390029021 ...29022ok 5708 sequential/test-net-better-error-messages-port29023 ---29024 duration_ms: 86.5930029025 ...29026ok 5709 sequential/test-net-connect-econnrefused29027 ---29028 duration_ms: 134.3950029029 ...29030ok 5710 sequential/test-net-connect-handle-econnrefused29031 ---29032 duration_ms: 69.3610029033 ...29034ok 5711 sequential/test-net-connect-local-error29035 ---29036 duration_ms: 86.3600029037 ...29038ok 5712 sequential/test-net-listen-ipv6only29039 ---29040 duration_ms: 86.5160029041 ...29042ok 5713 sequential/test-net-listen-shared-ports29043 ---29044 duration_ms: 260.6760029045 ...29046ok 5714 sequential/test-net-localport29047 ---29048 duration_ms: 69.5040029049 ...29050ok 5715 sequential/test-net-reconnect-error29051 ---29052 duration_ms: 86.3620029053 ...29054ok 5716 sequential/test-net-response-size29055 ---29056 duration_ms: 1307.1580029057 ...29058ok 5717 sequential/test-net-server-address29059 ---29060 duration_ms: 69.4170029061 ...29062ok 5718 sequential/test-net-server-bind29063 ---29064 duration_ms: 208.7660029065 ...29066ok 5719 sequential/test-net-server-listen-ipv6-link-local29067 ---29068 duration_ms: 86.4680029069 ...29070ok 5720 sequential/test-next-tick-error-spin29071 ---29072 duration_ms: 134.1120029073 ...29074ok 5721 sequential/test-perf-hooks29075 ---29076 duration_ms: 1206.6120029077 ...29078ok 5722 sequential/test-performance-eventloopdelay29079 ---29080 duration_ms: 7209.5240029081 ...29082ok 5723 sequential/test-pipe29083 ---29084 duration_ms: 4309.8210029085 ...29086ok 5724 sequential/test-process-title29087 ---29088 duration_ms: 134.3410029089 ...29090ok 5725 sequential/test-process-warnings29091 ---29092 duration_ms: 134.3410029093 ...29094ok 5726 sequential/test-repl-timeout-throw29095 ---29096 duration_ms: 260.6910029097 ...29098ok 5727 sequential/test-require-cache-without-stat29099 ---29100 duration_ms: 69.4600029101 ...29102ok 5728 sequential/test-resolution-inspect-brk29103 ---29104 duration_ms: 107.5750029105 ...29106ok 5729 sequential/test-stream2-fs29107 ---29108 duration_ms: 86.3140029109 ...29110ok 5730 sequential/test-stream2-stderr-sync29111 ---29112 duration_ms: 134.2170029113 ...29114ok 5731 sequential/test-timers-block-eventloop29115 ---29116 duration_ms: 107.5400029117 ...29118ok 5732 sequential/test-timers-set-interval-excludes-callback-duration29119 ---29120 duration_ms: 506.4460029121 ...29122ok 5733 sequential/test-tls-connect29123 ---29124 duration_ms: 86.4460029125 ...29126ok 5734 sequential/test-tls-lookup29127 ---29128 duration_ms: 86.3530029129 ...29130ok 5735 sequential/test-tls-psk-client # skip missing openssl cli29131 ---29132 duration_ms: 69.3380029133 ...29134ok 5736 sequential/test-tls-session-timeout # skip node compiled without OpenSSL CLI.29135 ---29136 duration_ms: 86.2730029137 ...29138ok 5737 sequential/test-util-debug29139 ---29140 duration_ms: 325.3210029141 ...29142ok 5738 sequential/test-vm-break-on-sigint29143 ---29144 duration_ms: 134.1990029145 ...29146ok 5739 sequential/test-vm-timeout-escape-promise-module-229147 ---29148 duration_ms: 86.3120029149 ...29150ok 5740 sequential/test-vm-timeout-rethrow29151 ---29152 duration_ms: 167.3310029153 ...29154ok 5741 sequential/test-watch-mode-restart-esm-loading-error29155 ---29156 duration_ms: 2307.9450029157 ...29158ok 5742 sequential/test-watch-mode-watch-flags29159 ---29160 duration_ms: 325.4430029161 ...29162ok 5743 sequential/test-watch-mode-worker29163 ---29164 duration_ms: 2207.4750029165 ...29166ok 5744 sequential/test-without-async-context-frame29167 ---29168 duration_ms: 1207.3480029169 ...29170ok 5745 sequential/test-worker-eventlooputil29171 ---29172 duration_ms: 260.7280029173 ...29174ok 5746 sequential/test-worker-fshandles-error-on-termination29175 ---29176 duration_ms: 208.8150029177 ...29178ok 5747 sequential/test-worker-fshandles-open-close-on-termination29179 ---29180 duration_ms: 260.5940029181 ...29182ok 5748 sequential/test-worker-heapsnapshot-options29183 ---29184 duration_ms: 606.4460029185 ...29186ok 5749 sequential/test-worker-prof29187 ---29188 duration_ms: 1907.2200029189 ...29190ok 5750 sequential/test-write-heapsnapshot-options29191 ---29192 duration_ms: 1109.6720029193 ...29194ok 5751 sequential/test-zlib-crc32-fast-api29195 ---29196 duration_ms: 86.5280029197 ...29198ok 5752 known_issues/test-cli-print-var-crypto29199 ---29200 duration_ms: 167.4870029201 ...29202ok 5753 known_issues/test-cwd-enoent-file29203 ---29204 duration_ms: 134.1000029205 ...29206ok 5754 known_issues/test-dgram-bind-shared-ports-after-port-029207 ---29208 duration_ms: 208.6670029209 ...29210ok 5755 known_issues/test-fs-cp-async-buffer29211 ---29212 duration_ms: 69.3840029213 ...29214ok 5756 known_issues/test-fs-cp-filter29215 ---29216 duration_ms: 69.3200029217 ...29218ok 5757 known_issues/test-fs-cp-non-utf829219 ---29220 duration_ms: 69.3740029221 ...29222ok 5758 known_issues/test-fs-writeFileSync-invalid-windows29223 ---29224 duration_ms: 69.4210029225 ...29226ok 5759 known_issues/test-http-clientrequest-end-contentlength29227 ---29228 duration_ms: 86.4990029229 ...29230ok 5760 known_issues/test-http-clientrequest-end-empty-response-body29231 ---29232 duration_ms: 86.3590029233 ...29234ok 5761 known_issues/test-http-clientrequest-write-chunked29235 ---29236 duration_ms: 86.5620029237 ...29238ok 5762 known_issues/test-http-path-contains-unicode29239 ---29240 duration_ms: 69.4440029241 ...29242ok 5763 known_issues/test-inspector-cluster-port-clash29243 ---29244 duration_ms: 167.3550029245 ...29246ok 5764 known_issues/test-inspector-instrumentation-breakpoint29247 ---29248 duration_ms: 15317.4900029249 ...29250ok 5765 known_issues/test-repl-require-context29251 ---29252 duration_ms: 107.6400029253 ...29254ok 5766 known_issues/test-stdin-is-always-net.socket29255 ---29256 duration_ms: 167.2950029257 ...29258ok 5767 known_issues/test-stream-writable-sync-error29259 ---29260 duration_ms: 69.2660029261 ...29262ok 5768 known_issues/test-url-parse-conformance29263 ---29264 duration_ms: 86.2740029265 ...29266ok 5769 known_issues/test-vm-function-declaration-uses-define29267 ---29268 duration_ms: 69.2180029269 ...29270ok 5770 known_issues/test-vm-timeout-escape-nexttick29271 ---29272 duration_ms: 806.4210029273 ...2927429275Failed tests:29276out/Release/node /build/node-v26.9.0/test/parallel/test-fs-cp-async-file-modes.mjs29277make: *** [Makefile:631: test-ci-js] Error 1