nodejs-slim-26.9.0
checks.x86_64-linux.nixos-test-machine
· build #181
· raw
1structuredAttrs is enabled
unpackPhase
2unpacking source archive /nix/store/7ajvk1c4mspigbdgf21bn9d7f7p9kmgk-node-v26.9.0.tar.xz3source root is node-v26.9.04setting SOURCE_DATE_EPOCH to timestamp 1789550914 of file "node-v26.9.0/tools/nix/v8.nix"patchPhase
5applying patch /nix/store/j4p9lc7z8hi4g40cpqpj3qxb9a7bvanp-configure-armv6-vfpv2.patch6patching file configure.py7Hunk #1 succeeded at 49 with fuzz 1 (offset -1 lines).8applying patch /nix/store/igz0qnjkvwi4f2mn7i13h3ndxl9n5ryi-node-npm-build-npm-package-logic.patch9patching file deps/npm/node_modules/@npmcli/run-script/lib/set-path.js10Hunk #1 succeeded at 13 with fuzz 2 (offset 1 line).11Hunk #2 succeeded at 37 (offset 8 lines).12patching file deps/npm/node_modules/pacote/lib/git.js13Hunk #1 succeeded at 186 (offset -2 lines).14patching file deps/npm/node_modules/@npmcli/arborist/lib/arborist/build-ideal-tree.js15Hunk #1 succeeded at 802 (offset 62 lines).16patching file deps/npm/node_modules/@npmcli/arborist/lib/arborist/load-actual.js17Hunk #1 succeeded at 121 with fuzz 1 (offset -26 lines).18applying patch /nix/store/57n0csr7hpdd0y91ljxpiwlfw7fsx3kl-use-correct-env-in-tests.patch19patching file test/parallel/test-child-process-default-options.js20patching file test/parallel/test-child-process-env.js21patching file test/parallel/test-child-process-exec-env.js22applying patch /nix/store/p2mhv95s89kaqmdynhz6y6asalf8y4dh-bin-sh-node-run-v22.patch23patching file test/fixtures/run-script/node_modules/.bin/positional-args24Hunk #1 succeeded at 1 with fuzz 1.25applying patch /nix/store/3za8p3x3hjfr1a9b1lc3z4aapp9sm2ja-use-nix-codesign.patch26patching file test/parallel/test-macos-app-sandbox.js27applying patch /nix/store/6whc7i794ygkcwjwrprw7y9aglfl238g-fix-temporal-integration-with-shared-icu.patch28patching file deps/v8/src/objects/js-temporal-zoneinfo64.cc29patching file tools/v8_gypfiles/v8.gyp30Hunk #1 succeeded at 1398 (offset 19 lines).31Hunk #2 succeeded at 2051 (offset 93 lines).updateAutotoolsGnuConfigScriptsPhase
32Updating Autotools / GNU config script to a newer upstream version: ./deps/cares/config/config.sub33Updating Autotools / GNU config script to a newer upstream version: ./deps/libffi/config.sub34Updating Autotools / GNU config script to a newer upstream version: ./deps/ngtcp2/ngtcp2/third-party/libev/config.sub35Updating Autotools / GNU config script to a newer upstream version: ./deps/cares/config/config.guess36Updating Autotools / GNU config script to a newer upstream version: ./deps/libffi/config.guess37Updating Autotools / GNU config script to a newer upstream version: ./deps/ngtcp2/ngtcp2/third-party/libev/config.guessconfigurePhase
38fixing libtool script ./deps/cares/config/ltmain.sh39fixing libtool script ./deps/libffi/ltmain.sh40fixing libtool script ./deps/ngtcp2/ngtcp2/third-party/libev/ltmain.sh41./deps/cares/configure42./deps/libffi/configure43./deps/ngtcp2/ngtcp2/third-party/libev/configure44configure flags: --prefix=/nix/store/mn8r5sjblqmigxv5lg89q4wcj5zqb16n-nodejs-slim-26.9.0 --ninja --with-intl=system-icu --openssl-use-def-ca-store --no-cross-compiling --dest-os=linux --dest-cpu=x64 --v8-enable-temporal-support --use-prefix-to-find-headers --shared-abseil --shared-abseil-libpath=/nix/store/iqvb7h1ykhm12304qwx17xbncrhhy1g4-abseil-cpp-20260107.1/lib --shared-ada --shared-ada-libpath=/nix/store/vk3yq4nzlrdvq1qxgy3764qaycanr0mc-ada-4.0.0/lib --shared-brotli --shared-brotli-libpath=/nix/store/xhgd6rb4h8ssid9yw8nvw74cwq69md5y-brotli-1.2.0-lib/lib --shared-cares --shared-cares-libpath=/nix/store/68syfccdbv3hlz7imlc9xl9fzyz4v8gx-c-ares-1.34.8/lib --shared-ffi --shared-ffi-libpath=/nix/store/3r5wfb1dl3sfknvy1yringvmap0hxj4r-libffi-3.8.0/lib --shared-gtest --shared-gtest-libpath=/nix/store/5sdsmm8s00hck28yp95fk993rg42mqsp-gtest-1.18.0/lib --shared-hdr-histogram --shared-hdr-histogram-libpath=/nix/store/9g532g9jf92xy9xh68p99ml815q11zs0-hdrhistogram_c-0.11.10/lib --shared-highway --shared-highway-libpath=/nix/store/xs1jbkdzxs4ym0rh89nx8xfwj387x3aj-libhwy-1.4.0/lib --shared-http-parser --shared-http-parser-libpath=/nix/store/1lw7d9jsv7qb6nvc4fmvvqsyphaacqcs-llhttp-9.4.3/lib --shared-libuv --shared-libuv-libpath=/nix/store/68b1blnvl4scgdq48d4p7h4lw4pm5w0w-libuv-1.52.1/lib --shared-lief --shared-lief-libpath=/nix/store/nx4g3j20wvgq36b406q6rysvqzzrxaci-lief-0.17.6/lib --shared-merve --shared-merve-libpath=/nix/store/2gj58j8rd88kaan7bsqhl9fjxxp11qqi-merve-1.2.2/lib --shared-nbytes --shared-nbytes-libpath=/nix/store/zf8c839ahp1fn736lih7ai2y14rrx2gn-nbytes-0.1.4/lib --shared-nghttp2 --shared-nghttp2-libpath=/nix/store/6avzrsm02jh7q48ym3hgznj3ypc2shc2-nghttp2-1.70.0-lib/lib --shared-nghttp3 --shared-nghttp3-libpath=/nix/store/dki4fkk75v2x4aqkszmi257wxq6rkkyr-nghttp3-1.16.0/lib --shared-ngtcp2 --shared-ngtcp2-libpath=/nix/store/2hc131frgdz45bjbajmpvlrj185lah7p-ngtcp2-1.23.0/lib --shared-openssl --shared-openssl-libpath=/nix/store/yj34vymbqf7mf4lmffipy8jqc4kwr1mc-openssl-3.6.4/lib --shared-simdjson --shared-simdjson-libpath=/nix/store/129shchmqszagbb0m8kk7ddzb7nnklxv-simdjson-4.6.8/lib --shared-simdutf --shared-simdutf-libpath=/nix/store/dw6xlar7m4qfrhbk63zhcc5pmixa1ga1-simdutf-9.1.0/lib --shared-sqlite --shared-sqlite-libpath=/nix/store/7a0nx1a0rdc5s07vxrsdhplqnzncl5z9-sqlite-3.53.3/lib --shared-temporal_capi --shared-temporal_capi-libpath=/nix/store/7hrx4vyx67h46xxwqj3zw4nafa1m8d04-temporal_capi-0.2.6/lib --shared-uvwasi --shared-uvwasi-libpath=/nix/store/qnbgx63w8yya5330xcxyixja3ah6gfzm-uvwasi-0.0.23/lib --shared-zlib --shared-zlib-libpath=/nix/store/lw86vj9kfwgvlivg3p8qg2nibpmhmsl9-zlib-1.3.2/lib --shared-zstd --shared-zstd-libpath=/nix/store/8ik1d1r4l2jzm9mjh6bc0a13yczx62wg-zstd-1.5.7/lib45INFO: configure completed successfullybuildPhase
46build flags: -j32 SHELL=/nix/store/svx59425zxp552p2b8gm11qj5r09b56i-bash-5.3p15/bin/bash47TERM=dumb ninja -C out/Release -j3248ninja: Entering directory `out/Release'49[1/1871] CXX obj/deps/v8/src/base/v8_libbase.abort-mode.o50[2/1871] CXX obj/deps/v8/src/base/v8_libbase.fpu.o51[3/1871] CXX obj/deps/v8/src/base/v8_libbase.once.o52[4/1871] CXX obj/deps/v8/src/base/v8_libbase.bits.o53[5/1871] CXX obj/deps/v8/src/base/v8_libbase.sys-info.o54[6/1871] CXX obj/deps/v8/src/base/v8_libbase.division-by-constant.o55[7/1871] CXX obj/deps/v8/src/base/v8_libbase.cpu.o56[8/1871] CXX obj/deps/v8/src/base/debug/v8_libbase.stack_trace.o57[9/1871] CXX obj/deps/v8/src/base/numbers/v8_libbase.diy-fp.o58[10/1871] CXX obj/deps/v8/src/base/numbers/v8_libbase.cached-powers.o59[11/1871] CXX obj/deps/v8/src/base/platform/v8_libbase.platform.o60[12/1871] CXX obj/deps/v8/src/base/platform/v8_libbase.semaphore.o61[13/1871] CXX obj/deps/v8/src/base/platform/v8_libbase.memory-protection-key.o62[14/1871] CXX obj/deps/v8/src/base/numbers/v8_libbase.dtoa.o63[15/1871] CXX obj/deps/v8/src/base/v8_libbase.file-utils.o64[16/1871] CXX obj/deps/v8/src/base/sanitizer/v8_libbase.lsan-page-allocator.o65[17/1871] CXX obj/deps/v8/src/base/v8_libbase.page-allocator.o66[18/1871] CXX obj/deps/v8/src/base/v8_libbase.strings.o67[19/1871] CXX obj/deps/v8/src/base/numbers/v8_libbase.bignum-dtoa.o68[20/1871] CXX obj/deps/v8/src/base/sanitizer/v8_libbase.lsan-virtual-address-space.o69[21/1871] CXX obj/deps/v8/src/base/v8_libbase.region-allocator.o70[22/1871] CXX obj/deps/v8/src/base/numbers/v8_libbase.strtod.o71[23/1871] CXX obj/deps/v8/src/base/numbers/v8_libbase.bignum.o72[24/1871] CXX obj/deps/v8/src/base/numbers/v8_libbase.fixed-dtoa.o73[25/1871] CXX obj/deps/v8/src/base/numbers/v8_libbase.fast-dtoa.o74[26/1871] CXX obj/deps/v8/src/base/v8_libbase.ieee754.o75[27/1871] CXX obj/deps/v8/src/base/v8_libbase.vlq-base64.o76[28/1871] CXX obj/deps/v8/src/base/platform/v8_libbase.condition-variable.o77[29/1871] CXX obj/deps/v8/src/base/v8_libbase.logging.o78[30/1871] CXX obj/deps/v8/src/base/platform/v8_libbase.time.o79[31/1871] CXX obj/deps/v8/src/base/platform/v8_libbase.mutex.o80[32/1871] CXX obj/deps/v8/src/base/platform/v8_libbase.platform-posix-time.o81[33/1871] CXX obj/deps/v8/src/base/v8_libbase.emulated-virtual-address-subspace.o82[34/1871] CXX obj/deps/v8/src/base/v8_libbase.bounded-page-allocator.o83[35/1871] CXX obj/deps/v8/src/base/platform/v8_libbase.platform-linux.o84[36/1871] CXX obj/deps/v8/src/base/debug/v8_libbase.stack_trace_posix.o85[37/1871] CXX obj/deps/v8/src/base/v8_libbase.virtual-address-space-page-allocator.o86[38/1871] CXX obj/deps/v8/src/base/utils/v8_libbase.random-number-generator.o87[39/1871] ACTION Checking inspector protocol compatibility88[40/1871] CXX obj/deps/v8/src/base/v8_libbase.virtual-address-space.o89[41/1871] ACTION Generating temporal zoneinfo static data90[42/1871] CXX obj/deps/v8/src/torque/torque_base.source-positions.o91[43/1871] CC obj/deps/v8/third_party/zlib/v8_zlib.compress.o92cc1: warning: command-line option '-fvisibility-inlines-hidden' is valid for C++/ObjC++ but not for C93[44/1871] CC obj/deps/v8/third_party/zlib/v8_zlib.adler32.o94cc1: warning: command-line option '-fvisibility-inlines-hidden' is valid for C++/ObjC++ but not for C95[45/1871] CC obj/deps/v8/third_party/zlib/v8_zlib.cpu_features.o96cc1: warning: command-line option '-fvisibility-inlines-hidden' is valid for C++/ObjC++ but not for C97[46/1871] CXX obj/deps/v8/src/base/platform/v8_libbase.platform-posix.o98[47/1871] AR obj/tools/v8_gypfiles/libv8_libbase.a99[48/1871] STAMP obj/tools/v8_gypfiles/v8_flags.actions_depends.stamp100[49/1871] ACTION Generating inspector protocol sources from protocol json101[50/1871] STAMP obj/tools/v8_gypfiles/v8_inspector_headers.actions_rules_copies.stamp102[51/1871] CC obj/deps/v8/third_party/zlib/v8_zlib.gzclose.o103cc1: warning: command-line option '-fvisibility-inlines-hidden' is valid for C++/ObjC++ but not for C104[52/1871] CXX obj/deps/v8/src/torque/torque_base.cpp-builder.o105[53/1871] CC obj/deps/v8/third_party/zlib/v8_zlib.crc32.o106cc1: warning: command-line option '-fvisibility-inlines-hidden' is valid for C++/ObjC++ but not for C107[54/1871] CC obj/deps/v8/third_party/zlib/v8_zlib.gzlib.o108cc1: warning: command-line option '-fvisibility-inlines-hidden' is valid for C++/ObjC++ but not for C109[55/1871] CXX obj/deps/v8/src/interpreter/bytecode_builtins_list_generator.bytecode-operands.o110[56/1871] CC obj/deps/v8/third_party/zlib/v8_zlib.gzread.o111cc1: warning: command-line option '-fvisibility-inlines-hidden' is valid for C++/ObjC++ but not for C112[57/1871] CC obj/deps/v8/third_party/zlib/v8_zlib.gzwrite.o113cc1: warning: command-line option '-fvisibility-inlines-hidden' is valid for C++/ObjC++ but not for C114[58/1871] CXX obj/deps/v8/src/builtins/bytecode_builtins_list_generator.generate-bytecodes-builtins-list.o115[59/1871] CC obj/deps/v8/third_party/zlib/v8_zlib.uncompr.o116cc1: warning: command-line option '-fvisibility-inlines-hidden' is valid for C++/ObjC++ but not for C117[60/1871] CC obj/deps/v8/third_party/zlib/v8_zlib.inftrees.o118cc1: warning: command-line option '-fvisibility-inlines-hidden' is valid for C++/ObjC++ but not for C119[61/1871] CC obj/deps/v8/third_party/zlib/v8_zlib.inffast.o120cc1: warning: command-line option '-fvisibility-inlines-hidden' is valid for C++/ObjC++ but not for C121[62/1871] CC obj/deps/v8/third_party/zlib/v8_zlib.infback.o122cc1: warning: command-line option '-fvisibility-inlines-hidden' is valid for C++/ObjC++ but not for C123[63/1871] CC obj/deps/v8/third_party/zlib/v8_zlib.zutil.o124cc1: warning: command-line option '-fvisibility-inlines-hidden' is valid for C++/ObjC++ but not for C125[64/1871] CXX obj/deps/v8/src/interpreter/bytecode_builtins_list_generator.bytecodes.o126[65/1871] CXX obj/deps/v8/third_party/zlib/google/v8_zlib.compression_utils_portable.o127[66/1871] CC obj/deps/v8/third_party/zlib/v8_zlib.deflate.o128cc1: warning: command-line option '-fvisibility-inlines-hidden' is valid for C++/ObjC++ but not for C129[67/1871] CXX obj/deps/v8/src/torque/torque_base.global-context.o130[68/1871] CXX obj/deps/v8/src/torque/torque_base.torque-code-generator.o131[69/1871] CC obj/deps/v8/third_party/zlib/v8_zlib.trees.o132cc1: warning: command-line option '-fvisibility-inlines-hidden' is valid for C++/ObjC++ but not for C133[70/1871] CXX obj/deps/v8/src/regexp/gen-regexp-special-case.gen-regexp-special-case.o134[71/1871] CC obj/deps/v8/third_party/zlib/v8_zlib.inflate.o135cc1: warning: command-line option '-fvisibility-inlines-hidden' is valid for C++/ObjC++ but not for C136[72/1871] LINK bytecode_builtins_list_generator137[73/1871] ACTION generate_bytecode_builtins_list: generate_bytecode_builtins_list_action_73a03d1964edbe79fc19deb968fa21d5c456544c3d095b62158c8959ed2aeed1138[74/1871] CXX obj/deps/v8/src/torque/torque_base.earley-parser.o139[75/1871] CXX obj/deps/v8/src/torque/torque_base.type-inference.o140[76/1871] CXX obj/deps/v8/src/torque/torque_base.declarable.o141[77/1871] LINK gen-regexp-special-case142[78/1871] ACTION run_gen-regexp-special-case: run_gen-regexp-special-case_action_72d03329d19e24c609ee6e65eeeb110034e9261c37b8a8d83522628d574e9fa7143[79/1871] CXX obj/deps/v8/src/torque/torque_base.server-data.o144[80/1871] CXX obj/deps/v8/src/torque/torque_base.type-oracle.o145[81/1871] CXX obj/deps/v8/src/torque/torque_base.kythe-data.o146[82/1871] CXX obj/deps/v8/src/libplatform/v8_libplatform.default-thread-isolated-allocator.o147[83/1871] AR obj/tools/v8_gypfiles/libv8_zlib.a148[84/1871] CXX obj/deps/v8/src/torque/torque_base.utils.o149[85/1871] CXX obj/src/node_js2c.embedded_data.o150[86/1871] CXX obj/deps/v8/src/libplatform/tracing/v8_libplatform.trace-config.o151[87/1871] CXX obj/deps/v8/src/libplatform/tracing/v8_libplatform.trace-object.o152[88/1871] CXX obj/src/node_js2c.builtin_info.o153[89/1871] CXX obj/deps/v8/src/torque/torque_base.cfg.o154[90/1871] CXX obj/deps/v8/src/libplatform/tracing/v8_libplatform.trace-writer.o155[91/1871] CXX obj/deps/v8/src/libplatform/v8_libplatform.default-job.o156[92/1871] CXX obj/deps/v8/src/libplatform/v8_libplatform.task-queue.o157[93/1871] CXX obj/deps/v8/src/libplatform/tracing/v8_libplatform.trace-buffer.o158[94/1871] CXX obj/deps/ncrypto/ncrypto_engine.engine.o159[95/1871] CXX obj/deps/v8/src/libplatform/v8_libplatform.delayed-task-queue.o160[96/1871] AR obj/deps/ncrypto/libncrypto_engine.a161[97/1871] CC obj/test/nop/nop.nop.o162[98/1871] CXX obj/deps/v8/src/libplatform/v8_libplatform.default-worker-threads-task-runner.o163[99/1871] CC obj/test/overlapped-checker/overlapped-checker.main_unix.o164[100/1871] CXX obj/deps/v8/src/torque/torque_base.cc-generator.o165[101/1871] CXX obj/deps/inspector_protocol/crdtp/crdtp.error_support.o166[102/1871] CXX obj/deps/v8/src/torque/torque_base.class-debug-reader-generator.o167[103/1871] CXX obj/deps/v8/src/libplatform/v8_libplatform.default-platform.o168[104/1871] LINK nop169[105/1871] CXX obj/deps/inspector_protocol/crdtp/crdtp.json_platform.o170[106/1871] CXX obj/deps/v8/src/torque/torque.torque.o171[107/1871] CXX obj/deps/v8/src/libplatform/v8_libplatform.worker-thread.o172[108/1871] CXX obj/deps/inspector_protocol/crdtp/crdtp.span.o173[109/1871] CXX obj/deps/v8/src/torque/torque_base.instance-type-generator.o174[110/1871] CXX obj/deps/inspector_protocol/crdtp/crdtp.serializable.o175[111/1871] LINK overlapped-checker176[112/1871] CXX obj/deps/inspector_protocol/crdtp/crdtp.status.o177[113/1871] CXX obj/deps/v8/src/libplatform/v8_libplatform.default-foreground-task-runner.o178[114/1871] CXX obj/deps/v8/src/libplatform/tracing/v8_libplatform.tracing-controller.o179[115/1871] AR obj/tools/v8_gypfiles/libv8_libplatform.a180[116/1871] CXX obj/deps/v8/src/torque/torque_base.instructions.o181[117/1871] CXX obj/deps/v8/src/torque/torque_base.declarations.o182[118/1871] CXX obj/deps/v8/src/torque/torque_base.csa-generator.o183[119/1871] CXX obj/deps/inspector_protocol/crdtp/crdtp.protocol_core.o184[120/1871] CXX obj/deps/inspector_protocol/crdtp/crdtp.cbor.o185[121/1871] CXX obj/deps/v8/src/torque/torque_base.declaration-visitor.o186[122/1871] CXX obj/deps/inspector_protocol/crdtp/crdtp.dispatch.o187[123/1871] CXX obj/deps/v8/src/torque/torque_base.torque-compiler.o188[124/1871] CXX obj/tools/node_js2c.js2c.o189[125/1871] CXX obj/deps/v8/src/torque/torque_base.type-visitor.o190[126/1871] LINK node_js2c191[127/1871] STAMP obj/node_base.actions_depends.stamp192[128/1871] ACTION node_base: convert_node_protocol_to_json_f26a10641803f604d1307d23f68bde8b450ad8f073bd43313642df31e7a3478c193[129/1871] ACTION node_base: node_js2c_f26a10641803f604d1307d23f68bde8b450ad8f073bd43313642df31e7a3478c194[130/1871] ACTION node_base: concatenate_protocols_f26a10641803f604d1307d23f68bde8b450ad8f073bd43313642df31e7a3478c195[131/1871] ACTION node_base: v8_inspector_compress_protocol_json_f26a10641803f604d1307d23f68bde8b450ad8f073bd43313642df31e7a3478c196[132/1871] ACTION Generating node protocol sources from protocol json197[133/1871] STAMP obj/node_base.actions_rules_copies.stamp198[134/1871] CXX obj/deps/inspector_protocol/crdtp/crdtp.json.o199[135/1871] CXX obj/deps/v8/src/torque/torque_base.types.o200[136/1871] CXX obj/src/node_base.builtin_info.o201[137/1871] CXX obj/src/api/node_base.utils.o202[138/1871] CXX obj/src/node_base.embedded_data.o203[139/1871] CXX obj/deps/ncrypto/ncrypto.ncrypto.o204[140/1871] CXX obj/src/node_base.cleanup_queue.o205In file included from ../../src/memory_tracker.h:6,206 from ../../src/cleanup_queue.h:11,207 from ../../src/cleanup_queue.cc:1:208../../deps/v8/include/v8-profiler.h: In constructor 'v8::HeapProfiler::HeapSnapshotOptions::HeapSnapshotOptions()':209../../deps/v8/include/v8-profiler.h:1128:27: warning: 'v8::HeapProfiler::HeapSnapshotOptions::global_object_name_resolver' is deprecated: Use context_name_resolver callback instead. [-Wdeprecated-declarations]210 1128 | HeapSnapshotOptions() {}211 | ^212../../deps/v8/include/v8-profiler.h:1142:25: note: declared here213 1142 | ObjectNameResolver* global_object_name_resolver = nullptr;214 | ^~~~~~~~~~~~~~~~~~~~~~~~~~~215../../deps/v8/include/v8-profiler.h:1128:27: warning: 'v8::HeapProfiler::HeapSnapshotOptions::global_object_name_resolver' is deprecated: Use context_name_resolver callback instead. [-Wdeprecated-declarations]216 1128 | HeapSnapshotOptions() {}217 | ^218../../deps/v8/include/v8-profiler.h:1142:25: note: declared here219 1142 | ObjectNameResolver* global_object_name_resolver = nullptr;220 | ^~~~~~~~~~~~~~~~~~~~~~~~~~~221[141/1871] CXX obj/gen/src/node/inspector/protocol/node_base.NodeRuntime.o222In file included from ../../src/util.h:29,223 from ../../src/inspector/node_string.h:10,224 from gen/src/node/inspector/protocol/Forward.h:19,225 from gen/src/node/inspector/protocol/Protocol.h:18,226 from gen/src/node/inspector/protocol/NodeRuntime.h:10,227 from gen/src/node/inspector/protocol/NodeRuntime.cpp:7:228../../deps/v8/include/v8-profiler.h: In constructor 'v8::HeapProfiler::HeapSnapshotOptions::HeapSnapshotOptions()':229../../deps/v8/include/v8-profiler.h:1128:27: warning: 'v8::HeapProfiler::HeapSnapshotOptions::global_object_name_resolver' is deprecated: Use context_name_resolver callback instead. [-Wdeprecated-declarations]230 1128 | HeapSnapshotOptions() {}231 | ^232../../deps/v8/include/v8-profiler.h:1142:25: note: declared here233 1142 | ObjectNameResolver* global_object_name_resolver = nullptr;234 | ^~~~~~~~~~~~~~~~~~~~~~~~~~~235../../deps/v8/include/v8-profiler.h:1128:27: warning: 'v8::HeapProfiler::HeapSnapshotOptions::global_object_name_resolver' is deprecated: Use context_name_resolver callback instead. [-Wdeprecated-declarations]236 1128 | HeapSnapshotOptions() {}237 | ^238../../deps/v8/include/v8-profiler.h:1142:25: note: declared here239 1142 | ObjectNameResolver* global_object_name_resolver = nullptr;240 | ^~~~~~~~~~~~~~~~~~~~~~~~~~~241[142/1871] CXX obj/gen/src/node/inspector/protocol/node_base.Storage.o242In file included from ../../src/util.h:29,243 from ../../src/inspector/node_string.h:10,244 from gen/src/node/inspector/protocol/Forward.h:19,245 from gen/src/node/inspector/protocol/Protocol.h:18,246 from gen/src/node/inspector/protocol/Storage.h:10,247 from gen/src/node/inspector/protocol/Storage.cpp:7:248../../deps/v8/include/v8-profiler.h: In constructor 'v8::HeapProfiler::HeapSnapshotOptions::HeapSnapshotOptions()':249../../deps/v8/include/v8-profiler.h:1128:27: warning: 'v8::HeapProfiler::HeapSnapshotOptions::global_object_name_resolver' is deprecated: Use context_name_resolver callback instead. [-Wdeprecated-declarations]250 1128 | HeapSnapshotOptions() {}251 | ^252../../deps/v8/include/v8-profiler.h:1142:25: note: declared here253 1142 | ObjectNameResolver* global_object_name_resolver = nullptr;254 | ^~~~~~~~~~~~~~~~~~~~~~~~~~~255../../deps/v8/include/v8-profiler.h:1128:27: warning: 'v8::HeapProfiler::HeapSnapshotOptions::global_object_name_resolver' is deprecated: Use context_name_resolver callback instead. [-Wdeprecated-declarations]256 1128 | HeapSnapshotOptions() {}257 | ^258../../deps/v8/include/v8-profiler.h:1142:25: note: declared here259 1142 | ObjectNameResolver* global_object_name_resolver = nullptr;260 | ^~~~~~~~~~~~~~~~~~~~~~~~~~~261[143/1871] CXX obj/gen/src/node/inspector/protocol/node_base.Target.o262In file included from ../../src/util.h:29,263 from ../../src/inspector/node_string.h:10,264 from gen/src/node/inspector/protocol/Forward.h:19,265 from gen/src/node/inspector/protocol/Protocol.h:18,266 from gen/src/node/inspector/protocol/Target.h:10,267 from gen/src/node/inspector/protocol/Target.cpp:7:268../../deps/v8/include/v8-profiler.h: In constructor 'v8::HeapProfiler::HeapSnapshotOptions::HeapSnapshotOptions()':269../../deps/v8/include/v8-profiler.h:1128:27: warning: 'v8::HeapProfiler::HeapSnapshotOptions::global_object_name_resolver' is deprecated: Use context_name_resolver callback instead. [-Wdeprecated-declarations]270 1128 | HeapSnapshotOptions() {}271 | ^272../../deps/v8/include/v8-profiler.h:1142:25: note: declared here273 1142 | ObjectNameResolver* global_object_name_resolver = nullptr;274 | ^~~~~~~~~~~~~~~~~~~~~~~~~~~275../../deps/v8/include/v8-profiler.h:1128:27: warning: 'v8::HeapProfiler::HeapSnapshotOptions::global_object_name_resolver' is deprecated: Use context_name_resolver callback instead. [-Wdeprecated-declarations]276 1128 | HeapSnapshotOptions() {}277 | ^278../../deps/v8/include/v8-profiler.h:1142:25: note: declared here279 1142 | ObjectNameResolver* global_object_name_resolver = nullptr;280 | ^~~~~~~~~~~~~~~~~~~~~~~~~~~281[144/1871] CXX obj/gen/src/node/inspector/protocol/node_base.NodeWorker.o282In file included from ../../src/util.h:29,283 from ../../src/inspector/node_string.h:10,284 from gen/src/node/inspector/protocol/Forward.h:19,285 from gen/src/node/inspector/protocol/Protocol.h:18,286 from gen/src/node/inspector/protocol/NodeWorker.h:10,287 from gen/src/node/inspector/protocol/NodeWorker.cpp:7:288../../deps/v8/include/v8-profiler.h: In constructor 'v8::HeapProfiler::HeapSnapshotOptions::HeapSnapshotOptions()':289../../deps/v8/include/v8-profiler.h:1128:27: warning: 'v8::HeapProfiler::HeapSnapshotOptions::global_object_name_resolver' is deprecated: Use context_name_resolver callback instead. [-Wdeprecated-declarations]290 1128 | HeapSnapshotOptions() {}291 | ^292../../deps/v8/include/v8-profiler.h:1142:25: note: declared here293 1142 | ObjectNameResolver* global_object_name_resolver = nullptr;294 | ^~~~~~~~~~~~~~~~~~~~~~~~~~~295../../deps/v8/include/v8-profiler.h:1128:27: warning: 'v8::HeapProfiler::HeapSnapshotOptions::global_object_name_resolver' is deprecated: Use context_name_resolver callback instead. [-Wdeprecated-declarations]296 1128 | HeapSnapshotOptions() {}297 | ^298../../deps/v8/include/v8-profiler.h:1142:25: note: declared here299 1142 | ObjectNameResolver* global_object_name_resolver = nullptr;300 | ^~~~~~~~~~~~~~~~~~~~~~~~~~~301[145/1871] CXX obj/gen/src/node/inspector/protocol/node_base.IO.o302In file included from ../../src/util.h:29,303 from ../../src/inspector/node_string.h:10,304 from gen/src/node/inspector/protocol/Forward.h:19,305 from gen/src/node/inspector/protocol/Protocol.h:18,306 from gen/src/node/inspector/protocol/IO.h:10,307 from gen/src/node/inspector/protocol/IO.cpp:7:308../../deps/v8/include/v8-profiler.h: In constructor 'v8::HeapProfiler::HeapSnapshotOptions::HeapSnapshotOptions()':309../../deps/v8/include/v8-profiler.h:1128:27: warning: 'v8::HeapProfiler::HeapSnapshotOptions::global_object_name_resolver' is deprecated: Use context_name_resolver callback instead. [-Wdeprecated-declarations]310 1128 | HeapSnapshotOptions() {}311 | ^312../../deps/v8/include/v8-profiler.h:1142:25: note: declared here313 1142 | ObjectNameResolver* global_object_name_resolver = nullptr;314 | ^~~~~~~~~~~~~~~~~~~~~~~~~~~315../../deps/v8/include/v8-profiler.h:1128:27: warning: 'v8::HeapProfiler::HeapSnapshotOptions::global_object_name_resolver' is deprecated: Use context_name_resolver callback instead. [-Wdeprecated-declarations]316 1128 | HeapSnapshotOptions() {}317 | ^318../../deps/v8/include/v8-profiler.h:1142:25: note: declared here319 1142 | ObjectNameResolver* global_object_name_resolver = nullptr;320 | ^~~~~~~~~~~~~~~~~~~~~~~~~~~321[146/1871] CXX obj/gen/src/node/inspector/protocol/node_base.NodeTracing.o322In file included from ../../src/util.h:29,323 from ../../src/inspector/node_string.h:10,324 from gen/src/node/inspector/protocol/Forward.h:19,325 from gen/src/node/inspector/protocol/Protocol.h:18,326 from gen/src/node/inspector/protocol/NodeTracing.h:10,327 from gen/src/node/inspector/protocol/NodeTracing.cpp:7:328../../deps/v8/include/v8-profiler.h: In constructor 'v8::HeapProfiler::HeapSnapshotOptions::HeapSnapshotOptions()':329../../deps/v8/include/v8-profiler.h:1128:27: warning: 'v8::HeapProfiler::HeapSnapshotOptions::global_object_name_resolver' is deprecated: Use context_name_resolver callback instead. [-Wdeprecated-declarations]330 1128 | HeapSnapshotOptions() {}331 | ^332../../deps/v8/include/v8-profiler.h:1142:25: note: declared here333 1142 | ObjectNameResolver* global_object_name_resolver = nullptr;334 | ^~~~~~~~~~~~~~~~~~~~~~~~~~~335../../deps/v8/include/v8-profiler.h:1128:27: warning: 'v8::HeapProfiler::HeapSnapshotOptions::global_object_name_resolver' is deprecated: Use context_name_resolver callback instead. [-Wdeprecated-declarations]336 1128 | HeapSnapshotOptions() {}337 | ^338../../deps/v8/include/v8-profiler.h:1142:25: note: declared here339 1142 | ObjectNameResolver* global_object_name_resolver = nullptr;340 | ^~~~~~~~~~~~~~~~~~~~~~~~~~~341[147/1871] CXX obj/gen/src/node/inspector/protocol/node_base.DOMStorage.o342In file included from ../../src/util.h:29,343 from ../../src/inspector/node_string.h:10,344 from gen/src/node/inspector/protocol/Forward.h:19,345 from gen/src/node/inspector/protocol/Protocol.h:18,346 from gen/src/node/inspector/protocol/DOMStorage.h:10,347 from gen/src/node/inspector/protocol/DOMStorage.cpp:7:348../../deps/v8/include/v8-profiler.h: In constructor 'v8::HeapProfiler::HeapSnapshotOptions::HeapSnapshotOptions()':349../../deps/v8/include/v8-profiler.h:1128:27: warning: 'v8::HeapProfiler::HeapSnapshotOptions::global_object_name_resolver' is deprecated: Use context_name_resolver callback instead. [-Wdeprecated-declarations]350 1128 | HeapSnapshotOptions() {}351 | ^352../../deps/v8/include/v8-profiler.h:1142:25: note: declared here353 1142 | ObjectNameResolver* global_object_name_resolver = nullptr;354 | ^~~~~~~~~~~~~~~~~~~~~~~~~~~355../../deps/v8/include/v8-profiler.h:1128:27: warning: 'v8::HeapProfiler::HeapSnapshotOptions::global_object_name_resolver' is deprecated: Use context_name_resolver callback instead. [-Wdeprecated-declarations]356 1128 | HeapSnapshotOptions() {}357 | ^358../../deps/v8/include/v8-profiler.h:1142:25: note: declared here359 1142 | ObjectNameResolver* global_object_name_resolver = nullptr;360 | ^~~~~~~~~~~~~~~~~~~~~~~~~~~361[148/1871] CXX obj/gen/src/node/inspector/protocol/node_base.Network.o362In file included from ../../src/util.h:29,363 from ../../src/inspector/node_string.h:10,364 from gen/src/node/inspector/protocol/Forward.h:19,365 from gen/src/node/inspector/protocol/Protocol.h:18,366 from gen/src/node/inspector/protocol/Network.h:10,367 from gen/src/node/inspector/protocol/Network.cpp:7:368../../deps/v8/include/v8-profiler.h: In constructor 'v8::HeapProfiler::HeapSnapshotOptions::HeapSnapshotOptions()':369../../deps/v8/include/v8-profiler.h:1128:27: warning: 'v8::HeapProfiler::HeapSnapshotOptions::global_object_name_resolver' is deprecated: Use context_name_resolver callback instead. [-Wdeprecated-declarations]370 1128 | HeapSnapshotOptions() {}371 | ^372../../deps/v8/include/v8-profiler.h:1142:25: note: declared here373 1142 | ObjectNameResolver* global_object_name_resolver = nullptr;374 | ^~~~~~~~~~~~~~~~~~~~~~~~~~~375../../deps/v8/include/v8-profiler.h:1128:27: warning: 'v8::HeapProfiler::HeapSnapshotOptions::global_object_name_resolver' is deprecated: Use context_name_resolver callback instead. [-Wdeprecated-declarations]376 1128 | HeapSnapshotOptions() {}377 | ^378../../deps/v8/include/v8-profiler.h:1142:25: note: declared here379 1142 | ObjectNameResolver* global_object_name_resolver = nullptr;380 | ^~~~~~~~~~~~~~~~~~~~~~~~~~~381[149/1871] CXX obj/gen/src/node/inspector/protocol/node_base.Protocol.o382In file included from ../../src/util.h:29,383 from ../../src/inspector/node_string.h:10,384 from gen/src/node/inspector/protocol/Forward.h:19,385 from gen/src/node/inspector/protocol/Protocol.h:18,386 from gen/src/node/inspector/protocol/Protocol.cpp:7:387../../deps/v8/include/v8-profiler.h: In constructor 'v8::HeapProfiler::HeapSnapshotOptions::HeapSnapshotOptions()':388../../deps/v8/include/v8-profiler.h:1128:27: warning: 'v8::HeapProfiler::HeapSnapshotOptions::global_object_name_resolver' is deprecated: Use context_name_resolver callback instead. [-Wdeprecated-declarations]389 1128 | HeapSnapshotOptions() {}390 | ^391../../deps/v8/include/v8-profiler.h:1142:25: note: declared here392 1142 | ObjectNameResolver* global_object_name_resolver = nullptr;393 | ^~~~~~~~~~~~~~~~~~~~~~~~~~~394../../deps/v8/include/v8-profiler.h:1128:27: warning: 'v8::HeapProfiler::HeapSnapshotOptions::global_object_name_resolver' is deprecated: Use context_name_resolver callback instead. [-Wdeprecated-declarations]395 1128 | HeapSnapshotOptions() {}396 | ^397../../deps/v8/include/v8-profiler.h:1142:25: note: declared here398 1142 | ObjectNameResolver* global_object_name_resolver = nullptr;399 | ^~~~~~~~~~~~~~~~~~~~~~~~~~~400[150/1871] CXX obj/src/node_base.json_utils.o401[151/1871] CXX obj/src/node_base.internal_only_v8.o402In file included from ../../src/util.h:29,403 from ../../src/util-inl.h:33,404 from ../../src/internal_only_v8.cc:3:405../../deps/v8/include/v8-profiler.h: In constructor 'v8::HeapProfiler::HeapSnapshotOptions::HeapSnapshotOptions()':406../../deps/v8/include/v8-profiler.h:1128:27: warning: 'v8::HeapProfiler::HeapSnapshotOptions::global_object_name_resolver' is deprecated: Use context_name_resolver callback instead. [-Wdeprecated-declarations]407 1128 | HeapSnapshotOptions() {}408 | ^409../../deps/v8/include/v8-profiler.h:1142:25: note: declared here410 1142 | ObjectNameResolver* global_object_name_resolver = nullptr;411 | ^~~~~~~~~~~~~~~~~~~~~~~~~~~412../../deps/v8/include/v8-profiler.h:1128:27: warning: 'v8::HeapProfiler::HeapSnapshotOptions::global_object_name_resolver' is deprecated: Use context_name_resolver callback instead. [-Wdeprecated-declarations]413 1128 | HeapSnapshotOptions() {}414 | ^415../../deps/v8/include/v8-profiler.h:1142:25: note: declared here416 1142 | ObjectNameResolver* global_object_name_resolver = nullptr;417 | ^~~~~~~~~~~~~~~~~~~~~~~~~~~418[152/1871] CXX obj/src/node_base.async_context_frame.o419In file included from ../../src/memory_tracker.h:6,420 from ../../src/base_object.h:29,421 from ../../src/async_context_frame.h:6,422 from ../../src/async_context_frame.cc:1:423../../deps/v8/include/v8-profiler.h: In constructor 'v8::HeapProfiler::HeapSnapshotOptions::HeapSnapshotOptions()':424../../deps/v8/include/v8-profiler.h:1128:27: warning: 'v8::HeapProfiler::HeapSnapshotOptions::global_object_name_resolver' is deprecated: Use context_name_resolver callback instead. [-Wdeprecated-declarations]425 1128 | HeapSnapshotOptions() {}426 | ^427../../deps/v8/include/v8-profiler.h:1142:25: note: declared here428 1142 | ObjectNameResolver* global_object_name_resolver = nullptr;429 | ^~~~~~~~~~~~~~~~~~~~~~~~~~~430../../deps/v8/include/v8-profiler.h:1128:27: warning: 'v8::HeapProfiler::HeapSnapshotOptions::global_object_name_resolver' is deprecated: Use context_name_resolver callback instead. [-Wdeprecated-declarations]431 1128 | HeapSnapshotOptions() {}432 | ^433../../deps/v8/include/v8-profiler.h:1142:25: note: declared here434 1142 | ObjectNameResolver* global_object_name_resolver = nullptr;435 | ^~~~~~~~~~~~~~~~~~~~~~~~~~~436[153/1871] CXX obj/src/api/node_base.async_resource.o437In file included from ../../src/memory_tracker.h:6,438 from ../../src/base_object.h:29,439 from ../../src/async_context_frame.h:6,440 from ../../src/api/async_resource.cc:1:441../../deps/v8/include/v8-profiler.h: In constructor 'v8::HeapProfiler::HeapSnapshotOptions::HeapSnapshotOptions()':442../../deps/v8/include/v8-profiler.h:1128:27: warning: 'v8::HeapProfiler::HeapSnapshotOptions::global_object_name_resolver' is deprecated: Use context_name_resolver callback instead. [-Wdeprecated-declarations]443 1128 | HeapSnapshotOptions() {}444 | ^445../../deps/v8/include/v8-profiler.h:1142:25: note: declared here446 1142 | ObjectNameResolver* global_object_name_resolver = nullptr;447 | ^~~~~~~~~~~~~~~~~~~~~~~~~~~448../../deps/v8/include/v8-profiler.h:1128:27: warning: 'v8::HeapProfiler::HeapSnapshotOptions::global_object_name_resolver' is deprecated: Use context_name_resolver callback instead. [-Wdeprecated-declarations]449 1128 | HeapSnapshotOptions() {}450 | ^451../../deps/v8/include/v8-profiler.h:1142:25: note: declared here452 1142 | ObjectNameResolver* global_object_name_resolver = nullptr;453 | ^~~~~~~~~~~~~~~~~~~~~~~~~~~454[154/1871] CXX obj/src/api/node_base.embed_helpers.o455In file included from ../../src/memory_tracker.h:6,456 from ../../src/base_object.h:29,457 from ../../src/async_wrap.h:27,458 from ../../src/debug_utils.h:6,459 from ../../src/debug_utils-inl.h:6,460 from ../../src/api/embed_helpers.cc:1:461../../deps/v8/include/v8-profiler.h: In constructor 'v8::HeapProfiler::HeapSnapshotOptions::HeapSnapshotOptions()':462../../deps/v8/include/v8-profiler.h:1128:27: warning: 'v8::HeapProfiler::HeapSnapshotOptions::global_object_name_resolver' is deprecated: Use context_name_resolver callback instead. [-Wdeprecated-declarations]463 1128 | HeapSnapshotOptions() {}464 | ^465../../deps/v8/include/v8-profiler.h:1142:25: note: declared here466 1142 | ObjectNameResolver* global_object_name_resolver = nullptr;467 | ^~~~~~~~~~~~~~~~~~~~~~~~~~~468../../deps/v8/include/v8-profiler.h:1128:27: warning: 'v8::HeapProfiler::HeapSnapshotOptions::global_object_name_resolver' is deprecated: Use context_name_resolver callback instead. [-Wdeprecated-declarations]469 1128 | HeapSnapshotOptions() {}470 | ^471../../deps/v8/include/v8-profiler.h:1142:25: note: declared here472 1142 | ObjectNameResolver* global_object_name_resolver = nullptr;473 | ^~~~~~~~~~~~~~~~~~~~~~~~~~~474[155/1871] CXX obj/src/api/node_base.hooks.o475In file included from ../../src/memory_tracker.h:6,476 from ../../src/aliased_buffer.h:7,477 from ../../src/aliased_buffer-inl.h:6,478 from ../../src/env-inl.h:27,479 from ../../src/api/hooks.cc:1:480../../deps/v8/include/v8-profiler.h: In constructor 'v8::HeapProfiler::HeapSnapshotOptions::HeapSnapshotOptions()':481../../deps/v8/include/v8-profiler.h:1128:27: warning: 'v8::HeapProfiler::HeapSnapshotOptions::global_object_name_resolver' is deprecated: Use context_name_resolver callback instead. [-Wdeprecated-declarations]482 1128 | HeapSnapshotOptions() {}483 | ^484../../deps/v8/include/v8-profiler.h:1142:25: note: declared here485 1142 | ObjectNameResolver* global_object_name_resolver = nullptr;486 | ^~~~~~~~~~~~~~~~~~~~~~~~~~~487../../deps/v8/include/v8-profiler.h:1128:27: warning: 'v8::HeapProfiler::HeapSnapshotOptions::global_object_name_resolver' is deprecated: Use context_name_resolver callback instead. [-Wdeprecated-declarations]488 1128 | HeapSnapshotOptions() {}489 | ^490../../deps/v8/include/v8-profiler.h:1142:25: note: declared here491 1142 | ObjectNameResolver* global_object_name_resolver = nullptr;492 | ^~~~~~~~~~~~~~~~~~~~~~~~~~~493[156/1871] CXX obj/src/node_base.base_object.o494In file included from ../../src/memory_tracker.h:6,495 from ../../src/base_object.h:29,496 from ../../src/base_object.cc:1:497../../deps/v8/include/v8-profiler.h: In constructor 'v8::HeapProfiler::HeapSnapshotOptions::HeapSnapshotOptions()':498../../deps/v8/include/v8-profiler.h:1128:27: warning: 'v8::HeapProfiler::HeapSnapshotOptions::global_object_name_resolver' is deprecated: Use context_name_resolver callback instead. [-Wdeprecated-declarations]499 1128 | HeapSnapshotOptions() {}500 | ^501../../deps/v8/include/v8-profiler.h:1142:25: note: declared here502 1142 | ObjectNameResolver* global_object_name_resolver = nullptr;503 | ^~~~~~~~~~~~~~~~~~~~~~~~~~~504../../deps/v8/include/v8-profiler.h:1128:27: warning: 'v8::HeapProfiler::HeapSnapshotOptions::global_object_name_resolver' is deprecated: Use context_name_resolver callback instead. [-Wdeprecated-declarations]505 1128 | HeapSnapshotOptions() {}506 | ^507../../deps/v8/include/v8-profiler.h:1142:25: note: declared here508 1142 | ObjectNameResolver* global_object_name_resolver = nullptr;509 | ^~~~~~~~~~~~~~~~~~~~~~~~~~~510[157/1871] CXX obj/src/api/node_base.callback.o511In file included from ../../src/memory_tracker.h:6,512 from ../../src/base_object.h:29,513 from ../../src/async_context_frame.h:6,514 from ../../src/api/callback.cc:1:515../../deps/v8/include/v8-profiler.h: In constructor 'v8::HeapProfiler::HeapSnapshotOptions::HeapSnapshotOptions()':516../../deps/v8/include/v8-profiler.h:1128:27: warning: 'v8::HeapProfiler::HeapSnapshotOptions::global_object_name_resolver' is deprecated: Use context_name_resolver callback instead. [-Wdeprecated-declarations]517 1128 | HeapSnapshotOptions() {}518 | ^519../../deps/v8/include/v8-profiler.h:1142:25: note: declared here520 1142 | ObjectNameResolver* global_object_name_resolver = nullptr;521 | ^~~~~~~~~~~~~~~~~~~~~~~~~~~522../../deps/v8/include/v8-profiler.h:1128:27: warning: 'v8::HeapProfiler::HeapSnapshotOptions::global_object_name_resolver' is deprecated: Use context_name_resolver callback instead. [-Wdeprecated-declarations]523 1128 | HeapSnapshotOptions() {}524 | ^525../../deps/v8/include/v8-profiler.h:1142:25: note: declared here526 1142 | ObjectNameResolver* global_object_name_resolver = nullptr;527 | ^~~~~~~~~~~~~~~~~~~~~~~~~~~528[158/1871] CXX obj/src/api/node_base.exceptions.o529In file included from ../../src/memory_tracker.h:6,530 from ../../src/aliased_buffer.h:7,531 from ../../src/aliased_buffer-inl.h:6,532 from ../../src/env-inl.h:27,533 from ../../src/api/exceptions.cc:3:534../../deps/v8/include/v8-profiler.h: In constructor 'v8::HeapProfiler::HeapSnapshotOptions::HeapSnapshotOptions()':535../../deps/v8/include/v8-profiler.h:1128:27: warning: 'v8::HeapProfiler::HeapSnapshotOptions::global_object_name_resolver' is deprecated: Use context_name_resolver callback instead. [-Wdeprecated-declarations]536 1128 | HeapSnapshotOptions() {}537 | ^538../../deps/v8/include/v8-profiler.h:1142:25: note: declared here539 1142 | ObjectNameResolver* global_object_name_resolver = nullptr;540 | ^~~~~~~~~~~~~~~~~~~~~~~~~~~541../../deps/v8/include/v8-profiler.h:1128:27: warning: 'v8::HeapProfiler::HeapSnapshotOptions::global_object_name_resolver' is deprecated: Use context_name_resolver callback instead. [-Wdeprecated-declarations]542 1128 | HeapSnapshotOptions() {}543 | ^544../../deps/v8/include/v8-profiler.h:1142:25: note: declared here545 1142 | ObjectNameResolver* global_object_name_resolver = nullptr;546 | ^~~~~~~~~~~~~~~~~~~~~~~~~~~547[159/1871] CXX obj/src/node_base.connection_wrap.o548In file included from ../../src/memory_tracker.h:6,549 from ../../src/aliased_buffer.h:7,550 from ../../src/env.h:27,551 from ../../src/stream_base.h:6,552 from ../../src/stream_wrap.h:27,553 from ../../src/connection_wrap.h:6,554 from ../../src/connection_wrap.cc:1:555../../deps/v8/include/v8-profiler.h: In constructor 'v8::HeapProfiler::HeapSnapshotOptions::HeapSnapshotOptions()':556../../deps/v8/include/v8-profiler.h:1128:27: warning: 'v8::HeapProfiler::HeapSnapshotOptions::global_object_name_resolver' is deprecated: Use context_name_resolver callback instead. [-Wdeprecated-declarations]557 1128 | HeapSnapshotOptions() {}558 | ^559../../deps/v8/include/v8-profiler.h:1142:25: note: declared here560 1142 | ObjectNameResolver* global_object_name_resolver = nullptr;561 | ^~~~~~~~~~~~~~~~~~~~~~~~~~~562../../deps/v8/include/v8-profiler.h:1128:27: warning: 'v8::HeapProfiler::HeapSnapshotOptions::global_object_name_resolver' is deprecated: Use context_name_resolver callback instead. [-Wdeprecated-declarations]563 1128 | HeapSnapshotOptions() {}564 | ^565../../deps/v8/include/v8-profiler.h:1142:25: note: declared here566 1142 | ObjectNameResolver* global_object_name_resolver = nullptr;567 | ^~~~~~~~~~~~~~~~~~~~~~~~~~~568[160/1871] CXX obj/src/api/node_base.encoding.o569In file included from ../../src/memory_tracker.h:6,570 from ../../src/aliased_buffer.h:7,571 from ../../src/aliased_buffer-inl.h:6,572 from ../../src/env-inl.h:27,573 from ../../src/string_bytes.h:30,574 from ../../src/api/encoding.cc:2:575../../deps/v8/include/v8-profiler.h: In constructor 'v8::HeapProfiler::HeapSnapshotOptions::HeapSnapshotOptions()':576../../deps/v8/include/v8-profiler.h:1128:27: warning: 'v8::HeapProfiler::HeapSnapshotOptions::global_object_name_resolver' is deprecated: Use context_name_resolver callback instead. [-Wdeprecated-declarations]577 1128 | HeapSnapshotOptions() {}578 | ^579../../deps/v8/include/v8-profiler.h:1142:25: note: declared here580 1142 | ObjectNameResolver* global_object_name_resolver = nullptr;581 | ^~~~~~~~~~~~~~~~~~~~~~~~~~~582../../deps/v8/include/v8-profiler.h:1128:27: warning: 'v8::HeapProfiler::HeapSnapshotOptions::global_object_name_resolver' is deprecated: Use context_name_resolver callback instead. [-Wdeprecated-declarations]583 1128 | HeapSnapshotOptions() {}584 | ^585../../deps/v8/include/v8-profiler.h:1142:25: note: declared here586 1142 | ObjectNameResolver* global_object_name_resolver = nullptr;587 | ^~~~~~~~~~~~~~~~~~~~~~~~~~~588[161/1871] CXX obj/src/node_base.connect_wrap.o589In file included from ../../src/memory_tracker.h:6,590 from ../../src/base_object.h:29,591 from ../../src/async_wrap.h:27,592 from ../../src/req_wrap.h:6,593 from ../../src/req_wrap-inl.h:6,594 from ../../src/connect_wrap.h:6,595 from ../../src/connect_wrap.cc:1:596../../deps/v8/include/v8-profiler.h: In constructor 'v8::HeapProfiler::HeapSnapshotOptions::HeapSnapshotOptions()':597../../deps/v8/include/v8-profiler.h:1128:27: warning: 'v8::HeapProfiler::HeapSnapshotOptions::global_object_name_resolver' is deprecated: Use context_name_resolver callback instead. [-Wdeprecated-declarations]598 1128 | HeapSnapshotOptions() {}599 | ^600../../deps/v8/include/v8-profiler.h:1142:25: note: declared here601 1142 | ObjectNameResolver* global_object_name_resolver = nullptr;602 | ^~~~~~~~~~~~~~~~~~~~~~~~~~~603../../deps/v8/include/v8-profiler.h:1128:27: warning: 'v8::HeapProfiler::HeapSnapshotOptions::global_object_name_resolver' is deprecated: Use context_name_resolver callback instead. [-Wdeprecated-declarations]604 1128 | HeapSnapshotOptions() {}605 | ^606../../deps/v8/include/v8-profiler.h:1142:25: note: declared here607 1142 | ObjectNameResolver* global_object_name_resolver = nullptr;608 | ^~~~~~~~~~~~~~~~~~~~~~~~~~~609[162/1871] CXX obj/src/node_base.compile_cache.o610In file included from ../../src/memory_tracker.h:6,611 from ../../src/base_object.h:29,612 from ../../src/async_wrap.h:27,613 from ../../src/debug_utils.h:6,614 from ../../src/debug_utils-inl.h:6,615 from ../../src/compile_cache.cc:3:616../../deps/v8/include/v8-profiler.h: In constructor 'v8::HeapProfiler::HeapSnapshotOptions::HeapSnapshotOptions()':617../../deps/v8/include/v8-profiler.h:1128:27: warning: 'v8::HeapProfiler::HeapSnapshotOptions::global_object_name_resolver' is deprecated: Use context_name_resolver callback instead. [-Wdeprecated-declarations]618 1128 | HeapSnapshotOptions() {}619 | ^620../../deps/v8/include/v8-profiler.h:1142:25: note: declared here621 1142 | ObjectNameResolver* global_object_name_resolver = nullptr;622 | ^~~~~~~~~~~~~~~~~~~~~~~~~~~623../../deps/v8/include/v8-profiler.h:1128:27: warning: 'v8::HeapProfiler::HeapSnapshotOptions::global_object_name_resolver' is deprecated: Use context_name_resolver callback instead. [-Wdeprecated-declarations]624 1128 | HeapSnapshotOptions() {}625 | ^626../../deps/v8/include/v8-profiler.h:1142:25: note: declared here627 1142 | ObjectNameResolver* global_object_name_resolver = nullptr;628 | ^~~~~~~~~~~~~~~~~~~~~~~~~~~629[163/1871] CXX obj/src/node_base.node_debug.o630[164/1871] CXX obj/src/node_base.debug_utils.o631In file included from ../../src/memory_tracker.h:6,632 from ../../src/base_object.h:29,633 from ../../src/async_wrap.h:27,634 from ../../src/debug_utils.h:6,635 from ../../src/debug_utils-inl.h:6,636 from ../../src/debug_utils.cc:1:637../../deps/v8/include/v8-profiler.h: In constructor 'v8::HeapProfiler::HeapSnapshotOptions::HeapSnapshotOptions()':638../../deps/v8/include/v8-profiler.h:1128:27: warning: 'v8::HeapProfiler::HeapSnapshotOptions::global_object_name_resolver' is deprecated: Use context_name_resolver callback instead. [-Wdeprecated-declarations]639 1128 | HeapSnapshotOptions() {}640 | ^641../../deps/v8/include/v8-profiler.h:1142:25: note: declared here642 1142 | ObjectNameResolver* global_object_name_resolver = nullptr;643 | ^~~~~~~~~~~~~~~~~~~~~~~~~~~644../../deps/v8/include/v8-profiler.h:1128:27: warning: 'v8::HeapProfiler::HeapSnapshotOptions::global_object_name_resolver' is deprecated: Use context_name_resolver callback instead. [-Wdeprecated-declarations]645 1128 | HeapSnapshotOptions() {}646 | ^647../../deps/v8/include/v8-profiler.h:1142:25: note: declared here648 1142 | ObjectNameResolver* global_object_name_resolver = nullptr;649 | ^~~~~~~~~~~~~~~~~~~~~~~~~~~650[165/1871] CXX obj/src/api/node_base.environment.o651In file included from ../../src/memory_tracker.h:6,652 from ../../src/base_object.h:29,653 from ../../src/async_wrap.h:27,654 from ../../src/crypto/crypto_util.h:6,655 from ../../src/api/environment.cc:3:656../../deps/v8/include/v8-profiler.h: In constructor 'v8::HeapProfiler::HeapSnapshotOptions::HeapSnapshotOptions()':657../../deps/v8/include/v8-profiler.h:1128:27: warning: 'v8::HeapProfiler::HeapSnapshotOptions::global_object_name_resolver' is deprecated: Use context_name_resolver callback instead. [-Wdeprecated-declarations]658 1128 | HeapSnapshotOptions() {}659 | ^660../../deps/v8/include/v8-profiler.h:1142:25: note: declared here661 1142 | ObjectNameResolver* global_object_name_resolver = nullptr;662 | ^~~~~~~~~~~~~~~~~~~~~~~~~~~663../../deps/v8/include/v8-profiler.h:1128:27: warning: 'v8::HeapProfiler::HeapSnapshotOptions::global_object_name_resolver' is deprecated: Use context_name_resolver callback instead. [-Wdeprecated-declarations]664 1128 | HeapSnapshotOptions() {}665 | ^666../../deps/v8/include/v8-profiler.h:1142:25: note: declared here667 1142 | ObjectNameResolver* global_object_name_resolver = nullptr;668 | ^~~~~~~~~~~~~~~~~~~~~~~~~~~669[166/1871] CXX obj/src/node_base.handle_wrap.o670In file included from ../../src/memory_tracker.h:6,671 from ../../src/base_object.h:29,672 from ../../src/async_wrap.h:27,673 from ../../src/handle_wrap.h:27,674 from ../../src/handle_wrap.cc:22:675../../deps/v8/include/v8-profiler.h: In constructor 'v8::HeapProfiler::HeapSnapshotOptions::HeapSnapshotOptions()':676../../deps/v8/include/v8-profiler.h:1128:27: warning: 'v8::HeapProfiler::HeapSnapshotOptions::global_object_name_resolver' is deprecated: Use context_name_resolver callback instead. [-Wdeprecated-declarations]677 1128 | HeapSnapshotOptions() {}678 | ^679../../deps/v8/include/v8-profiler.h:1142:25: note: declared here680 1142 | ObjectNameResolver* global_object_name_resolver = nullptr;681 | ^~~~~~~~~~~~~~~~~~~~~~~~~~~682../../deps/v8/include/v8-profiler.h:1128:27: warning: 'v8::HeapProfiler::HeapSnapshotOptions::global_object_name_resolver' is deprecated: Use context_name_resolver callback instead. [-Wdeprecated-declarations]683 1128 | HeapSnapshotOptions() {}684 | ^685../../deps/v8/include/v8-profiler.h:1142:25: note: declared here686 1142 | ObjectNameResolver* global_object_name_resolver = nullptr;687 | ^~~~~~~~~~~~~~~~~~~~~~~~~~~688[167/1871] CXX obj/src/node_base.fs_event_wrap.o689In file included from ../../src/memory_tracker.h:6,690 from ../../src/base_object.h:29,691 from ../../src/async_wrap.h:27,692 from ../../src/async_wrap-inl.h:27,693 from ../../src/fs_event_wrap.cc:22:694../../deps/v8/include/v8-profiler.h: In constructor 'v8::HeapProfiler::HeapSnapshotOptions::HeapSnapshotOptions()':695../../deps/v8/include/v8-profiler.h:1128:27: warning: 'v8::HeapProfiler::HeapSnapshotOptions::global_object_name_resolver' is deprecated: Use context_name_resolver callback instead. [-Wdeprecated-declarations]696 1128 | HeapSnapshotOptions() {}697 | ^698../../deps/v8/include/v8-profiler.h:1142:25: note: declared here699 1142 | ObjectNameResolver* global_object_name_resolver = nullptr;700 | ^~~~~~~~~~~~~~~~~~~~~~~~~~~701../../deps/v8/include/v8-profiler.h:1128:27: warning: 'v8::HeapProfiler::HeapSnapshotOptions::global_object_name_resolver' is deprecated: Use context_name_resolver callback instead. [-Wdeprecated-declarations]702 1128 | HeapSnapshotOptions() {}703 | ^704../../deps/v8/include/v8-profiler.h:1142:25: note: declared here705 1142 | ObjectNameResolver* global_object_name_resolver = nullptr;706 | ^~~~~~~~~~~~~~~~~~~~~~~~~~~707[168/1871] CXX obj/src/node_base.async_wrap.o708In file included from ../../src/memory_tracker.h:6,709 from ../../src/base_object.h:29,710 from ../../src/async_wrap.h:27,711 from ../../src/async_wrap.cc:22:712../../deps/v8/include/v8-profiler.h: In constructor 'v8::HeapProfiler::HeapSnapshotOptions::HeapSnapshotOptions()':713../../deps/v8/include/v8-profiler.h:1128:27: warning: 'v8::HeapProfiler::HeapSnapshotOptions::global_object_name_resolver' is deprecated: Use context_name_resolver callback instead. [-Wdeprecated-declarations]714 1128 | HeapSnapshotOptions() {}715 | ^716../../deps/v8/include/v8-profiler.h:1142:25: note: declared here717 1142 | ObjectNameResolver* global_object_name_resolver = nullptr;718 | ^~~~~~~~~~~~~~~~~~~~~~~~~~~719../../deps/v8/include/v8-profiler.h:1128:27: warning: 'v8::HeapProfiler::HeapSnapshotOptions::global_object_name_resolver' is deprecated: Use context_name_resolver callback instead. [-Wdeprecated-declarations]720 1128 | HeapSnapshotOptions() {}721 | ^722../../deps/v8/include/v8-profiler.h:1142:25: note: declared here723 1142 | ObjectNameResolver* global_object_name_resolver = nullptr;724 | ^~~~~~~~~~~~~~~~~~~~~~~~~~~725[169/1871] CXX obj/src/node_base.js_stream.o726In file included from ../../src/memory_tracker.h:6,727 from ../../src/base_object.h:29,728 from ../../src/async_wrap.h:27,729 from ../../src/js_stream.h:6,730 from ../../src/js_stream.cc:1:731../../deps/v8/include/v8-profiler.h: In constructor 'v8::HeapProfiler::HeapSnapshotOptions::HeapSnapshotOptions()':732../../deps/v8/include/v8-profiler.h:1128:27: warning: 'v8::HeapProfiler::HeapSnapshotOptions::global_object_name_resolver' is deprecated: Use context_name_resolver callback instead. [-Wdeprecated-declarations]733 1128 | HeapSnapshotOptions() {}734 | ^735../../deps/v8/include/v8-profiler.h:1142:25: note: declared here736 1142 | ObjectNameResolver* global_object_name_resolver = nullptr;737 | ^~~~~~~~~~~~~~~~~~~~~~~~~~~738../../deps/v8/include/v8-profiler.h:1128:27: warning: 'v8::HeapProfiler::HeapSnapshotOptions::global_object_name_resolver' is deprecated: Use context_name_resolver callback instead. [-Wdeprecated-declarations]739 1128 | HeapSnapshotOptions() {}740 | ^741../../deps/v8/include/v8-profiler.h:1142:25: note: declared here742 1142 | ObjectNameResolver* global_object_name_resolver = nullptr;743 | ^~~~~~~~~~~~~~~~~~~~~~~~~~~744[170/1871] CXX obj/src/node_base.heap_utils.o745In file included from ../../src/memory_tracker.h:6,746 from ../../src/aliased_buffer.h:7,747 from ../../src/env.h:27,748 from ../../src/node_internals.h:27,749 from ../../src/diagnosticfilename-inl.h:6,750 from ../../src/heap_utils.cc:1:751../../deps/v8/include/v8-profiler.h: In constructor 'v8::HeapProfiler::HeapSnapshotOptions::HeapSnapshotOptions()':752../../deps/v8/include/v8-profiler.h:1128:27: warning: 'v8::HeapProfiler::HeapSnapshotOptions::global_object_name_resolver' is deprecated: Use context_name_resolver callback instead. [-Wdeprecated-declarations]753 1128 | HeapSnapshotOptions() {}754 | ^755../../deps/v8/include/v8-profiler.h:1142:25: note: declared here756 1142 | ObjectNameResolver* global_object_name_resolver = nullptr;757 | ^~~~~~~~~~~~~~~~~~~~~~~~~~~758../../deps/v8/include/v8-profiler.h:1128:27: warning: 'v8::HeapProfiler::HeapSnapshotOptions::global_object_name_resolver' is deprecated: Use context_name_resolver callback instead. [-Wdeprecated-declarations]759 1128 | HeapSnapshotOptions() {}760 | ^761../../deps/v8/include/v8-profiler.h:1142:25: note: declared here762 1142 | ObjectNameResolver* global_object_name_resolver = nullptr;763 | ^~~~~~~~~~~~~~~~~~~~~~~~~~~764[171/1871] CXX obj/src/dataqueue/node_base.queue.o765In file included from ../../src/memory_tracker.h:6,766 from ../../src/base_object.h:29,767 from ../../src/dataqueue/queue.h:5,768 from ../../src/dataqueue/queue.cc:1:769../../deps/v8/include/v8-profiler.h: In constructor 'v8::HeapProfiler::HeapSnapshotOptions::HeapSnapshotOptions()':770../../deps/v8/include/v8-profiler.h:1128:27: warning: 'v8::HeapProfiler::HeapSnapshotOptions::global_object_name_resolver' is deprecated: Use context_name_resolver callback instead. [-Wdeprecated-declarations]771 1128 | HeapSnapshotOptions() {}772 | ^773../../deps/v8/include/v8-profiler.h:1142:25: note: declared here774 1142 | ObjectNameResolver* global_object_name_resolver = nullptr;775 | ^~~~~~~~~~~~~~~~~~~~~~~~~~~776../../deps/v8/include/v8-profiler.h:1128:27: warning: 'v8::HeapProfiler::HeapSnapshotOptions::global_object_name_resolver' is deprecated: Use context_name_resolver callback instead. [-Wdeprecated-declarations]777 1128 | HeapSnapshotOptions() {}778 | ^779../../deps/v8/include/v8-profiler.h:1142:25: note: declared here780 1142 | ObjectNameResolver* global_object_name_resolver = nullptr;781 | ^~~~~~~~~~~~~~~~~~~~~~~~~~~782[172/1871] CXX obj/src/node_base.encoding_binding.o783In file included from ../../src/memory_tracker.h:6,784 from ../../src/aliased_buffer.h:7,785 from ../../src/encoding_binding.h:7,786 from ../../src/encoding_binding.cc:1:787../../deps/v8/include/v8-profiler.h: In constructor 'v8::HeapProfiler::HeapSnapshotOptions::HeapSnapshotOptions()':788../../deps/v8/include/v8-profiler.h:1128:27: warning: 'v8::HeapProfiler::HeapSnapshotOptions::global_object_name_resolver' is deprecated: Use context_name_resolver callback instead. [-Wdeprecated-declarations]789 1128 | HeapSnapshotOptions() {}790 | ^791../../deps/v8/include/v8-profiler.h:1142:25: note: declared here792 1142 | ObjectNameResolver* global_object_name_resolver = nullptr;793 | ^~~~~~~~~~~~~~~~~~~~~~~~~~~794../../deps/v8/include/v8-profiler.h:1128:27: warning: 'v8::HeapProfiler::HeapSnapshotOptions::global_object_name_resolver' is deprecated: Use context_name_resolver callback instead. [-Wdeprecated-declarations]795 1128 | HeapSnapshotOptions() {}796 | ^797../../deps/v8/include/v8-profiler.h:1142:25: note: declared here798 1142 | ObjectNameResolver* global_object_name_resolver = nullptr;799 | ^~~~~~~~~~~~~~~~~~~~~~~~~~~800[173/1871] CXX obj/src/node_base.js_udp_wrap.o801In file included from ../../src/memory_tracker.h:6,802 from ../../src/base_object.h:29,803 from ../../src/async_wrap.h:27,804 from ../../src/handle_wrap.h:27,805 from ../../src/udp_wrap.h:27,806 from ../../src/js_udp_wrap.cc:1:807../../deps/v8/include/v8-profiler.h: In constructor 'v8::HeapProfiler::HeapSnapshotOptions::HeapSnapshotOptions()':808../../deps/v8/include/v8-profiler.h:1128:27: warning: 'v8::HeapProfiler::HeapSnapshotOptions::global_object_name_resolver' is deprecated: Use context_name_resolver callback instead. [-Wdeprecated-declarations]809 1128 | HeapSnapshotOptions() {}810 | ^811../../deps/v8/include/v8-profiler.h:1142:25: note: declared here812 1142 | ObjectNameResolver* global_object_name_resolver = nullptr;813 | ^~~~~~~~~~~~~~~~~~~~~~~~~~~814../../deps/v8/include/v8-profiler.h:1128:27: warning: 'v8::HeapProfiler::HeapSnapshotOptions::global_object_name_resolver' is deprecated: Use context_name_resolver callback instead. [-Wdeprecated-declarations]815 1128 | HeapSnapshotOptions() {}816 | ^817../../deps/v8/include/v8-profiler.h:1142:25: note: declared here818 1142 | ObjectNameResolver* global_object_name_resolver = nullptr;819 | ^~~~~~~~~~~~~~~~~~~~~~~~~~~820[174/1871] CXX obj/src/node_base.histogram.o821In file included from ../../src/memory_tracker.h:6,822 from ../../src/base_object.h:29,823 from ../../src/histogram.h:7,824 from ../../src/histogram.cc:1:825../../deps/v8/include/v8-profiler.h: In constructor 'v8::HeapProfiler::HeapSnapshotOptions::HeapSnapshotOptions()':826../../deps/v8/include/v8-profiler.h:1128:27: warning: 'v8::HeapProfiler::HeapSnapshotOptions::global_object_name_resolver' is deprecated: Use context_name_resolver callback instead. [-Wdeprecated-declarations]827 1128 | HeapSnapshotOptions() {}828 | ^829../../deps/v8/include/v8-profiler.h:1142:25: note: declared here830 1142 | ObjectNameResolver* global_object_name_resolver = nullptr;831 | ^~~~~~~~~~~~~~~~~~~~~~~~~~~832../../deps/v8/include/v8-profiler.h:1128:27: warning: 'v8::HeapProfiler::HeapSnapshotOptions::global_object_name_resolver' is deprecated: Use context_name_resolver callback instead. [-Wdeprecated-declarations]833 1128 | HeapSnapshotOptions() {}834 | ^835../../deps/v8/include/v8-profiler.h:1142:25: note: declared here836 1142 | ObjectNameResolver* global_object_name_resolver = nullptr;837 | ^~~~~~~~~~~~~~~~~~~~~~~~~~~838[175/1871] CXX obj/src/node_base.node_file_utils.o839In file included from ../../src/util.h:29,840 from ../../src/util-inl.h:33,841 from ../../src/node_file_utils.cc:10:842../../deps/v8/include/v8-profiler.h: In constructor 'v8::HeapProfiler::HeapSnapshotOptions::HeapSnapshotOptions()':843../../deps/v8/include/v8-profiler.h:1128:27: warning: 'v8::HeapProfiler::HeapSnapshotOptions::global_object_name_resolver' is deprecated: Use context_name_resolver callback instead. [-Wdeprecated-declarations]844 1128 | HeapSnapshotOptions() {}845 | ^846../../deps/v8/include/v8-profiler.h:1142:25: note: declared here847 1142 | ObjectNameResolver* global_object_name_resolver = nullptr;848 | ^~~~~~~~~~~~~~~~~~~~~~~~~~~849../../deps/v8/include/v8-profiler.h:1128:27: warning: 'v8::HeapProfiler::HeapSnapshotOptions::global_object_name_resolver' is deprecated: Use context_name_resolver callback instead. [-Wdeprecated-declarations]850 1128 | HeapSnapshotOptions() {}851 | ^852../../deps/v8/include/v8-profiler.h:1142:25: note: declared here853 1142 | ObjectNameResolver* global_object_name_resolver = nullptr;854 | ^~~~~~~~~~~~~~~~~~~~~~~~~~~855../../src/node_file_utils.cc: In function 'int node::WriteFileSync(const char*, uv_buf_t*, size_t)':856../../src/node_file_utils.cc:62:32: warning: enumerated and non-enumerated type in conditional expression [-Wextra]857 62 | int err = req.result < 0 ? req.result : UV_EIO;858 | ~~~~~~~~~~~~~~~^~~~~~~~~~~~~~~~~~~~~859[176/1871] CXX obj/gen/node_base.node_javascript.o860In file included from ../../src/memory_tracker.h:6,861 from ../../src/aliased_buffer.h:7,862 from ../../src/aliased_buffer-inl.h:6,863 from ../../src/env-inl.h:27,864 from gen/node_javascript.cc:2:865../../deps/v8/include/v8-profiler.h: In constructor 'v8::HeapProfiler::HeapSnapshotOptions::HeapSnapshotOptions()':866../../deps/v8/include/v8-profiler.h:1128:27: warning: 'v8::HeapProfiler::HeapSnapshotOptions::global_object_name_resolver' is deprecated: Use context_name_resolver callback instead. [-Wdeprecated-declarations]867 1128 | HeapSnapshotOptions() {}868 | ^869../../deps/v8/include/v8-profiler.h:1142:25: note: declared here870 1142 | ObjectNameResolver* global_object_name_resolver = nullptr;871 | ^~~~~~~~~~~~~~~~~~~~~~~~~~~872../../deps/v8/include/v8-profiler.h:1128:27: warning: 'v8::HeapProfiler::HeapSnapshotOptions::global_object_name_resolver' is deprecated: Use context_name_resolver callback instead. [-Wdeprecated-declarations]873 1128 | HeapSnapshotOptions() {}874 | ^875../../deps/v8/include/v8-profiler.h:1142:25: note: declared here876 1142 | ObjectNameResolver* global_object_name_resolver = nullptr;877 | ^~~~~~~~~~~~~~~~~~~~~~~~~~~878[177/1871] CXX obj/src/node_base.js_native_api_v8.o879In file included from ../../src/memory_tracker.h:6,880 from ../../src/aliased_buffer.h:7,881 from ../../src/aliased_buffer-inl.h:6,882 from ../../src/env-inl.h:27,883 from ../../src/js_native_api_v8.cc:7:884../../deps/v8/include/v8-profiler.h: In constructor 'v8::HeapProfiler::HeapSnapshotOptions::HeapSnapshotOptions()':885../../deps/v8/include/v8-profiler.h:1128:27: warning: 'v8::HeapProfiler::HeapSnapshotOptions::global_object_name_resolver' is deprecated: Use context_name_resolver callback instead. [-Wdeprecated-declarations]886 1128 | HeapSnapshotOptions() {}887 | ^888../../deps/v8/include/v8-profiler.h:1142:25: note: declared here889 1142 | ObjectNameResolver* global_object_name_resolver = nullptr;890 | ^~~~~~~~~~~~~~~~~~~~~~~~~~~891../../deps/v8/include/v8-profiler.h:1128:27: warning: 'v8::HeapProfiler::HeapSnapshotOptions::global_object_name_resolver' is deprecated: Use context_name_resolver callback instead. [-Wdeprecated-declarations]892 1128 | HeapSnapshotOptions() {}893 | ^894../../deps/v8/include/v8-profiler.h:1142:25: note: declared here895 1142 | ObjectNameResolver* global_object_name_resolver = nullptr;896 | ^~~~~~~~~~~~~~~~~~~~~~~~~~~897[178/1871] CXX obj/src/node_base.node_api.o898In file included from ../../src/memory_tracker.h:6,899 from ../../src/base_object.h:29,900 from ../../src/async_context_frame.h:6,901 from ../../src/node_api.cc:1:902../../deps/v8/include/v8-profiler.h: In constructor 'v8::HeapProfiler::HeapSnapshotOptions::HeapSnapshotOptions()':903../../deps/v8/include/v8-profiler.h:1128:27: warning: 'v8::HeapProfiler::HeapSnapshotOptions::global_object_name_resolver' is deprecated: Use context_name_resolver callback instead. [-Wdeprecated-declarations]904 1128 | HeapSnapshotOptions() {}905 | ^906../../deps/v8/include/v8-profiler.h:1142:25: note: declared here907 1142 | ObjectNameResolver* global_object_name_resolver = nullptr;908 | ^~~~~~~~~~~~~~~~~~~~~~~~~~~909../../deps/v8/include/v8-profiler.h:1128:27: warning: 'v8::HeapProfiler::HeapSnapshotOptions::global_object_name_resolver' is deprecated: Use context_name_resolver callback instead. [-Wdeprecated-declarations]910 1128 | HeapSnapshotOptions() {}911 | ^912../../deps/v8/include/v8-profiler.h:1142:25: note: declared here913 1142 | ObjectNameResolver* global_object_name_resolver = nullptr;914 | ^~~~~~~~~~~~~~~~~~~~~~~~~~~915[179/1871] CXX obj/src/node_base.module_wrap.o916In file included from ../../src/memory_tracker.h:6,917 from ../../src/base_object.h:29,918 from ../../src/module_wrap.h:10,919 from ../../src/module_wrap.cc:1:920../../deps/v8/include/v8-profiler.h: In constructor 'v8::HeapProfiler::HeapSnapshotOptions::HeapSnapshotOptions()':921../../deps/v8/include/v8-profiler.h:1128:27: warning: 'v8::HeapProfiler::HeapSnapshotOptions::global_object_name_resolver' is deprecated: Use context_name_resolver callback instead. [-Wdeprecated-declarations]922 1128 | HeapSnapshotOptions() {}923 | ^924../../deps/v8/include/v8-profiler.h:1142:25: note: declared here925 1142 | ObjectNameResolver* global_object_name_resolver = nullptr;926 | ^~~~~~~~~~~~~~~~~~~~~~~~~~~927../../deps/v8/include/v8-profiler.h:1128:27: warning: 'v8::HeapProfiler::HeapSnapshotOptions::global_object_name_resolver' is deprecated: Use context_name_resolver callback instead. [-Wdeprecated-declarations]928 1128 | HeapSnapshotOptions() {}929 | ^930../../deps/v8/include/v8-profiler.h:1142:25: note: declared here931 1142 | ObjectNameResolver* global_object_name_resolver = nullptr;932 | ^~~~~~~~~~~~~~~~~~~~~~~~~~~933[180/1871] CXX obj/src/node_base.cares_wrap.o934In file included from ../../src/memory_tracker.h:6,935 from ../../src/base_object.h:29,936 from ../../src/async_wrap.h:27,937 from ../../src/cares_wrap.h:8,938 from ../../src/cares_wrap.cc:22:939../../deps/v8/include/v8-profiler.h: In constructor 'v8::HeapProfiler::HeapSnapshotOptions::HeapSnapshotOptions()':940../../deps/v8/include/v8-profiler.h:1128:27: warning: 'v8::HeapProfiler::HeapSnapshotOptions::global_object_name_resolver' is deprecated: Use context_name_resolver callback instead. [-Wdeprecated-declarations]941 1128 | HeapSnapshotOptions() {}942 | ^943../../deps/v8/include/v8-profiler.h:1142:25: note: declared here944 1142 | ObjectNameResolver* global_object_name_resolver = nullptr;945 | ^~~~~~~~~~~~~~~~~~~~~~~~~~~946../../deps/v8/include/v8-profiler.h:1128:27: warning: 'v8::HeapProfiler::HeapSnapshotOptions::global_object_name_resolver' is deprecated: Use context_name_resolver callback instead. [-Wdeprecated-declarations]947 1128 | HeapSnapshotOptions() {}948 | ^949../../deps/v8/include/v8-profiler.h:1142:25: note: declared here950 1142 | ObjectNameResolver* global_object_name_resolver = nullptr;951 | ^~~~~~~~~~~~~~~~~~~~~~~~~~~952../../src/cares_wrap.cc: In function 'v8::Maybe<int> node::cares_wrap::{anonymous}::ParseGeneralReply(node::Environment*, const unsigned char*, int, int*, v8::Local<v8::Array>, void*, int*)':953../../src/cares_wrap.cc:244:34: warning: 'int ares_parse_a_reply(const unsigned char*, int, hostent**, ares_addrttl*, int*)' is deprecated: Use ares_dns_parse instead [-Wdeprecated-declarations]954 244 | status = ares_parse_a_reply(buf,955 | ~~~~~~~~~~~~~~~~~~^~~~~956 245 | len,957 | ~~~~958 246 | &host,959 | ~~~~~~960 247 | static_cast<ares_addrttl*>(addrttls),961 | ~~~~~~~~~~~~~~~~~~~~~~~~~~~~~~~~~~~~~962 248 | naddrttls);963 | ~~~~~~~~~~964In file included from ../../src/cares_wrap.h:17:965/nix/store/j239p458yixap89j6wpfib9yjypd3ii5-c-ares-1.34.8-dev/include/ares.h:1106:55: note: declared here966 1106 | CARES_EXTERN CARES_DEPRECATED_FOR(ares_dns_parse) int ares_parse_a_reply(967 | ^~~~~~~~~~~~~~~~~~968../../src/cares_wrap.cc:251:37: warning: 'int ares_parse_aaaa_reply(const unsigned char*, int, hostent**, ares_addr6ttl*, int*)' is deprecated: Use ares_dns_parse instead [-Wdeprecated-declarations]969 251 | status = ares_parse_aaaa_reply(buf,970 | ~~~~~~~~~~~~~~~~~~~~~^~~~~971 252 | len,972 | ~~~~973 253 | &host,974 | ~~~~~~975 254 | static_cast<ares_addr6ttl*>(addrttls),976 | ~~~~~~~~~~~~~~~~~~~~~~~~~~~~~~~~~~~~~~977 255 | naddrttls);978 | ~~~~~~~~~~979/nix/store/j239p458yixap89j6wpfib9yjypd3ii5-c-ares-1.34.8-dev/include/ares.h:1110:55: note: declared here980 1110 | CARES_EXTERN CARES_DEPRECATED_FOR(ares_dns_parse) int ares_parse_aaaa_reply(981 | ^~~~~~~~~~~~~~~~~~~~~982../../src/cares_wrap.cc:258:35: warning: 'int ares_parse_ns_reply(const unsigned char*, int, hostent**)' is deprecated: Use ares_dns_parse instead [-Wdeprecated-declarations]983 258 | status = ares_parse_ns_reply(buf, len, &host);984 | ~~~~~~~~~~~~~~~~~~~^~~~~~~~~~~~~~~~~985/nix/store/j239p458yixap89j6wpfib9yjypd3ii5-c-ares-1.34.8-dev/include/ares.h:1121:55: note: declared here986 1121 | CARES_EXTERN CARES_DEPRECATED_FOR(ares_dns_parse) int ares_parse_ns_reply(987 | ^~~~~~~~~~~~~~~~~~~988../../src/cares_wrap.cc:261:36: warning: 'int ares_parse_ptr_reply(const unsigned char*, int, const void*, int, int, hostent**)' is deprecated: Use ares_dns_parse instead [-Wdeprecated-declarations]989 261 | status = ares_parse_ptr_reply(buf, len, nullptr, 0, AF_INET, &host);990 | ~~~~~~~~~~~~~~~~~~~~^~~~~~~~~~~~~~~~~~~~~~~~~~~~~~~~~~~~~~991/nix/store/j239p458yixap89j6wpfib9yjypd3ii5-c-ares-1.34.8-dev/include/ares.h:1117:55: note: declared here992 1117 | CARES_EXTERN CARES_DEPRECATED_FOR(ares_dns_parse) int ares_parse_ptr_reply(993 | ^~~~~~~~~~~~~~~~~~~~994../../src/cares_wrap.cc: In function 'v8::Maybe<int> node::cares_wrap::{anonymous}::ParseMxReply(node::Environment*, const unsigned char*, int, v8::Local<v8::Array>, bool)':995../../src/cares_wrap.cc:337:35: warning: 'int ares_parse_mx_reply(const unsigned char*, int, ares_mx_reply**)' is deprecated: Use ares_dns_parse instead [-Wdeprecated-declarations]996 337 | int status = ares_parse_mx_reply(buf, len, &mx_start);997 | ~~~~~~~~~~~~~~~~~~~^~~~~~~~~~~~~~~~~~~~~998/nix/store/j239p458yixap89j6wpfib9yjypd3ii5-c-ares-1.34.8-dev/include/ares.h:1127:55: note: declared here999 1127 | CARES_EXTERN CARES_DEPRECATED_FOR(ares_dns_parse) int ares_parse_mx_reply(1000 | ^~~~~~~~~~~~~~~~~~~1001../../src/cares_wrap.cc: In function 'v8::Maybe<int> node::cares_wrap::{anonymous}::ParseCaaReply(node::Environment*, const unsigned char*, int, v8::Local<v8::Array>, bool)':1002../../src/cares_wrap.cc:383:36: warning: 'int ares_parse_caa_reply(const unsigned char*, int, ares_caa_reply**)' is deprecated: Use ares_dns_parse instead [-Wdeprecated-declarations]1003 383 | int status = ares_parse_caa_reply(buf, len, &caa_start);1004 | ~~~~~~~~~~~~~~~~~~~~^~~~~~~~~~~~~~~~~~~~~~1005/nix/store/j239p458yixap89j6wpfib9yjypd3ii5-c-ares-1.34.8-dev/include/ares.h:1114:55: note: declared here1006 1114 | CARES_EXTERN CARES_DEPRECATED_FOR(ares_dns_parse) int ares_parse_caa_reply(1007 | ^~~~~~~~~~~~~~~~~~~~1008../../src/cares_wrap.cc: In function 'v8::Maybe<int> node::cares_wrap::{anonymous}::ParseTxtReply(node::Environment*, const unsigned char*, int, v8::Local<v8::Array>, bool)':1009../../src/cares_wrap.cc:511:40: warning: 'int ares_parse_txt_reply_ext(const unsigned char*, int, ares_txt_ext**)' is deprecated: Use ares_dns_parse instead [-Wdeprecated-declarations]1010 511 | int status = ares_parse_txt_reply_ext(buf, len, &txt_out);1011 | ~~~~~~~~~~~~~~~~~~~~~~~~^~~~~~~~~~~~~~~~~~~~1012/nix/store/j239p458yixap89j6wpfib9yjypd3ii5-c-ares-1.34.8-dev/include/ares.h:1133:55: note: declared here1013 1133 | CARES_EXTERN CARES_DEPRECATED_FOR(ares_dns_parse) int ares_parse_txt_reply_ext(1014 | ^~~~~~~~~~~~~~~~~~~~~~~~1015../../src/cares_wrap.cc: In function 'v8::Maybe<int> node::cares_wrap::{anonymous}::ParseSrvReply(node::Environment*, const unsigned char*, int, v8::Local<v8::Array>, bool)':1016../../src/cares_wrap.cc:598:36: warning: 'int ares_parse_srv_reply(const unsigned char*, int, ares_srv_reply**)' is deprecated: Use ares_dns_parse instead [-Wdeprecated-declarations]1017 598 | int status = ares_parse_srv_reply(buf, len, &srv_start);1018 | ~~~~~~~~~~~~~~~~~~~~^~~~~~~~~~~~~~~~~~~~~~1019/nix/store/j239p458yixap89j6wpfib9yjypd3ii5-c-ares-1.34.8-dev/include/ares.h:1124:55: note: declared here1020 1124 | CARES_EXTERN CARES_DEPRECATED_FOR(ares_dns_parse) int ares_parse_srv_reply(1021 | ^~~~~~~~~~~~~~~~~~~~1022../../src/cares_wrap.cc: In function 'v8::Maybe<int> node::cares_wrap::{anonymous}::ParseNaptrReply(node::Environment*, const unsigned char*, int, v8::Local<v8::Array>, bool)':1023../../src/cares_wrap.cc:653:38: warning: 'int ares_parse_naptr_reply(const unsigned char*, int, ares_naptr_reply**)' is deprecated: Use ares_dns_parse instead [-Wdeprecated-declarations]1024 653 | int status = ares_parse_naptr_reply(buf, len, &naptr_start);1025 | ~~~~~~~~~~~~~~~~~~~~~~^~~~~~~~~~~~~~~~~~~~~~~~1026/nix/store/j239p458yixap89j6wpfib9yjypd3ii5-c-ares-1.34.8-dev/include/ares.h:1136:55: note: declared here1027 1136 | CARES_EXTERN CARES_DEPRECATED_FOR(ares_dns_parse) int ares_parse_naptr_reply(1028 | ^~~~~~~~~~~~~~~~~~~~~~1029../../src/cares_wrap.cc: In member function 'void node::cares_wrap::ChannelWrap::EnsureServers()':1030../../src/cares_wrap.cc:1000:25: warning: 'int ares_get_servers_ports(const ares_channel_t*, ares_addr_port_node**)' is deprecated: Use ares_get_servers_csv instead [-Wdeprecated-declarations]1031 1000 | ares_get_servers_ports(channel_, &servers);1032 | ~~~~~~~~~~~~~~~~~~~~~~^~~~~~~~~~~~~~~~~~~~1033/nix/store/j239p458yixap89j6wpfib9yjypd3ii5-c-ares-1.34.8-dev/include/ares.h:1196:28: note: declared here1034 1196 | int ares_get_servers_ports(const ares_channel_t *channel,1035 | ^~~~~~~~~~~~~~~~~~~~~~1036../../src/cares_wrap.cc: In static member function 'static v8::Maybe<int> node::cares_wrap::SoaTraits::Parse(node::cares_wrap::QuerySoaWrap*, const std::unique_ptr<node::cares_wrap::ResponseData>&)':1037../../src/cares_wrap.cc:1711:36: warning: 'int ares_parse_soa_reply(const unsigned char*, int, ares_soa_reply**)' is deprecated: Use ares_dns_parse instead [-Wdeprecated-declarations]1038 1711 | int status = ares_parse_soa_reply(buf, len, &soa_out);1039 | ~~~~~~~~~~~~~~~~~~~~^~~~~~~~~~~~~~~~~~~~1040/nix/store/j239p458yixap89j6wpfib9yjypd3ii5-c-ares-1.34.8-dev/include/ares.h:1139:55: note: declared here1041 1139 | CARES_EXTERN CARES_DEPRECATED_FOR(ares_dns_parse) int ares_parse_soa_reply(1042 | ^~~~~~~~~~~~~~~~~~~~1043../../src/cares_wrap.cc: In function 'void node::cares_wrap::{anonymous}::GetServers(const v8::FunctionCallbackInfo<v8::Value>&)':1044../../src/cares_wrap.cc:2092:33: warning: 'int ares_get_servers_ports(const ares_channel_t*, ares_addr_port_node**)' is deprecated: Use ares_get_servers_csv instead [-Wdeprecated-declarations]1045 2092 | int r = ares_get_servers_ports(channel->cares_channel(), &servers);1046 | ~~~~~~~~~~~~~~~~~~~~~~^~~~~~~~~~~~~~~~~~~~~~~~~~~~~~~~~~~~1047/nix/store/j239p458yixap89j6wpfib9yjypd3ii5-c-ares-1.34.8-dev/include/ares.h:1196:28: note: declared here1048 1196 | int ares_get_servers_ports(const ares_channel_t *channel,1049 | ^~~~~~~~~~~~~~~~~~~~~~1050../../src/cares_wrap.cc: In function 'void node::cares_wrap::{anonymous}::SetServers(const v8::FunctionCallbackInfo<v8::Value>&)':1051../../src/cares_wrap.cc:2137:30: warning: 'int ares_set_servers(ares_channel_t*, const ares_addr_node*)' is deprecated: Use ares_set_servers_csv instead [-Wdeprecated-declarations]1052 2137 | int rv = ares_set_servers(channel->cares_channel(), nullptr);1053 | ~~~~~~~~~~~~~~~~^~~~~~~~~~~~~~~~~~~~~~~~~~~~~~~~~~~1054/nix/store/j239p458yixap89j6wpfib9yjypd3ii5-c-ares-1.34.8-dev/include/ares.h:1176:61: note: declared here1055 1176 | CARES_EXTERN CARES_DEPRECATED_FOR(ares_set_servers_csv) int ares_set_servers(1056 | ^~~~~~~~~~~~~~~~1057../../src/cares_wrap.cc:2197:33: warning: 'int ares_set_servers_ports(ares_channel_t*, const ares_addr_port_node*)' is deprecated: Use ares_set_servers_ports_csv instead [-Wdeprecated-declarations]1058 2197 | err = ares_set_servers_ports(channel->cares_channel(), servers.data());1059 | ~~~~~~~~~~~~~~~~~~~~~~^~~~~~~~~~~~~~~~~~~~~~~~~~~~~~~~~~~~~~~~~~1060/nix/store/j239p458yixap89j6wpfib9yjypd3ii5-c-ares-1.34.8-dev/include/ares.h:1181:20: note: declared here1061 1181 | int ares_set_servers_ports(ares_channel_t *channel,1062 | ^~~~~~~~~~~~~~~~~~~~~~1063[181/1871] CXX obj/src/node_base.node.o1064In file included from ../../src/memory_tracker.h:6,1065 from ../../src/aliased_buffer.h:7,1066 from ../../src/env.h:27,1067 from ../../src/node_internals.h:27,1068 from ../../src/node_config_file.h:12,1069 from ../../src/node.cc:23:1070../../deps/v8/include/v8-profiler.h: In constructor 'v8::HeapProfiler::HeapSnapshotOptions::HeapSnapshotOptions()':1071../../deps/v8/include/v8-profiler.h:1128:27: warning: 'v8::HeapProfiler::HeapSnapshotOptions::global_object_name_resolver' is deprecated: Use context_name_resolver callback instead. [-Wdeprecated-declarations]1072 1128 | HeapSnapshotOptions() {}1073 | ^1074../../deps/v8/include/v8-profiler.h:1142:25: note: declared here1075 1142 | ObjectNameResolver* global_object_name_resolver = nullptr;1076 | ^~~~~~~~~~~~~~~~~~~~~~~~~~~1077../../deps/v8/include/v8-profiler.h:1128:27: warning: 'v8::HeapProfiler::HeapSnapshotOptions::global_object_name_resolver' is deprecated: Use context_name_resolver callback instead. [-Wdeprecated-declarations]1078 1128 | HeapSnapshotOptions() {}1079 | ^1080../../deps/v8/include/v8-profiler.h:1142:25: note: declared here1081 1142 | ObjectNameResolver* global_object_name_resolver = nullptr;1082 | ^~~~~~~~~~~~~~~~~~~~~~~~~~~1083[182/1871] CXX obj/src/node_base.node_constants.o1084In file included from ../../src/memory_tracker.h:6,1085 from ../../src/aliased_buffer.h:7,1086 from ../../src/aliased_buffer-inl.h:6,1087 from ../../src/env-inl.h:27,1088 from ../../src/node_constants.cc:22:1089../../deps/v8/include/v8-profiler.h: In constructor 'v8::HeapProfiler::HeapSnapshotOptions::HeapSnapshotOptions()':1090../../deps/v8/include/v8-profiler.h:1128:27: warning: 'v8::HeapProfiler::HeapSnapshotOptions::global_object_name_resolver' is deprecated: Use context_name_resolver callback instead. [-Wdeprecated-declarations]1091 1128 | HeapSnapshotOptions() {}1092 | ^1093../../deps/v8/include/v8-profiler.h:1142:25: note: declared here1094 1142 | ObjectNameResolver* global_object_name_resolver = nullptr;1095 | ^~~~~~~~~~~~~~~~~~~~~~~~~~~1096../../deps/v8/include/v8-profiler.h:1128:27: warning: 'v8::HeapProfiler::HeapSnapshotOptions::global_object_name_resolver' is deprecated: Use context_name_resolver callback instead. [-Wdeprecated-declarations]1097 1128 | HeapSnapshotOptions() {}1098 | ^1099../../deps/v8/include/v8-profiler.h:1142:25: note: declared here1100 1142 | ObjectNameResolver* global_object_name_resolver = nullptr;1101 | ^~~~~~~~~~~~~~~~~~~~~~~~~~~1102[183/1871] CXX obj/src/node_base.node_config.o1103In file included from ../../src/memory_tracker.h:6,1104 from ../../src/aliased_buffer.h:7,1105 from ../../src/aliased_buffer-inl.h:6,1106 from ../../src/env-inl.h:27,1107 from ../../src/node_config.cc:1:1108../../deps/v8/include/v8-profiler.h: In constructor 'v8::HeapProfiler::HeapSnapshotOptions::HeapSnapshotOptions()':1109../../deps/v8/include/v8-profiler.h:1128:27: warning: 'v8::HeapProfiler::HeapSnapshotOptions::global_object_name_resolver' is deprecated: Use context_name_resolver callback instead. [-Wdeprecated-declarations]1110 1128 | HeapSnapshotOptions() {}1111 | ^1112../../deps/v8/include/v8-profiler.h:1142:25: note: declared here1113 1142 | ObjectNameResolver* global_object_name_resolver = nullptr;1114 | ^~~~~~~~~~~~~~~~~~~~~~~~~~~1115../../deps/v8/include/v8-profiler.h:1128:27: warning: 'v8::HeapProfiler::HeapSnapshotOptions::global_object_name_resolver' is deprecated: Use context_name_resolver callback instead. [-Wdeprecated-declarations]1116 1128 | HeapSnapshotOptions() {}1117 | ^1118../../deps/v8/include/v8-profiler.h:1142:25: note: declared here1119 1142 | ObjectNameResolver* global_object_name_resolver = nullptr;1120 | ^~~~~~~~~~~~~~~~~~~~~~~~~~~1121[184/1871] CXX obj/src/node_base.node_cjs_lexer.o1122In file included from ../../src/memory_tracker.h:6,1123 from ../../src/aliased_buffer.h:7,1124 from ../../src/aliased_buffer-inl.h:6,1125 from ../../src/env-inl.h:27,1126 from ../../src/node_cjs_lexer.cc:1:1127../../deps/v8/include/v8-profiler.h: In constructor 'v8::HeapProfiler::HeapSnapshotOptions::HeapSnapshotOptions()':1128../../deps/v8/include/v8-profiler.h:1128:27: warning: 'v8::HeapProfiler::HeapSnapshotOptions::global_object_name_resolver' is deprecated: Use context_name_resolver callback instead. [-Wdeprecated-declarations]1129 1128 | HeapSnapshotOptions() {}1130 | ^1131../../deps/v8/include/v8-profiler.h:1142:25: note: declared here1132 1142 | ObjectNameResolver* global_object_name_resolver = nullptr;1133 | ^~~~~~~~~~~~~~~~~~~~~~~~~~~1134../../deps/v8/include/v8-profiler.h:1128:27: warning: 'v8::HeapProfiler::HeapSnapshotOptions::global_object_name_resolver' is deprecated: Use context_name_resolver callback instead. [-Wdeprecated-declarations]1135 1128 | HeapSnapshotOptions() {}1136 | ^1137../../deps/v8/include/v8-profiler.h:1142:25: note: declared here1138 1142 | ObjectNameResolver* global_object_name_resolver = nullptr;1139 | ^~~~~~~~~~~~~~~~~~~~~~~~~~~1140[185/1871] CXX obj/src/node_base.node_credentials.o1141In file included from ../../src/memory_tracker.h:6,1142 from ../../src/aliased_buffer.h:7,1143 from ../../src/aliased_buffer-inl.h:6,1144 from ../../src/env-inl.h:27,1145 from ../../src/node_credentials.cc:1:1146../../deps/v8/include/v8-profiler.h: In constructor 'v8::HeapProfiler::HeapSnapshotOptions::HeapSnapshotOptions()':1147../../deps/v8/include/v8-profiler.h:1128:27: warning: 'v8::HeapProfiler::HeapSnapshotOptions::global_object_name_resolver' is deprecated: Use context_name_resolver callback instead. [-Wdeprecated-declarations]1148 1128 | HeapSnapshotOptions() {}1149 | ^1150../../deps/v8/include/v8-profiler.h:1142:25: note: declared here1151 1142 | ObjectNameResolver* global_object_name_resolver = nullptr;1152 | ^~~~~~~~~~~~~~~~~~~~~~~~~~~1153../../deps/v8/include/v8-profiler.h:1128:27: warning: 'v8::HeapProfiler::HeapSnapshotOptions::global_object_name_resolver' is deprecated: Use context_name_resolver callback instead. [-Wdeprecated-declarations]1154 1128 | HeapSnapshotOptions() {}1155 | ^1156../../deps/v8/include/v8-profiler.h:1142:25: note: declared here1157 1142 | ObjectNameResolver* global_object_name_resolver = nullptr;1158 | ^~~~~~~~~~~~~~~~~~~~~~~~~~~1159[186/1871] CXX obj/src/node_base.node_dir.o1160In file included from ../../src/memory_tracker.h:6,1161 from ../../src/aliased_buffer.h:7,1162 from ../../src/node_file.h:7,1163 from ../../src/node_dir.h:6,1164 from ../../src/node_dir.cc:1:1165../../deps/v8/include/v8-profiler.h: In constructor 'v8::HeapProfiler::HeapSnapshotOptions::HeapSnapshotOptions()':1166../../deps/v8/include/v8-profiler.h:1128:27: warning: 'v8::HeapProfiler::HeapSnapshotOptions::global_object_name_resolver' is deprecated: Use context_name_resolver callback instead. [-Wdeprecated-declarations]1167 1128 | HeapSnapshotOptions() {}1168 | ^1169../../deps/v8/include/v8-profiler.h:1142:25: note: declared here1170 1142 | ObjectNameResolver* global_object_name_resolver = nullptr;1171 | ^~~~~~~~~~~~~~~~~~~~~~~~~~~1172../../deps/v8/include/v8-profiler.h:1128:27: warning: 'v8::HeapProfiler::HeapSnapshotOptions::global_object_name_resolver' is deprecated: Use context_name_resolver callback instead. [-Wdeprecated-declarations]1173 1128 | HeapSnapshotOptions() {}1174 | ^1175../../deps/v8/include/v8-profiler.h:1142:25: note: declared here1176 1142 | ObjectNameResolver* global_object_name_resolver = nullptr;1177 | ^~~~~~~~~~~~~~~~~~~~~~~~~~~1178[187/1871] CXX obj/src/node_base.node_env_var.o1179In file included from ../../src/memory_tracker.h:6,1180 from ../../src/base_object.h:29,1181 from ../../src/async_wrap.h:27,1182 from ../../src/debug_utils.h:6,1183 from ../../src/debug_utils-inl.h:6,1184 from ../../src/node_env_var.cc:1:1185../../deps/v8/include/v8-profiler.h: In constructor 'v8::HeapProfiler::HeapSnapshotOptions::HeapSnapshotOptions()':1186../../deps/v8/include/v8-profiler.h:1128:27: warning: 'v8::HeapProfiler::HeapSnapshotOptions::global_object_name_resolver' is deprecated: Use context_name_resolver callback instead. [-Wdeprecated-declarations]1187 1128 | HeapSnapshotOptions() {}1188 | ^1189../../deps/v8/include/v8-profiler.h:1142:25: note: declared here1190 1142 | ObjectNameResolver* global_object_name_resolver = nullptr;1191 | ^~~~~~~~~~~~~~~~~~~~~~~~~~~1192../../deps/v8/include/v8-profiler.h:1128:27: warning: 'v8::HeapProfiler::HeapSnapshotOptions::global_object_name_resolver' is deprecated: Use context_name_resolver callback instead. [-Wdeprecated-declarations]1193 1128 | HeapSnapshotOptions() {}1194 | ^1195../../deps/v8/include/v8-profiler.h:1142:25: note: declared here1196 1142 | ObjectNameResolver* global_object_name_resolver = nullptr;1197 | ^~~~~~~~~~~~~~~~~~~~~~~~~~~1198[188/1871] CXX obj/src/node_base.node_dotenv.o1199In file included from ../../src/util.h:29,1200 from ../../src/util-inl.h:33,1201 from ../../src/node_dotenv.h:6,1202 from ../../src/node_dotenv.cc:1:1203../../deps/v8/include/v8-profiler.h: In constructor 'v8::HeapProfiler::HeapSnapshotOptions::HeapSnapshotOptions()':1204../../deps/v8/include/v8-profiler.h:1128:27: warning: 'v8::HeapProfiler::HeapSnapshotOptions::global_object_name_resolver' is deprecated: Use context_name_resolver callback instead. [-Wdeprecated-declarations]1205 1128 | HeapSnapshotOptions() {}1206 | ^1207../../deps/v8/include/v8-profiler.h:1142:25: note: declared here1208 1142 | ObjectNameResolver* global_object_name_resolver = nullptr;1209 | ^~~~~~~~~~~~~~~~~~~~~~~~~~~1210../../deps/v8/include/v8-profiler.h:1128:27: warning: 'v8::HeapProfiler::HeapSnapshotOptions::global_object_name_resolver' is deprecated: Use context_name_resolver callback instead. [-Wdeprecated-declarations]1211 1128 | HeapSnapshotOptions() {}1212 | ^1213../../deps/v8/include/v8-profiler.h:1142:25: note: declared here1214 1142 | ObjectNameResolver* global_object_name_resolver = nullptr;1215 | ^~~~~~~~~~~~~~~~~~~~~~~~~~~1216[189/1871] CXX obj/src/node_base.node_binding.o1217In file included from ../../src/memory_tracker.h:6,1218 from ../../src/aliased_buffer.h:7,1219 from ../../src/aliased_buffer-inl.h:6,1220 from ../../src/env-inl.h:27,1221 from ../../src/node_binding.cc:3:1222../../deps/v8/include/v8-profiler.h: In constructor 'v8::HeapProfiler::HeapSnapshotOptions::HeapSnapshotOptions()':1223../../deps/v8/include/v8-profiler.h:1128:27: warning: 'v8::HeapProfiler::HeapSnapshotOptions::global_object_name_resolver' is deprecated: Use context_name_resolver callback instead. [-Wdeprecated-declarations]1224 1128 | HeapSnapshotOptions() {}1225 | ^1226../../deps/v8/include/v8-profiler.h:1142:25: note: declared here1227 1142 | ObjectNameResolver* global_object_name_resolver = nullptr;1228 | ^~~~~~~~~~~~~~~~~~~~~~~~~~~1229../../deps/v8/include/v8-profiler.h:1128:27: warning: 'v8::HeapProfiler::HeapSnapshotOptions::global_object_name_resolver' is deprecated: Use context_name_resolver callback instead. [-Wdeprecated-declarations]1230 1128 | HeapSnapshotOptions() {}1231 | ^1232../../deps/v8/include/v8-profiler.h:1142:25: note: declared here1233 1142 | ObjectNameResolver* global_object_name_resolver = nullptr;1234 | ^~~~~~~~~~~~~~~~~~~~~~~~~~~1235[190/1871] CXX obj/src/node_base.node_config_file.o1236In file included from ../../src/memory_tracker.h:6,1237 from ../../src/aliased_buffer.h:7,1238 from ../../src/env.h:27,1239 from ../../src/node_internals.h:27,1240 from ../../src/node_config_file.h:12,1241 from ../../src/node_config_file.cc:1:1242../../deps/v8/include/v8-profiler.h: In constructor 'v8::HeapProfiler::HeapSnapshotOptions::HeapSnapshotOptions()':1243../../deps/v8/include/v8-profiler.h:1128:27: warning: 'v8::HeapProfiler::HeapSnapshotOptions::global_object_name_resolver' is deprecated: Use context_name_resolver callback instead. [-Wdeprecated-declarations]1244 1128 | HeapSnapshotOptions() {}1245 | ^1246../../deps/v8/include/v8-profiler.h:1142:25: note: declared here1247 1142 | ObjectNameResolver* global_object_name_resolver = nullptr;1248 | ^~~~~~~~~~~~~~~~~~~~~~~~~~~1249../../deps/v8/include/v8-profiler.h:1128:27: warning: 'v8::HeapProfiler::HeapSnapshotOptions::global_object_name_resolver' is deprecated: Use context_name_resolver callback instead. [-Wdeprecated-declarations]1250 1128 | HeapSnapshotOptions() {}1251 | ^1252../../deps/v8/include/v8-profiler.h:1142:25: note: declared here1253 1142 | ObjectNameResolver* global_object_name_resolver = nullptr;1254 | ^~~~~~~~~~~~~~~~~~~~~~~~~~~1255[191/1871] CXX obj/src/node_base.node_external_reference.o1256In file included from ../../src/memory_tracker.h:6,1257 from ../../src/base_object.h:29,1258 from ../../src/base_object-inl.h:27,1259 from ../../src/node_external_reference.cc:4:1260../../deps/v8/include/v8-profiler.h: In constructor 'v8::HeapProfiler::HeapSnapshotOptions::HeapSnapshotOptions()':1261../../deps/v8/include/v8-profiler.h:1128:27: warning: 'v8::HeapProfiler::HeapSnapshotOptions::global_object_name_resolver' is deprecated: Use context_name_resolver callback instead. [-Wdeprecated-declarations]1262 1128 | HeapSnapshotOptions() {}1263 | ^1264../../deps/v8/include/v8-profiler.h:1142:25: note: declared here1265 1142 | ObjectNameResolver* global_object_name_resolver = nullptr;1266 | ^~~~~~~~~~~~~~~~~~~~~~~~~~~1267../../deps/v8/include/v8-profiler.h:1128:27: warning: 'v8::HeapProfiler::HeapSnapshotOptions::global_object_name_resolver' is deprecated: Use context_name_resolver callback instead. [-Wdeprecated-declarations]1268 1128 | HeapSnapshotOptions() {}1269 | ^1270../../deps/v8/include/v8-profiler.h:1142:25: note: declared here1271 1142 | ObjectNameResolver* global_object_name_resolver = nullptr;1272 | ^~~~~~~~~~~~~~~~~~~~~~~~~~~1273[192/1871] CXX obj/deps/v8/src/torque/torque_base.implementation-visitor.o1274[193/1871] CXX obj/src/node_base.node_blob.o1275In file included from ../../src/memory_tracker.h:6,1276 from ../../src/base_object.h:29,1277 from ../../src/async_wrap.h:27,1278 from ../../src/node_blob.h:8,1279 from ../../src/node_blob.cc:1:1280../../deps/v8/include/v8-profiler.h: In constructor 'v8::HeapProfiler::HeapSnapshotOptions::HeapSnapshotOptions()':1281../../deps/v8/include/v8-profiler.h:1128:27: warning: 'v8::HeapProfiler::HeapSnapshotOptions::global_object_name_resolver' is deprecated: Use context_name_resolver callback instead. [-Wdeprecated-declarations]1282 1128 | HeapSnapshotOptions() {}1283 | ^1284../../deps/v8/include/v8-profiler.h:1142:25: note: declared here1285 1142 | ObjectNameResolver* global_object_name_resolver = nullptr;1286 | ^~~~~~~~~~~~~~~~~~~~~~~~~~~1287../../deps/v8/include/v8-profiler.h:1128:27: warning: 'v8::HeapProfiler::HeapSnapshotOptions::global_object_name_resolver' is deprecated: Use context_name_resolver callback instead. [-Wdeprecated-declarations]1288 1128 | HeapSnapshotOptions() {}1289 | ^1290../../deps/v8/include/v8-profiler.h:1142:25: note: declared here1291 1142 | ObjectNameResolver* global_object_name_resolver = nullptr;1292 | ^~~~~~~~~~~~~~~~~~~~~~~~~~~1293[194/1871] CXX obj/src/node_base.node_http_parser.o1294In file included from ../../src/util.h:29,1295 from ../../src/node_http_parser.cc:24:1296../../deps/v8/include/v8-profiler.h: In constructor 'v8::HeapProfiler::HeapSnapshotOptions::HeapSnapshotOptions()':1297../../deps/v8/include/v8-profiler.h:1128:27: warning: 'v8::HeapProfiler::HeapSnapshotOptions::global_object_name_resolver' is deprecated: Use context_name_resolver callback instead. [-Wdeprecated-declarations]1298 1128 | HeapSnapshotOptions() {}1299 | ^1300../../deps/v8/include/v8-profiler.h:1142:25: note: declared here1301 1142 | ObjectNameResolver* global_object_name_resolver = nullptr;1302 | ^~~~~~~~~~~~~~~~~~~~~~~~~~~1303../../deps/v8/include/v8-profiler.h:1128:27: warning: 'v8::HeapProfiler::HeapSnapshotOptions::global_object_name_resolver' is deprecated: Use context_name_resolver callback instead. [-Wdeprecated-declarations]1304 1128 | HeapSnapshotOptions() {}1305 | ^1306../../deps/v8/include/v8-profiler.h:1142:25: note: declared here1307 1142 | ObjectNameResolver* global_object_name_resolver = nullptr;1308 | ^~~~~~~~~~~~~~~~~~~~~~~~~~~1309[195/1871] CXX obj/src/node_base.node_buffer.o1310In file included from ../../src/memory_tracker.h:6,1311 from ../../src/base_object.h:29,1312 from ../../src/async_wrap.h:27,1313 from ../../src/node_blob.h:8,1314 from ../../src/node_buffer.cc:24:1315../../deps/v8/include/v8-profiler.h: In constructor 'v8::HeapProfiler::HeapSnapshotOptions::HeapSnapshotOptions()':1316../../deps/v8/include/v8-profiler.h:1128:27: warning: 'v8::HeapProfiler::HeapSnapshotOptions::global_object_name_resolver' is deprecated: Use context_name_resolver callback instead. [-Wdeprecated-declarations]1317 1128 | HeapSnapshotOptions() {}1318 | ^1319../../deps/v8/include/v8-profiler.h:1142:25: note: declared here1320 1142 | ObjectNameResolver* global_object_name_resolver = nullptr;1321 | ^~~~~~~~~~~~~~~~~~~~~~~~~~~1322../../deps/v8/include/v8-profiler.h:1128:27: warning: 'v8::HeapProfiler::HeapSnapshotOptions::global_object_name_resolver' is deprecated: Use context_name_resolver callback instead. [-Wdeprecated-declarations]1323 1128 | HeapSnapshotOptions() {}1324 | ^1325../../deps/v8/include/v8-profiler.h:1142:25: note: declared here1326 1142 | ObjectNameResolver* global_object_name_resolver = nullptr;1327 | ^~~~~~~~~~~~~~~~~~~~~~~~~~~1328[196/1871] CXX obj/src/node_base.node_errors.o1329In file included from ../../src/memory_tracker.h:6,1330 from ../../src/base_object.h:29,1331 from ../../src/async_wrap.h:27,1332 from ../../src/debug_utils.h:6,1333 from ../../src/debug_utils-inl.h:6,1334 from ../../src/node_errors.cc:6:1335../../deps/v8/include/v8-profiler.h: In constructor 'v8::HeapProfiler::HeapSnapshotOptions::HeapSnapshotOptions()':1336../../deps/v8/include/v8-profiler.h:1128:27: warning: 'v8::HeapProfiler::HeapSnapshotOptions::global_object_name_resolver' is deprecated: Use context_name_resolver callback instead. [-Wdeprecated-declarations]1337 1128 | HeapSnapshotOptions() {}1338 | ^1339../../deps/v8/include/v8-profiler.h:1142:25: note: declared here1340 1142 | ObjectNameResolver* global_object_name_resolver = nullptr;1341 | ^~~~~~~~~~~~~~~~~~~~~~~~~~~1342../../deps/v8/include/v8-profiler.h:1128:27: warning: 'v8::HeapProfiler::HeapSnapshotOptions::global_object_name_resolver' is deprecated: Use context_name_resolver callback instead. [-Wdeprecated-declarations]1343 1128 | HeapSnapshotOptions() {}1344 | ^1345../../deps/v8/include/v8-profiler.h:1142:25: note: declared here1346 1142 | ObjectNameResolver* global_object_name_resolver = nullptr;1347 | ^~~~~~~~~~~~~~~~~~~~~~~~~~~1348[197/1871] CXX obj/src/node_base.node_builtins.o1349In file included from ../../src/util.h:29,1350 from ../../src/node_mutex.h:6,1351 from ../../src/node_builtins.h:16,1352 from ../../src/node_builtins.cc:1:1353../../deps/v8/include/v8-profiler.h: In constructor 'v8::HeapProfiler::HeapSnapshotOptions::HeapSnapshotOptions()':1354../../deps/v8/include/v8-profiler.h:1128:27: warning: 'v8::HeapProfiler::HeapSnapshotOptions::global_object_name_resolver' is deprecated: Use context_name_resolver callback instead. [-Wdeprecated-declarations]1355 1128 | HeapSnapshotOptions() {}1356 | ^1357../../deps/v8/include/v8-profiler.h:1142:25: note: declared here1358 1142 | ObjectNameResolver* global_object_name_resolver = nullptr;1359 | ^~~~~~~~~~~~~~~~~~~~~~~~~~~1360../../deps/v8/include/v8-profiler.h:1128:27: warning: 'v8::HeapProfiler::HeapSnapshotOptions::global_object_name_resolver' is deprecated: Use context_name_resolver callback instead. [-Wdeprecated-declarations]1361 1128 | HeapSnapshotOptions() {}1362 | ^1363../../deps/v8/include/v8-profiler.h:1142:25: note: declared here1364 1142 | ObjectNameResolver* global_object_name_resolver = nullptr;1365 | ^~~~~~~~~~~~~~~~~~~~~~~~~~~1366[198/1871] CXX obj/src/node_base.node_profiling.o1367In file included from ../../src/node_profiling.h:6,1368 from ../../src/node_profiling.cc:1:1369../../deps/v8/include/v8-profiler.h: In constructor 'v8::HeapProfiler::HeapSnapshotOptions::HeapSnapshotOptions()':1370../../deps/v8/include/v8-profiler.h:1128:27: warning: 'v8::HeapProfiler::HeapSnapshotOptions::global_object_name_resolver' is deprecated: Use context_name_resolver callback instead. [-Wdeprecated-declarations]1371 1128 | HeapSnapshotOptions() {}1372 | ^1373../../deps/v8/include/v8-profiler.h:1142:25: note: declared here1374 1142 | ObjectNameResolver* global_object_name_resolver = nullptr;1375 | ^~~~~~~~~~~~~~~~~~~~~~~~~~~1376../../deps/v8/include/v8-profiler.h:1128:27: warning: 'v8::HeapProfiler::HeapSnapshotOptions::global_object_name_resolver' is deprecated: Use context_name_resolver callback instead. [-Wdeprecated-declarations]1377 1128 | HeapSnapshotOptions() {}1378 | ^1379../../deps/v8/include/v8-profiler.h:1142:25: note: declared here1380 1142 | ObjectNameResolver* global_object_name_resolver = nullptr;1381 | ^~~~~~~~~~~~~~~~~~~~~~~~~~~1382[199/1871] CXX obj/deps/v8/src/torque/torque_base.torque-parser.o1383[200/1871] AR obj/tools/v8_gypfiles/libtorque_base.a1384[201/1871] STAMP obj/tools/v8_gypfiles/torque.actions_depends.stamp1385[202/1871] CXX obj/src/node_base.node_ipc_serdes.o1386In file included from ../../src/memory_tracker.h:6,1387 from ../../src/aliased_buffer.h:7,1388 from ../../src/aliased_buffer-inl.h:6,1389 from ../../src/env-inl.h:27,1390 from ../../src/node_ipc_serdes.cc:1:1391../../deps/v8/include/v8-profiler.h: In constructor 'v8::HeapProfiler::HeapSnapshotOptions::HeapSnapshotOptions()':1392../../deps/v8/include/v8-profiler.h:1128:27: warning: 'v8::HeapProfiler::HeapSnapshotOptions::global_object_name_resolver' is deprecated: Use context_name_resolver callback instead. [-Wdeprecated-declarations]1393 1128 | HeapSnapshotOptions() {}1394 | ^1395../../deps/v8/include/v8-profiler.h:1142:25: note: declared here1396 1142 | ObjectNameResolver* global_object_name_resolver = nullptr;1397 | ^~~~~~~~~~~~~~~~~~~~~~~~~~~1398../../deps/v8/include/v8-profiler.h:1128:27: warning: 'v8::HeapProfiler::HeapSnapshotOptions::global_object_name_resolver' is deprecated: Use context_name_resolver callback instead. [-Wdeprecated-declarations]1399 1128 | HeapSnapshotOptions() {}1400 | ^1401../../deps/v8/include/v8-profiler.h:1142:25: note: declared here1402 1142 | ObjectNameResolver* global_object_name_resolver = nullptr;1403 | ^~~~~~~~~~~~~~~~~~~~~~~~~~~1404[203/1871] CXX obj/deps/v8/third_party/simdutf/simdutf.simdutf.o1405[204/1871] AR obj/tools/v8_gypfiles/libsimdutf.a1406[205/1871] CXX obj/src/node_base.node_i18n.o1407In file included from ../../src/memory_tracker.h:6,1408 from ../../src/base_object.h:29,1409 from ../../src/node_i18n.h:29,1410 from ../../src/node_i18n.cc:43:1411../../deps/v8/include/v8-profiler.h: In constructor 'v8::HeapProfiler::HeapSnapshotOptions::HeapSnapshotOptions()':1412../../deps/v8/include/v8-profiler.h:1128:27: warning: 'v8::HeapProfiler::HeapSnapshotOptions::global_object_name_resolver' is deprecated: Use context_name_resolver callback instead. [-Wdeprecated-declarations]1413 1128 | HeapSnapshotOptions() {}1414 | ^1415../../deps/v8/include/v8-profiler.h:1142:25: note: declared here1416 1142 | ObjectNameResolver* global_object_name_resolver = nullptr;1417 | ^~~~~~~~~~~~~~~~~~~~~~~~~~~1418../../deps/v8/include/v8-profiler.h:1128:27: warning: 'v8::HeapProfiler::HeapSnapshotOptions::global_object_name_resolver' is deprecated: Use context_name_resolver callback instead. [-Wdeprecated-declarations]1419 1128 | HeapSnapshotOptions() {}1420 | ^1421../../deps/v8/include/v8-profiler.h:1142:25: note: declared here1422 1142 | ObjectNameResolver* global_object_name_resolver = nullptr;1423 | ^~~~~~~~~~~~~~~~~~~~~~~~~~~1424[206/1871] CXX obj/src/node_base.node_contextify.o1425In file included from ../../src/memory_tracker.h:6,1426 from ../../src/base_object.h:29,1427 from ../../src/base_object-inl.h:27,1428 from ../../src/node_contextify.h:6,1429 from ../../src/node_contextify.cc:22:1430../../deps/v8/include/v8-profiler.h: In constructor 'v8::HeapProfiler::HeapSnapshotOptions::HeapSnapshotOptions()':1431../../deps/v8/include/v8-profiler.h:1128:27: warning: 'v8::HeapProfiler::HeapSnapshotOptions::global_object_name_resolver' is deprecated: Use context_name_resolver callback instead. [-Wdeprecated-declarations]1432 1128 | HeapSnapshotOptions() {}1433 | ^1434../../deps/v8/include/v8-profiler.h:1142:25: note: declared here1435 1142 | ObjectNameResolver* global_object_name_resolver = nullptr;1436 | ^~~~~~~~~~~~~~~~~~~~~~~~~~~1437../../deps/v8/include/v8-profiler.h:1128:27: warning: 'v8::HeapProfiler::HeapSnapshotOptions::global_object_name_resolver' is deprecated: Use context_name_resolver callback instead. [-Wdeprecated-declarations]1438 1128 | HeapSnapshotOptions() {}1439 | ^1440../../deps/v8/include/v8-profiler.h:1142:25: note: declared here1441 1142 | ObjectNameResolver* global_object_name_resolver = nullptr;1442 | ^~~~~~~~~~~~~~~~~~~~~~~~~~~1443[207/1871] LINK torque1444[208/1871] CXX obj/src/node_base.node_metadata.o1445In file included from ../../src/util.h:29,1446 from ../../src/node_metadata.cc:22:1447../../deps/v8/include/v8-profiler.h: In constructor 'v8::HeapProfiler::HeapSnapshotOptions::HeapSnapshotOptions()':1448../../deps/v8/include/v8-profiler.h:1128:27: warning: 'v8::HeapProfiler::HeapSnapshotOptions::global_object_name_resolver' is deprecated: Use context_name_resolver callback instead. [-Wdeprecated-declarations]1449 1128 | HeapSnapshotOptions() {}1450 | ^1451../../deps/v8/include/v8-profiler.h:1142:25: note: declared here1452 1142 | ObjectNameResolver* global_object_name_resolver = nullptr;1453 | ^~~~~~~~~~~~~~~~~~~~~~~~~~~1454../../deps/v8/include/v8-profiler.h:1128:27: warning: 'v8::HeapProfiler::HeapSnapshotOptions::global_object_name_resolver' is deprecated: Use context_name_resolver callback instead. [-Wdeprecated-declarations]1455 1128 | HeapSnapshotOptions() {}1456 | ^1457../../deps/v8/include/v8-profiler.h:1142:25: note: declared here1458 1142 | ObjectNameResolver* global_object_name_resolver = nullptr;1459 | ^~~~~~~~~~~~~~~~~~~~~~~~~~~1460[209/1871] CXX obj/src/node_base.node_locks.o1461In file included from ../../src/memory_tracker.h:6,1462 from ../../src/base_object.h:29,1463 from ../../src/node_locks.h:11,1464 from ../../src/node_locks.cc:1:1465../../deps/v8/include/v8-profiler.h: In constructor 'v8::HeapProfiler::HeapSnapshotOptions::HeapSnapshotOptions()':1466../../deps/v8/include/v8-profiler.h:1128:27: warning: 'v8::HeapProfiler::HeapSnapshotOptions::global_object_name_resolver' is deprecated: Use context_name_resolver callback instead. [-Wdeprecated-declarations]1467 1128 | HeapSnapshotOptions() {}1468 | ^1469../../deps/v8/include/v8-profiler.h:1142:25: note: declared here1470 1142 | ObjectNameResolver* global_object_name_resolver = nullptr;1471 | ^~~~~~~~~~~~~~~~~~~~~~~~~~~1472../../deps/v8/include/v8-profiler.h:1128:27: warning: 'v8::HeapProfiler::HeapSnapshotOptions::global_object_name_resolver' is deprecated: Use context_name_resolver callback instead. [-Wdeprecated-declarations]1473 1128 | HeapSnapshotOptions() {}1474 | ^1475../../deps/v8/include/v8-profiler.h:1142:25: note: declared here1476 1142 | ObjectNameResolver* global_object_name_resolver = nullptr;1477 | ^~~~~~~~~~~~~~~~~~~~~~~~~~~1478[210/1871] CXX obj/src/node_base.node_main_instance.o1479In file included from ../../src/util.h:29,1480 from ../../src/node_main_instance.h:11,1481 from ../../src/node_main_instance.cc:1:1482../../deps/v8/include/v8-profiler.h: In constructor 'v8::HeapProfiler::HeapSnapshotOptions::HeapSnapshotOptions()':1483../../deps/v8/include/v8-profiler.h:1128:27: warning: 'v8::HeapProfiler::HeapSnapshotOptions::global_object_name_resolver' is deprecated: Use context_name_resolver callback instead. [-Wdeprecated-declarations]1484 1128 | HeapSnapshotOptions() {}1485 | ^1486../../deps/v8/include/v8-profiler.h:1142:25: note: declared here1487 1142 | ObjectNameResolver* global_object_name_resolver = nullptr;1488 | ^~~~~~~~~~~~~~~~~~~~~~~~~~~1489../../deps/v8/include/v8-profiler.h:1128:27: warning: 'v8::HeapProfiler::HeapSnapshotOptions::global_object_name_resolver' is deprecated: Use context_name_resolver callback instead. [-Wdeprecated-declarations]1490 1128 | HeapSnapshotOptions() {}1491 | ^1492../../deps/v8/include/v8-profiler.h:1142:25: note: declared here1493 1142 | ObjectNameResolver* global_object_name_resolver = nullptr;1494 | ^~~~~~~~~~~~~~~~~~~~~~~~~~~1495[211/1871] CXX obj/src/node_base.node_diagnostics_channel.o1496In file included from ../../src/memory_tracker.h:6,1497 from ../../src/aliased_buffer.h:7,1498 from ../../src/node_diagnostics_channel.h:11,1499 from ../../src/node_diagnostics_channel.cc:1:1500../../deps/v8/include/v8-profiler.h: In constructor 'v8::HeapProfiler::HeapSnapshotOptions::HeapSnapshotOptions()':1501../../deps/v8/include/v8-profiler.h:1128:27: warning: 'v8::HeapProfiler::HeapSnapshotOptions::global_object_name_resolver' is deprecated: Use context_name_resolver callback instead. [-Wdeprecated-declarations]1502 1128 | HeapSnapshotOptions() {}1503 | ^1504../../deps/v8/include/v8-profiler.h:1142:25: note: declared here1505 1142 | ObjectNameResolver* global_object_name_resolver = nullptr;1506 | ^~~~~~~~~~~~~~~~~~~~~~~~~~~1507../../deps/v8/include/v8-profiler.h:1128:27: warning: 'v8::HeapProfiler::HeapSnapshotOptions::global_object_name_resolver' is deprecated: Use context_name_resolver callback instead. [-Wdeprecated-declarations]1508 1128 | HeapSnapshotOptions() {}1509 | ^1510../../deps/v8/include/v8-profiler.h:1142:25: note: declared here1511 1142 | ObjectNameResolver* global_object_name_resolver = nullptr;1512 | ^~~~~~~~~~~~~~~~~~~~~~~~~~~1513[212/1871] CXX obj/src/node_base.node_os.o1514In file included from ../../src/memory_tracker.h:6,1515 from ../../src/aliased_buffer.h:7,1516 from ../../src/aliased_buffer-inl.h:6,1517 from ../../src/env-inl.h:27,1518 from ../../src/node_os.cc:22:1519../../deps/v8/include/v8-profiler.h: In constructor 'v8::HeapProfiler::HeapSnapshotOptions::HeapSnapshotOptions()':1520../../deps/v8/include/v8-profiler.h:1128:27: warning: 'v8::HeapProfiler::HeapSnapshotOptions::global_object_name_resolver' is deprecated: Use context_name_resolver callback instead. [-Wdeprecated-declarations]1521 1128 | HeapSnapshotOptions() {}1522 | ^1523../../deps/v8/include/v8-profiler.h:1142:25: note: declared here1524 1142 | ObjectNameResolver* global_object_name_resolver = nullptr;1525 | ^~~~~~~~~~~~~~~~~~~~~~~~~~~1526../../deps/v8/include/v8-profiler.h:1128:27: warning: 'v8::HeapProfiler::HeapSnapshotOptions::global_object_name_resolver' is deprecated: Use context_name_resolver callback instead. [-Wdeprecated-declarations]1527 1128 | HeapSnapshotOptions() {}1528 | ^1529../../deps/v8/include/v8-profiler.h:1142:25: note: declared here1530 1142 | ObjectNameResolver* global_object_name_resolver = nullptr;1531 | ^~~~~~~~~~~~~~~~~~~~~~~~~~~1532[213/1871] CXX obj/src/node_base.node_perf.o1533In file included from ../../src/memory_tracker.h:6,1534 from ../../src/base_object.h:29,1535 from ../../src/base_object-inl.h:27,1536 from ../../src/node_perf.h:6,1537 from ../../src/node_perf.cc:1:1538../../deps/v8/include/v8-profiler.h: In constructor 'v8::HeapProfiler::HeapSnapshotOptions::HeapSnapshotOptions()':1539../../deps/v8/include/v8-profiler.h:1128:27: warning: 'v8::HeapProfiler::HeapSnapshotOptions::global_object_name_resolver' is deprecated: Use context_name_resolver callback instead. [-Wdeprecated-declarations]1540 1128 | HeapSnapshotOptions() {}1541 | ^1542../../deps/v8/include/v8-profiler.h:1142:25: note: declared here1543 1142 | ObjectNameResolver* global_object_name_resolver = nullptr;1544 | ^~~~~~~~~~~~~~~~~~~~~~~~~~~1545../../deps/v8/include/v8-profiler.h:1128:27: warning: 'v8::HeapProfiler::HeapSnapshotOptions::global_object_name_resolver' is deprecated: Use context_name_resolver callback instead. [-Wdeprecated-declarations]1546 1128 | HeapSnapshotOptions() {}1547 | ^1548../../deps/v8/include/v8-profiler.h:1142:25: note: declared here1549 1142 | ObjectNameResolver* global_object_name_resolver = nullptr;1550 | ^~~~~~~~~~~~~~~~~~~~~~~~~~~1551[214/1871] CXX obj/src/node_base.node_process_events.o1552In file included from ../../src/memory_tracker.h:6,1553 from ../../src/aliased_buffer.h:7,1554 from ../../src/aliased_buffer-inl.h:6,1555 from ../../src/env-inl.h:27,1556 from ../../src/node_process_events.cc:3:1557../../deps/v8/include/v8-profiler.h: In constructor 'v8::HeapProfiler::HeapSnapshotOptions::HeapSnapshotOptions()':1558../../deps/v8/include/v8-profiler.h:1128:27: warning: 'v8::HeapProfiler::HeapSnapshotOptions::global_object_name_resolver' is deprecated: Use context_name_resolver callback instead. [-Wdeprecated-declarations]1559 1128 | HeapSnapshotOptions() {}1560 | ^1561../../deps/v8/include/v8-profiler.h:1142:25: note: declared here1562 1142 | ObjectNameResolver* global_object_name_resolver = nullptr;1563 | ^~~~~~~~~~~~~~~~~~~~~~~~~~~1564../../deps/v8/include/v8-profiler.h:1128:27: warning: 'v8::HeapProfiler::HeapSnapshotOptions::global_object_name_resolver' is deprecated: Use context_name_resolver callback instead. [-Wdeprecated-declarations]1565 1128 | HeapSnapshotOptions() {}1566 | ^1567../../deps/v8/include/v8-profiler.h:1142:25: note: declared here1568 1142 | ObjectNameResolver* global_object_name_resolver = nullptr;1569 | ^~~~~~~~~~~~~~~~~~~~~~~~~~~1570[215/1871] CXX obj/src/node_base.env.o1571In file included from ../../src/memory_tracker.h:6,1572 from ../../src/aliased_buffer.h:7,1573 from ../../src/env.h:27,1574 from ../../src/env.cc:1:1575../../deps/v8/include/v8-profiler.h: In constructor 'v8::HeapProfiler::HeapSnapshotOptions::HeapSnapshotOptions()':1576../../deps/v8/include/v8-profiler.h:1128:27: warning: 'v8::HeapProfiler::HeapSnapshotOptions::global_object_name_resolver' is deprecated: Use context_name_resolver callback instead. [-Wdeprecated-declarations]1577 1128 | HeapSnapshotOptions() {}1578 | ^1579../../deps/v8/include/v8-profiler.h:1142:25: note: declared here1580 1142 | ObjectNameResolver* global_object_name_resolver = nullptr;1581 | ^~~~~~~~~~~~~~~~~~~~~~~~~~~1582../../deps/v8/include/v8-profiler.h:1128:27: warning: 'v8::HeapProfiler::HeapSnapshotOptions::global_object_name_resolver' is deprecated: Use context_name_resolver callback instead. [-Wdeprecated-declarations]1583 1128 | HeapSnapshotOptions() {}1584 | ^1585../../deps/v8/include/v8-profiler.h:1142:25: note: declared here1586 1142 | ObjectNameResolver* global_object_name_resolver = nullptr;1587 | ^~~~~~~~~~~~~~~~~~~~~~~~~~~1588[216/1871] CXX obj/src/node_base.node_platform.o1589In file included from ../../src/util.h:29,1590 from ../../src/node_mutex.h:6,1591 from ../../src/node_platform.h:15,1592 from ../../src/node_platform.cc:1:1593../../deps/v8/include/v8-profiler.h: In constructor 'v8::HeapProfiler::HeapSnapshotOptions::HeapSnapshotOptions()':1594../../deps/v8/include/v8-profiler.h:1128:27: warning: 'v8::HeapProfiler::HeapSnapshotOptions::global_object_name_resolver' is deprecated: Use context_name_resolver callback instead. [-Wdeprecated-declarations]1595 1128 | HeapSnapshotOptions() {}1596 | ^1597../../deps/v8/include/v8-profiler.h:1142:25: note: declared here1598 1142 | ObjectNameResolver* global_object_name_resolver = nullptr;1599 | ^~~~~~~~~~~~~~~~~~~~~~~~~~~1600../../deps/v8/include/v8-profiler.h:1128:27: warning: 'v8::HeapProfiler::HeapSnapshotOptions::global_object_name_resolver' is deprecated: Use context_name_resolver callback instead. [-Wdeprecated-declarations]1601 1128 | HeapSnapshotOptions() {}1602 | ^1603../../deps/v8/include/v8-profiler.h:1142:25: note: declared here1604 1142 | ObjectNameResolver* global_object_name_resolver = nullptr;1605 | ^~~~~~~~~~~~~~~~~~~~~~~~~~~1606[217/1871] CXX obj/src/node_base.node_messaging.o1607In file included from ../../src/memory_tracker.h:6,1608 from ../../src/aliased_buffer.h:7,1609 from ../../src/env.h:27,1610 from ../../src/node_messaging.h:6,1611 from ../../src/node_messaging.cc:1:1612../../deps/v8/include/v8-profiler.h: In constructor 'v8::HeapProfiler::HeapSnapshotOptions::HeapSnapshotOptions()':1613../../deps/v8/include/v8-profiler.h:1128:27: warning: 'v8::HeapProfiler::HeapSnapshotOptions::global_object_name_resolver' is deprecated: Use context_name_resolver callback instead. [-Wdeprecated-declarations]1614 1128 | HeapSnapshotOptions() {}1615 | ^1616../../deps/v8/include/v8-profiler.h:1142:25: note: declared here1617 1142 | ObjectNameResolver* global_object_name_resolver = nullptr;1618 | ^~~~~~~~~~~~~~~~~~~~~~~~~~~1619../../deps/v8/include/v8-profiler.h:1128:27: warning: 'v8::HeapProfiler::HeapSnapshotOptions::global_object_name_resolver' is deprecated: Use context_name_resolver callback instead. [-Wdeprecated-declarations]1620 1128 | HeapSnapshotOptions() {}1621 | ^1622../../deps/v8/include/v8-profiler.h:1142:25: note: declared here1623 1142 | ObjectNameResolver* global_object_name_resolver = nullptr;1624 | ^~~~~~~~~~~~~~~~~~~~~~~~~~~1625[218/1871] CXX obj/src/node_base.node_postmortem_metadata.o1626In file included from ../../src/memory_tracker.h:6,1627 from ../../src/base_object.h:29,1628 from ../../src/base_object-inl.h:27,1629 from ../../src/node_postmortem_metadata.cc:1:1630../../deps/v8/include/v8-profiler.h: In constructor 'v8::HeapProfiler::HeapSnapshotOptions::HeapSnapshotOptions()':1631../../deps/v8/include/v8-profiler.h:1128:27: warning: 'v8::HeapProfiler::HeapSnapshotOptions::global_object_name_resolver' is deprecated: Use context_name_resolver callback instead. [-Wdeprecated-declarations]1632 1128 | HeapSnapshotOptions() {}1633 | ^1634../../deps/v8/include/v8-profiler.h:1142:25: note: declared here1635 1142 | ObjectNameResolver* global_object_name_resolver = nullptr;1636 | ^~~~~~~~~~~~~~~~~~~~~~~~~~~1637../../deps/v8/include/v8-profiler.h:1128:27: warning: 'v8::HeapProfiler::HeapSnapshotOptions::global_object_name_resolver' is deprecated: Use context_name_resolver callback instead. [-Wdeprecated-declarations]1638 1128 | HeapSnapshotOptions() {}1639 | ^1640../../deps/v8/include/v8-profiler.h:1142:25: note: declared here1641 1142 | ObjectNameResolver* global_object_name_resolver = nullptr;1642 | ^~~~~~~~~~~~~~~~~~~~~~~~~~~1643[219/1871] CXX obj/src/node_base.node_process_methods.o1644In file included from ../../src/memory_tracker.h:6,1645 from ../../src/base_object.h:29,1646 from ../../src/async_wrap.h:27,1647 from ../../src/async_wrap-inl.h:27,1648 from ../../src/node_process_methods.cc:1:1649../../deps/v8/include/v8-profiler.h: In constructor 'v8::HeapProfiler::HeapSnapshotOptions::HeapSnapshotOptions()':1650../../deps/v8/include/v8-profiler.h:1128:27: warning: 'v8::HeapProfiler::HeapSnapshotOptions::global_object_name_resolver' is deprecated: Use context_name_resolver callback instead. [-Wdeprecated-declarations]1651 1128 | HeapSnapshotOptions() {}1652 | ^1653../../deps/v8/include/v8-profiler.h:1142:25: note: declared here1654 1142 | ObjectNameResolver* global_object_name_resolver = nullptr;1655 | ^~~~~~~~~~~~~~~~~~~~~~~~~~~1656../../deps/v8/include/v8-profiler.h:1128:27: warning: 'v8::HeapProfiler::HeapSnapshotOptions::global_object_name_resolver' is deprecated: Use context_name_resolver callback instead. [-Wdeprecated-declarations]1657 1128 | HeapSnapshotOptions() {}1658 | ^1659../../deps/v8/include/v8-profiler.h:1142:25: note: declared here1660 1142 | ObjectNameResolver* global_object_name_resolver = nullptr;1661 | ^~~~~~~~~~~~~~~~~~~~~~~~~~~1662[220/1871] CXX obj/src/node_base.node_report_utils.o1663In file included from ../../src/memory_tracker.h:6,1664 from ../../src/aliased_buffer.h:7,1665 from ../../src/env.h:27,1666 from ../../src/node_internals.h:27,1667 from ../../src/node_report_utils.cc:2:1668../../deps/v8/include/v8-profiler.h: In constructor 'v8::HeapProfiler::HeapSnapshotOptions::HeapSnapshotOptions()':1669../../deps/v8/include/v8-profiler.h:1128:27: warning: 'v8::HeapProfiler::HeapSnapshotOptions::global_object_name_resolver' is deprecated: Use context_name_resolver callback instead. [-Wdeprecated-declarations]1670 1128 | HeapSnapshotOptions() {}1671 | ^1672../../deps/v8/include/v8-profiler.h:1142:25: note: declared here1673 1142 | ObjectNameResolver* global_object_name_resolver = nullptr;1674 | ^~~~~~~~~~~~~~~~~~~~~~~~~~~1675../../deps/v8/include/v8-profiler.h:1128:27: warning: 'v8::HeapProfiler::HeapSnapshotOptions::global_object_name_resolver' is deprecated: Use context_name_resolver callback instead. [-Wdeprecated-declarations]1676 1128 | HeapSnapshotOptions() {}1677 | ^1678../../deps/v8/include/v8-profiler.h:1142:25: note: declared here1679 1142 | ObjectNameResolver* global_object_name_resolver = nullptr;1680 | ^~~~~~~~~~~~~~~~~~~~~~~~~~~1681[221/1871] CXX obj/src/node_base.node_report.o1682In file included from ../../src/util.h:29,1683 from ../../src/node_report.h:9,1684 from ../../src/node_report.cc:1:1685../../deps/v8/include/v8-profiler.h: In constructor 'v8::HeapProfiler::HeapSnapshotOptions::HeapSnapshotOptions()':1686../../deps/v8/include/v8-profiler.h:1128:27: warning: 'v8::HeapProfiler::HeapSnapshotOptions::global_object_name_resolver' is deprecated: Use context_name_resolver callback instead. [-Wdeprecated-declarations]1687 1128 | HeapSnapshotOptions() {}1688 | ^1689../../deps/v8/include/v8-profiler.h:1142:25: note: declared here1690 1142 | ObjectNameResolver* global_object_name_resolver = nullptr;1691 | ^~~~~~~~~~~~~~~~~~~~~~~~~~~1692../../deps/v8/include/v8-profiler.h:1128:27: warning: 'v8::HeapProfiler::HeapSnapshotOptions::global_object_name_resolver' is deprecated: Use context_name_resolver callback instead. [-Wdeprecated-declarations]1693 1128 | HeapSnapshotOptions() {}1694 | ^1695../../deps/v8/include/v8-profiler.h:1142:25: note: declared here1696 1142 | ObjectNameResolver* global_object_name_resolver = nullptr;1697 | ^~~~~~~~~~~~~~~~~~~~~~~~~~~1698[222/1871] CXX obj/src/node_base.node_report_module.o1699In file included from ../../src/memory_tracker.h:6,1700 from ../../src/aliased_buffer.h:7,1701 from ../../src/env.h:27,1702 from ../../src/node_report_module.cc:1:1703../../deps/v8/include/v8-profiler.h: In constructor 'v8::HeapProfiler::HeapSnapshotOptions::HeapSnapshotOptions()':1704../../deps/v8/include/v8-profiler.h:1128:27: warning: 'v8::HeapProfiler::HeapSnapshotOptions::global_object_name_resolver' is deprecated: Use context_name_resolver callback instead. [-Wdeprecated-declarations]1705 1128 | HeapSnapshotOptions() {}1706 | ^1707../../deps/v8/include/v8-profiler.h:1142:25: note: declared here1708 1142 | ObjectNameResolver* global_object_name_resolver = nullptr;1709 | ^~~~~~~~~~~~~~~~~~~~~~~~~~~1710../../deps/v8/include/v8-profiler.h:1128:27: warning: 'v8::HeapProfiler::HeapSnapshotOptions::global_object_name_resolver' is deprecated: Use context_name_resolver callback instead. [-Wdeprecated-declarations]1711 1128 | HeapSnapshotOptions() {}1712 | ^1713../../deps/v8/include/v8-profiler.h:1142:25: note: declared here1714 1142 | ObjectNameResolver* global_object_name_resolver = nullptr;1715 | ^~~~~~~~~~~~~~~~~~~~~~~~~~~1716[223/1871] CXX obj/src/node_base.node_process_object.o1717In file included from ../../src/memory_tracker.h:6,1718 from ../../src/aliased_buffer.h:7,1719 from ../../src/aliased_buffer-inl.h:6,1720 from ../../src/env-inl.h:27,1721 from ../../src/node_process_object.cc:1:1722../../deps/v8/include/v8-profiler.h: In constructor 'v8::HeapProfiler::HeapSnapshotOptions::HeapSnapshotOptions()':1723../../deps/v8/include/v8-profiler.h:1128:27: warning: 'v8::HeapProfiler::HeapSnapshotOptions::global_object_name_resolver' is deprecated: Use context_name_resolver callback instead. [-Wdeprecated-declarations]1724 1128 | HeapSnapshotOptions() {}1725 | ^1726../../deps/v8/include/v8-profiler.h:1142:25: note: declared here1727 1142 | ObjectNameResolver* global_object_name_resolver = nullptr;1728 | ^~~~~~~~~~~~~~~~~~~~~~~~~~~1729../../deps/v8/include/v8-profiler.h:1128:27: warning: 'v8::HeapProfiler::HeapSnapshotOptions::global_object_name_resolver' is deprecated: Use context_name_resolver callback instead. [-Wdeprecated-declarations]1730 1128 | HeapSnapshotOptions() {}1731 | ^1732../../deps/v8/include/v8-profiler.h:1142:25: note: declared here1733 1142 | ObjectNameResolver* global_object_name_resolver = nullptr;1734 | ^~~~~~~~~~~~~~~~~~~~~~~~~~~1735[224/1871] CXX obj/src/node_base.node_modules.o1736In file included from ../../src/memory_tracker.h:6,1737 from ../../src/aliased_buffer.h:7,1738 from ../../src/node_snapshotable.h:7,1739 from ../../src/node_modules.h:7,1740 from ../../src/node_modules.cc:1:1741../../deps/v8/include/v8-profiler.h: In constructor 'v8::HeapProfiler::HeapSnapshotOptions::HeapSnapshotOptions()':1742../../deps/v8/include/v8-profiler.h:1128:27: warning: 'v8::HeapProfiler::HeapSnapshotOptions::global_object_name_resolver' is deprecated: Use context_name_resolver callback instead. [-Wdeprecated-declarations]1743 1128 | HeapSnapshotOptions() {}1744 | ^1745../../deps/v8/include/v8-profiler.h:1142:25: note: declared here1746 1142 | ObjectNameResolver* global_object_name_resolver = nullptr;1747 | ^~~~~~~~~~~~~~~~~~~~~~~~~~~1748../../deps/v8/include/v8-profiler.h:1128:27: warning: 'v8::HeapProfiler::HeapSnapshotOptions::global_object_name_resolver' is deprecated: Use context_name_resolver callback instead. [-Wdeprecated-declarations]1749 1128 | HeapSnapshotOptions() {}1750 | ^1751../../deps/v8/include/v8-profiler.h:1142:25: note: declared here1752 1142 | ObjectNameResolver* global_object_name_resolver = nullptr;1753 | ^~~~~~~~~~~~~~~~~~~~~~~~~~~1754[225/1871] CXX obj/src/node_base.node_realm.o1755In file included from ../../src/memory_tracker.h:6,1756 from ../../src/cleanup_queue.h:11,1757 from ../../src/node_realm.h:8,1758 from ../../src/node_realm.cc:1:1759../../deps/v8/include/v8-profiler.h: In constructor 'v8::HeapProfiler::HeapSnapshotOptions::HeapSnapshotOptions()':1760../../deps/v8/include/v8-profiler.h:1128:27: warning: 'v8::HeapProfiler::HeapSnapshotOptions::global_object_name_resolver' is deprecated: Use context_name_resolver callback instead. [-Wdeprecated-declarations]1761 1128 | HeapSnapshotOptions() {}1762 | ^1763../../deps/v8/include/v8-profiler.h:1142:25: note: declared here1764 1142 | ObjectNameResolver* global_object_name_resolver = nullptr;1765 | ^~~~~~~~~~~~~~~~~~~~~~~~~~~1766../../deps/v8/include/v8-profiler.h:1128:27: warning: 'v8::HeapProfiler::HeapSnapshotOptions::global_object_name_resolver' is deprecated: Use context_name_resolver callback instead. [-Wdeprecated-declarations]1767 1128 | HeapSnapshotOptions() {}1768 | ^1769../../deps/v8/include/v8-profiler.h:1142:25: note: declared here1770 1142 | ObjectNameResolver* global_object_name_resolver = nullptr;1771 | ^~~~~~~~~~~~~~~~~~~~~~~~~~~1772[226/1871] CXX obj/src/node_base.node_serdes.o1773In file included from ../../src/memory_tracker.h:6,1774 from ../../src/base_object.h:29,1775 from ../../src/base_object-inl.h:27,1776 from ../../src/node_serdes.cc:1:1777../../deps/v8/include/v8-profiler.h: In constructor 'v8::HeapProfiler::HeapSnapshotOptions::HeapSnapshotOptions()':1778../../deps/v8/include/v8-profiler.h:1128:27: warning: 'v8::HeapProfiler::HeapSnapshotOptions::global_object_name_resolver' is deprecated: Use context_name_resolver callback instead. [-Wdeprecated-declarations]1779 1128 | HeapSnapshotOptions() {}1780 | ^1781../../deps/v8/include/v8-profiler.h:1142:25: note: declared here1782 1142 | ObjectNameResolver* global_object_name_resolver = nullptr;1783 | ^~~~~~~~~~~~~~~~~~~~~~~~~~~1784../../deps/v8/include/v8-profiler.h:1128:27: warning: 'v8::HeapProfiler::HeapSnapshotOptions::global_object_name_resolver' is deprecated: Use context_name_resolver callback instead. [-Wdeprecated-declarations]1785 1128 | HeapSnapshotOptions() {}1786 | ^1787../../deps/v8/include/v8-profiler.h:1142:25: note: declared here1788 1142 | ObjectNameResolver* global_object_name_resolver = nullptr;1789 | ^~~~~~~~~~~~~~~~~~~~~~~~~~~1790[227/1871] CXX obj/src/node_base.node_shadow_realm.o1791In file included from ../../src/memory_tracker.h:6,1792 from ../../src/cleanup_queue.h:11,1793 from ../../src/node_realm.h:8,1794 from ../../src/node_shadow_realm.h:6,1795 from ../../src/node_shadow_realm.cc:1:1796../../deps/v8/include/v8-profiler.h: In constructor 'v8::HeapProfiler::HeapSnapshotOptions::HeapSnapshotOptions()':1797../../deps/v8/include/v8-profiler.h:1128:27: warning: 'v8::HeapProfiler::HeapSnapshotOptions::global_object_name_resolver' is deprecated: Use context_name_resolver callback instead. [-Wdeprecated-declarations]1798 1128 | HeapSnapshotOptions() {}1799 | ^1800../../deps/v8/include/v8-profiler.h:1142:25: note: declared here1801 1142 | ObjectNameResolver* global_object_name_resolver = nullptr;1802 | ^~~~~~~~~~~~~~~~~~~~~~~~~~~1803../../deps/v8/include/v8-profiler.h:1128:27: warning: 'v8::HeapProfiler::HeapSnapshotOptions::global_object_name_resolver' is deprecated: Use context_name_resolver callback instead. [-Wdeprecated-declarations]1804 1128 | HeapSnapshotOptions() {}1805 | ^1806../../deps/v8/include/v8-profiler.h:1142:25: note: declared here1807 1142 | ObjectNameResolver* global_object_name_resolver = nullptr;1808 | ^~~~~~~~~~~~~~~~~~~~~~~~~~~1809[228/1871] CXX obj/src/node_base.node_stat_watcher.o1810In file included from ../../src/memory_tracker.h:6,1811 from ../../src/base_object.h:29,1812 from ../../src/async_wrap.h:27,1813 from ../../src/handle_wrap.h:27,1814 from ../../src/node_stat_watcher.h:28,1815 from ../../src/node_stat_watcher.cc:22:1816../../deps/v8/include/v8-profiler.h: In constructor 'v8::HeapProfiler::HeapSnapshotOptions::HeapSnapshotOptions()':1817../../deps/v8/include/v8-profiler.h:1128:27: warning: 'v8::HeapProfiler::HeapSnapshotOptions::global_object_name_resolver' is deprecated: Use context_name_resolver callback instead. [-Wdeprecated-declarations]1818 1128 | HeapSnapshotOptions() {}1819 | ^1820../../deps/v8/include/v8-profiler.h:1142:25: note: declared here1821 1142 | ObjectNameResolver* global_object_name_resolver = nullptr;1822 | ^~~~~~~~~~~~~~~~~~~~~~~~~~~1823../../deps/v8/include/v8-profiler.h:1128:27: warning: 'v8::HeapProfiler::HeapSnapshotOptions::global_object_name_resolver' is deprecated: Use context_name_resolver callback instead. [-Wdeprecated-declarations]1824 1128 | HeapSnapshotOptions() {}1825 | ^1826../../deps/v8/include/v8-profiler.h:1142:25: note: declared here1827 1142 | ObjectNameResolver* global_object_name_resolver = nullptr;1828 | ^~~~~~~~~~~~~~~~~~~~~~~~~~~1829[229/1871] CXX obj/src/node_base.node_task_queue.o1830In file included from ../../src/memory_tracker.h:6,1831 from ../../src/base_object.h:29,1832 from ../../src/async_wrap.h:27,1833 from ../../src/node_task_queue.cc:1:1834../../deps/v8/include/v8-profiler.h: In constructor 'v8::HeapProfiler::HeapSnapshotOptions::HeapSnapshotOptions()':1835../../deps/v8/include/v8-profiler.h:1128:27: warning: 'v8::HeapProfiler::HeapSnapshotOptions::global_object_name_resolver' is deprecated: Use context_name_resolver callback instead. [-Wdeprecated-declarations]1836 1128 | HeapSnapshotOptions() {}1837 | ^1838../../deps/v8/include/v8-profiler.h:1142:25: note: declared here1839 1142 | ObjectNameResolver* global_object_name_resolver = nullptr;1840 | ^~~~~~~~~~~~~~~~~~~~~~~~~~~1841../../deps/v8/include/v8-profiler.h:1128:27: warning: 'v8::HeapProfiler::HeapSnapshotOptions::global_object_name_resolver' is deprecated: Use context_name_resolver callback instead. [-Wdeprecated-declarations]1842 1128 | HeapSnapshotOptions() {}1843 | ^1844../../deps/v8/include/v8-profiler.h:1142:25: note: declared here1845 1142 | ObjectNameResolver* global_object_name_resolver = nullptr;1846 | ^~~~~~~~~~~~~~~~~~~~~~~~~~~1847[230/1871] CXX obj/src/node_base.node_file.o1848In file included from ../../src/memory_tracker.h:6,1849 from ../../src/aliased_buffer.h:7,1850 from ../../src/node_file.h:7,1851 from ../../src/node_file.cc:21:1852../../deps/v8/include/v8-profiler.h: In constructor 'v8::HeapProfiler::HeapSnapshotOptions::HeapSnapshotOptions()':1853../../deps/v8/include/v8-profiler.h:1128:27: warning: 'v8::HeapProfiler::HeapSnapshotOptions::global_object_name_resolver' is deprecated: Use context_name_resolver callback instead. [-Wdeprecated-declarations]1854 1128 | HeapSnapshotOptions() {}1855 | ^1856../../deps/v8/include/v8-profiler.h:1142:25: note: declared here1857 1142 | ObjectNameResolver* global_object_name_resolver = nullptr;1858 | ^~~~~~~~~~~~~~~~~~~~~~~~~~~1859../../deps/v8/include/v8-profiler.h:1128:27: warning: 'v8::HeapProfiler::HeapSnapshotOptions::global_object_name_resolver' is deprecated: Use context_name_resolver callback instead. [-Wdeprecated-declarations]1860 1128 | HeapSnapshotOptions() {}1861 | ^1862../../deps/v8/include/v8-profiler.h:1142:25: note: declared here1863 1142 | ObjectNameResolver* global_object_name_resolver = nullptr;1864 | ^~~~~~~~~~~~~~~~~~~~~~~~~~~1865[231/1871] CXX obj/src/node_base.node_symbols.o1866In file included from ../../src/memory_tracker.h:6,1867 from ../../src/aliased_buffer.h:7,1868 from ../../src/aliased_buffer-inl.h:6,1869 from ../../src/env-inl.h:27,1870 from ../../src/node_symbols.cc:1:1871../../deps/v8/include/v8-profiler.h: In constructor 'v8::HeapProfiler::HeapSnapshotOptions::HeapSnapshotOptions()':1872../../deps/v8/include/v8-profiler.h:1128:27: warning: 'v8::HeapProfiler::HeapSnapshotOptions::global_object_name_resolver' is deprecated: Use context_name_resolver callback instead. [-Wdeprecated-declarations]1873 1128 | HeapSnapshotOptions() {}1874 | ^1875../../deps/v8/include/v8-profiler.h:1142:25: note: declared here1876 1142 | ObjectNameResolver* global_object_name_resolver = nullptr;1877 | ^~~~~~~~~~~~~~~~~~~~~~~~~~~1878../../deps/v8/include/v8-profiler.h:1128:27: warning: 'v8::HeapProfiler::HeapSnapshotOptions::global_object_name_resolver' is deprecated: Use context_name_resolver callback instead. [-Wdeprecated-declarations]1879 1128 | HeapSnapshotOptions() {}1880 | ^1881../../deps/v8/include/v8-profiler.h:1142:25: note: declared here1882 1142 | ObjectNameResolver* global_object_name_resolver = nullptr;1883 | ^~~~~~~~~~~~~~~~~~~~~~~~~~~1884[232/1871] ACTION run_torque: run_torque_action_cea83c9e621e0e182fdfeec0429b2fb789657831bb31bd721b9a7d823e9ef3a81885[233/1871] STAMP obj/tools/v8_gypfiles/run_torque.actions_rules_copies.stamp1886[234/1871] STAMP obj/tools/v8_gypfiles/v8_internal_headers.compile_depends.stamp1887[235/1871] CXX obj/src/node_base.node_types.o1888In file included from ../../src/memory_tracker.h:6,1889 from ../../src/aliased_buffer.h:7,1890 from ../../src/aliased_buffer-inl.h:6,1891 from ../../src/env-inl.h:27,1892 from ../../src/node_types.cc:1:1893../../deps/v8/include/v8-profiler.h: In constructor 'v8::HeapProfiler::HeapSnapshotOptions::HeapSnapshotOptions()':1894../../deps/v8/include/v8-profiler.h:1128:27: warning: 'v8::HeapProfiler::HeapSnapshotOptions::global_object_name_resolver' is deprecated: Use context_name_resolver callback instead. [-Wdeprecated-declarations]1895 1128 | HeapSnapshotOptions() {}1896 | ^1897../../deps/v8/include/v8-profiler.h:1142:25: note: declared here1898 1142 | ObjectNameResolver* global_object_name_resolver = nullptr;1899 | ^~~~~~~~~~~~~~~~~~~~~~~~~~~1900../../deps/v8/include/v8-profiler.h:1128:27: warning: 'v8::HeapProfiler::HeapSnapshotOptions::global_object_name_resolver' is deprecated: Use context_name_resolver callback instead. [-Wdeprecated-declarations]1901 1128 | HeapSnapshotOptions() {}1902 | ^1903../../deps/v8/include/v8-profiler.h:1142:25: note: declared here1904 1142 | ObjectNameResolver* global_object_name_resolver = nullptr;1905 | ^~~~~~~~~~~~~~~~~~~~~~~~~~~1906[236/1871] STAMP obj/tools/v8_gypfiles/v8_internal_headers.actions_depends.stamp1907[237/1871] STAMP obj/tools/v8_gypfiles/torque_generated_definitions.compile_depends.stamp1908[238/1871] STAMP obj/tools/v8_gypfiles/torque_generated_definitions.actions_depends.stamp1909[239/1871] STAMP obj/tools/v8_gypfiles/v8_compiler.compile_depends.stamp1910[240/1871] STAMP obj/tools/v8_gypfiles/v8_compiler.actions_depends.stamp1911[241/1871] CXX obj/src/node_base.node_trace_events.o1912In file included from ../../src/memory_tracker.h:6,1913 from ../../src/base_object.h:29,1914 from ../../src/base_object-inl.h:27,1915 from ../../src/node_trace_events.cc:1:1916../../deps/v8/include/v8-profiler.h: In constructor 'v8::HeapProfiler::HeapSnapshotOptions::HeapSnapshotOptions()':1917../../deps/v8/include/v8-profiler.h:1128:27: warning: 'v8::HeapProfiler::HeapSnapshotOptions::global_object_name_resolver' is deprecated: Use context_name_resolver callback instead. [-Wdeprecated-declarations]1918 1128 | HeapSnapshotOptions() {}1919 | ^1920../../deps/v8/include/v8-profiler.h:1142:25: note: declared here1921 1142 | ObjectNameResolver* global_object_name_resolver = nullptr;1922 | ^~~~~~~~~~~~~~~~~~~~~~~~~~~1923../../deps/v8/include/v8-profiler.h:1128:27: warning: 'v8::HeapProfiler::HeapSnapshotOptions::global_object_name_resolver' is deprecated: Use context_name_resolver callback instead. [-Wdeprecated-declarations]1924 1128 | HeapSnapshotOptions() {}1925 | ^1926../../deps/v8/include/v8-profiler.h:1142:25: note: declared here1927 1142 | ObjectNameResolver* global_object_name_resolver = nullptr;1928 | ^~~~~~~~~~~~~~~~~~~~~~~~~~~1929[242/1871] ACTION postmortem-metadata: gen-postmortem-metadata_63ceec4fe112e619d2413cab4d13e9ecf973439b0b10d648a5f58422165276881930[243/1871] STAMP obj/tools/v8_gypfiles/v8_base_without_compiler.compile_depends.stamp1931[244/1871] STAMP obj/tools/v8_gypfiles/v8_base_without_compiler.actions_depends.stamp1932[245/1871] CXX obj/src/node_base.node_sockaddr.o1933In file included from ../../src/memory_tracker.h:6,1934 from ../../src/base_object.h:29,1935 from ../../src/node_sockaddr.h:6,1936 from ../../src/node_sockaddr.cc:1:1937../../deps/v8/include/v8-profiler.h: In constructor 'v8::HeapProfiler::HeapSnapshotOptions::HeapSnapshotOptions()':1938../../deps/v8/include/v8-profiler.h:1128:27: warning: 'v8::HeapProfiler::HeapSnapshotOptions::global_object_name_resolver' is deprecated: Use context_name_resolver callback instead. [-Wdeprecated-declarations]1939 1128 | HeapSnapshotOptions() {}1940 | ^1941../../deps/v8/include/v8-profiler.h:1142:25: note: declared here1942 1142 | ObjectNameResolver* global_object_name_resolver = nullptr;1943 | ^~~~~~~~~~~~~~~~~~~~~~~~~~~1944../../deps/v8/include/v8-profiler.h:1128:27: warning: 'v8::HeapProfiler::HeapSnapshotOptions::global_object_name_resolver' is deprecated: Use context_name_resolver callback instead. [-Wdeprecated-declarations]1945 1128 | HeapSnapshotOptions() {}1946 | ^1947../../deps/v8/include/v8-profiler.h:1142:25: note: declared here1948 1142 | ObjectNameResolver* global_object_name_resolver = nullptr;1949 | ^~~~~~~~~~~~~~~~~~~~~~~~~~~1950[246/1871] CXX obj/src/node_base.node_http2.o1951In file included from ../../src/memory_tracker.h:6,1952 from ../../src/aliased_buffer.h:7,1953 from ../../src/env.h:27,1954 from ../../src/node_http2.h:11,1955 from ../../src/node_http2.cc:1:1956../../deps/v8/include/v8-profiler.h: In constructor 'v8::HeapProfiler::HeapSnapshotOptions::HeapSnapshotOptions()':1957../../deps/v8/include/v8-profiler.h:1128:27: warning: 'v8::HeapProfiler::HeapSnapshotOptions::global_object_name_resolver' is deprecated: Use context_name_resolver callback instead. [-Wdeprecated-declarations]1958 1128 | HeapSnapshotOptions() {}1959 | ^1960../../deps/v8/include/v8-profiler.h:1142:25: note: declared here1961 1142 | ObjectNameResolver* global_object_name_resolver = nullptr;1962 | ^~~~~~~~~~~~~~~~~~~~~~~~~~~1963../../deps/v8/include/v8-profiler.h:1128:27: warning: 'v8::HeapProfiler::HeapSnapshotOptions::global_object_name_resolver' is deprecated: Use context_name_resolver callback instead. [-Wdeprecated-declarations]1964 1128 | HeapSnapshotOptions() {}1965 | ^1966../../deps/v8/include/v8-profiler.h:1142:25: note: declared here1967 1142 | ObjectNameResolver* global_object_name_resolver = nullptr;1968 | ^~~~~~~~~~~~~~~~~~~~~~~~~~~1969[247/1871] CXX obj/src/node_base.node_sea.o1970In file included from ../../src/memory_tracker.h:6,1971 from ../../src/base_object.h:29,1972 from ../../src/async_wrap.h:27,1973 from ../../src/debug_utils.h:6,1974 from ../../src/debug_utils-inl.h:6,1975 from ../../src/blob_serializer_deserializer-inl.h:14,1976 from ../../src/node_sea.cc:3:1977../../deps/v8/include/v8-profiler.h: In constructor 'v8::HeapProfiler::HeapSnapshotOptions::HeapSnapshotOptions()':1978../../deps/v8/include/v8-profiler.h:1128:27: warning: 'v8::HeapProfiler::HeapSnapshotOptions::global_object_name_resolver' is deprecated: Use context_name_resolver callback instead. [-Wdeprecated-declarations]1979 1128 | HeapSnapshotOptions() {}1980 | ^1981../../deps/v8/include/v8-profiler.h:1142:25: note: declared here1982 1142 | ObjectNameResolver* global_object_name_resolver = nullptr;1983 | ^~~~~~~~~~~~~~~~~~~~~~~~~~~1984../../deps/v8/include/v8-profiler.h:1128:27: warning: 'v8::HeapProfiler::HeapSnapshotOptions::global_object_name_resolver' is deprecated: Use context_name_resolver callback instead. [-Wdeprecated-declarations]1985 1128 | HeapSnapshotOptions() {}1986 | ^1987../../deps/v8/include/v8-profiler.h:1142:25: note: declared here1988 1142 | ObjectNameResolver* global_object_name_resolver = nullptr;1989 | ^~~~~~~~~~~~~~~~~~~~~~~~~~~1990[248/1871] CXX obj/src/node_base.node_options.o1991In file included from ../../src/util.h:29,1992 from ../../src/node_mutex.h:6,1993 from ../../src/node_options.h:11,1994 from ../../src/node_options.cc:1:1995../../deps/v8/include/v8-profiler.h: In constructor 'v8::HeapProfiler::HeapSnapshotOptions::HeapSnapshotOptions()':1996../../deps/v8/include/v8-profiler.h:1128:27: warning: 'v8::HeapProfiler::HeapSnapshotOptions::global_object_name_resolver' is deprecated: Use context_name_resolver callback instead. [-Wdeprecated-declarations]1997 1128 | HeapSnapshotOptions() {}1998 | ^1999../../deps/v8/include/v8-profiler.h:1142:25: note: declared here2000 1142 | ObjectNameResolver* global_object_name_resolver = nullptr;loading 24,277 hidden lines…
26278ok 5022 parallel/test-webcrypto-supports26279 ---26280 duration_ms: 167.8220026281 ...26282ok 5023 parallel/test-webstream-readablestream-pipeto26283 ---26284 duration_ms: 108.1470026285 ...26286ok 5024 parallel/test-webstreams-abort-controller26287 ---26288 duration_ms: 88.0830026289 ...26290ok 5025 parallel/test-webstream-string-tag26291 ---26292 duration_ms: 111.6190026293 ...26294ok 5026 parallel/test-webstreams-adapters-writable-buffer-sources26295 ---26296 duration_ms: 109.1000026297 ...26298ok 5027 parallel/test-webstreams-compose26299 ---26300 duration_ms: 87.4080026301 ...26302ok 5028 parallel/test-webstreams-clone-unref26303 ---26304 duration_ms: 107.9020026305 ...26306ok 5029 parallel/test-webcrypto-sign-verify-ecdsa26307 ---26308 duration_ms: 261.4400026309 ...26310ok 5030 parallel/test-webstream-structured-clone-no-leftovers26311 ---26312 duration_ms: 136.7610026313 ...26314ok 5031 parallel/test-webstreams-adapters-sync-write-error26315 ---26316 duration_ms: 134.6480026317 ...26318ok 5032 parallel/test-webstreams-duplex-fromweb-writev-unhandled-rejection26319 ---26320 duration_ms: 86.5310026321 ...26322ok 5033 parallel/test-webcrypto-sign-verify-rsa26323 ---26324 duration_ms: 262.2200026325 ...26326ok 5034 parallel/test-webstreams-compression-buffer-source26327 ---26328 duration_ms: 107.8460026329 ...26330ok 5035 parallel/test-webstreams-finished26331 ---26332 duration_ms: 87.0060026333 ...26334ok 5036 parallel/test-webstreams-pipeto-write-request26335 ---26336 duration_ms: 86.5760026337 ...26338ok 5037 parallel/test-webstreams-compression-bad-chunks26339 ---26340 duration_ms: 134.5890026341 ...26342ok 5038 parallel/test-webcrypto-prototype-pollution26343 ---26344 duration_ms: 326.3830026345 ...26346ok 5039 parallel/test-webstreams-pipeline26347 ---26348 duration_ms: 107.9960026349 ...26350ok 5040 parallel/test-webstreams-decompression-reject-trailing26351 ---26352 duration_ms: 134.2270026353 ...26354ok 5041 parallel/test-whatwg-encoding-custom-api-basics26355 ---26356 duration_ms: 86.8770026357 ...26358ok 5042 parallel/test-webstreams-queue-wraparound26359 ---26360 duration_ms: 107.9180026361 ...26362ok 5043 parallel/test-webcrypto-sign-verify26363 ---26364 duration_ms: 326.7920026365 ...26366ok 5044 parallel/test-whatwg-encoding-custom-fatal-streaming26367 ---26368 duration_ms: 86.7620026369 ...26370ok 5045 parallel/test-whatwg-encoding-custom-internals26371 ---26372 duration_ms: 86.7720026373 ...26374ok 5046 parallel/test-whatwg-encoding-custom-interop26375 ---26376 duration_ms: 86.9050026377 ...26378ok 5047 parallel/test-whatwg-encoding-custom-textdecoder26379 ---26380 duration_ms: 86.9450026381 ...26382ok 5048 parallel/test-whatwg-encoding-custom-textdecoder-invalid-arg26383 ---26384 duration_ms: 70.0240026385 ...26386ok 5049 parallel/test-whatwg-encoding-custom-textdecoder-streaming26387 ---26388 duration_ms: 70.2010026389 ...26390ok 5050 parallel/test-whatwg-encoding-custom-textdecoder-api-invalid-label26391 ---26392 duration_ms: 87.6370026393 ...26394ok 5051 parallel/test-webworker-ref-unref26395 ---26396 duration_ms: 134.6210026397 ...26398ok 5052 parallel/test-whatwg-encoding-custom-textdecoder-fatal26399 ---26400 duration_ms: 86.7200026401 ...26402ok 5053 parallel/test-whatwg-encoding-custom-textdecoder-ignorebom26403 ---26404 duration_ms: 86.6540026405 ...26406ok 5054 parallel/test-whatwg-encoding-custom-textdecoder-utf16-surrogates26407 ---26408 duration_ms: 86.8600026409 ...26410ok 5055 parallel/test-whatwg-events-eventtarget-this-of-listener26411 ---26412 duration_ms: 69.3860026413 ...26414ok 5056 parallel/test-whatwg-events-add-event-listener-options-passive26415 ---26416 duration_ms: 87.0830026417 ...26418ok 5057 parallel/test-whatwg-events-add-event-listener-options-signal26419 ---26420 duration_ms: 87.4740026421 ...26422ok 5058 parallel/test-whatwg-events-customevent26423 ---26424 duration_ms: 86.5830026425 ...26426ok 5059 parallel/test-whatwg-events-event-constructors26427 ---26428 duration_ms: 86.7600026429 ...26430ok 5060 parallel/test-whatwg-headers26431 ---26432 duration_ms: 86.8840026433 ...26434ok 5061 parallel/test-webcrypto-digest-turboshake-rfc26435 ---26436 duration_ms: 607.6290026437 ...26438ok 5062 parallel/test-whatwg-encoding-singlebyte26439 ---26440 duration_ms: 134.5170026441 ...26442ok 5063 parallel/test-whatwg-readablebytestream-bad-buffers-and-views26443 ---26444 duration_ms: 87.0180026445 ...26446ok 5064 parallel/test-whatwg-readablebytestreambyob26447 ---26448 duration_ms: 87.0100026449 ...26450ok 5065 parallel/test-whatwg-readablebytestream26451 ---26452 duration_ms: 108.1770026453 ...26454ok 5066 parallel/test-whatwg-readablestream-byob-read-min26455 ---26456 duration_ms: 87.9300026457 ...26458ok 5067 parallel/test-whatwg-readablestream26459 ---26460 duration_ms: 88.3820026461 ...26462ok 5068 parallel/test-whatwg-transformstream26463 ---26464 duration_ms: 87.9070026465 ...26466ok 5069 parallel/test-whatwg-readablestream26467 ---26468 duration_ms: 108.3400026469 ...26470ok 5070 parallel/test-whatwg-url-custom-deepequal26471 ---26472 duration_ms: 86.9880026473 ...26474ok 5071 parallel/test-whatwg-url-custom-global26475 ---26476 duration_ms: 86.4750026477 ...26478ok 5072 parallel/test-whatwg-url-custom-href-side-effect26479 ---26480 duration_ms: 86.5190026481 ...26482ok 5073 parallel/test-whatwg-transformstream-cancel-write-race26483 ---26484 duration_ms: 108.0310026485 ...26486ok 5074 parallel/test-whatwg-url-canparse26487 ---26488 duration_ms: 107.9930026489 ...26490ok 5075 parallel/test-whatwg-url-custom-inspect26491 ---26492 duration_ms: 86.4590026493 ...26494ok 5076 parallel/test-whatwg-url-custom-properties26495 ---26496 duration_ms: 86.9370026497 ...26498ok 5077 parallel/test-whatwg-url-custom-searchparams26499 ---26500 duration_ms: 86.8980026501 ...26502ok 5078 parallel/test-whatwg-url-custom-searchparams-append26503 ---26504 duration_ms: 86.4720026505 ...26506ok 5079 parallel/test-whatwg-url-custom-searchparams-get26507 ---26508 duration_ms: 70.0940026509 ...26510ok 5080 parallel/test-whatwg-url-custom-searchparams-constructor26511 ---26512 duration_ms: 86.8530026513 ...26514ok 5081 parallel/test-whatwg-url-custom-parsing26515 ---26516 duration_ms: 108.6600026517 ...26518ok 5082 parallel/test-whatwg-url-custom-searchparams-delete26519 ---26520 duration_ms: 86.5090026521 ...26522ok 5083 parallel/test-whatwg-url-custom-searchparams-entries26523 ---26524 duration_ms: 86.5160026525 ...26526ok 5084 parallel/test-whatwg-url-custom-searchparams-foreach26527 ---26528 duration_ms: 87.0610026529 ...26530ok 5085 parallel/test-whatwg-url-custom-searchparams-getall26531 ---26532 duration_ms: 86.6030026533 ...26534ok 5086 parallel/test-whatwg-url-custom-searchparams-has26535 ---26536 duration_ms: 86.4930026537 ...26538ok 5087 parallel/test-whatwg-url-custom-searchparams-inspect26539 ---26540 duration_ms: 86.8330026541 ...26542ok 5088 parallel/test-whatwg-url-custom-searchparams-keys26543 ---26544 duration_ms: 86.7860026545 ...26546ok 5089 parallel/test-whatwg-url-custom-searchparams-set26547 ---26548 duration_ms: 87.1810026549 ...26550ok 5090 parallel/test-whatwg-url-custom-searchparams-sort26551 ---26552 duration_ms: 86.6470026553 ...26554ok 5091 parallel/test-whatwg-url-custom-searchparams-stringifier26555 ---26556 duration_ms: 86.4930026557 ...26558ok 5092 parallel/test-whatwg-url-custom-searchparams-values26559 ---26560 duration_ms: 86.4550026561 ...26562ok 5093 parallel/test-whatwg-url-custom-setters26563 ---26564 duration_ms: 86.4150026565 ...26566ok 5094 parallel/test-whatwg-url-custom-tostringtag26567 ---26568 duration_ms: 86.5410026569 ...26570ok 5095 parallel/test-whatwg-url-invalidthis26571 ---26572 duration_ms: 86.6600026573 ...26574ok 5096 parallel/test-whatwg-url-override-hostname26575 ---26576 duration_ms: 87.1040026577 ...26578ok 5097 parallel/test-whatwg-url-parse-fast-path26579 ---26580 duration_ms: 87.0890026581 ...26582ok 5098 parallel/test-whatwg-url-properties26583 ---26584 duration_ms: 87.0030026585 ...26586ok 5099 parallel/test-whatwg-url-searchparams-fast-path26587 ---26588 duration_ms: 86.9730026589 ...26590ok 5100 parallel/test-whatwg-webstreams-adapters-streambase26591 ---26592 duration_ms: 86.7060026593 ...26594ok 5101 parallel/test-whatwg-webstreams-adapters-to-readablewritablepair26595 ---26596 duration_ms: 86.5890026597 ...26598ok 5102 parallel/test-whatwg-webstreams-adapters-to-streamreadable26599 ---26600 duration_ms: 86.7570026601 ...26602ok 5103 parallel/test-whatwg-webstreams-adapters-to-readablestream26603 ---26604 duration_ms: 108.1100026605 ...26606ok 5104 parallel/test-whatwg-webstreams-adapters-to-streamwritable26607 ---26608 duration_ms: 86.6360026609 ...26610ok 5105 parallel/test-whatwg-webstreams-coverage26611 ---26612 duration_ms: 86.6010026613 ...26614ok 5106 parallel/test-whatwg-webstreams-compression26615 ---26616 duration_ms: 87.5550026617 ...26618ok 5107 parallel/test-whatwg-webstreams-adapters-to-streamduplex26619 ---26620 duration_ms: 108.5370026621 ...26622ok 5108 parallel/test-whatwg-webstreams-encoding26623 ---26624 duration_ms: 87.0510026625 ...26626ok 5109 parallel/test-whatwg-webstreams-transform-stream-members26627 ---26628 duration_ms: 86.3000026629 ...26630ok 5110 parallel/test-windows-failed-heap-allocation # skip Windows-only26631 ---26632 duration_ms: 69.3340026633 ...26634ok 5111 parallel/test-whatwg-webstreams-adapters-to-writablestream26635 ---26636 duration_ms: 108.0180026637 ...26638ok 5112 parallel/test-windows-abort-exitcode # skip test is windows specific26639 ---26640 duration_ms: 86.3150026641 ...26642ok 5113 parallel/test-whatwg-writablestream26643 ---26644 duration_ms: 107.9210026645 ...26646ok 5114 parallel/test-webcrypto-wrap-unwrap26647 ---26648 duration_ms: 609.9290026649 ...26650ok 5115 parallel/test-whatwg-writablestream-close26651 ---26652 duration_ms: 108.2580026653 ...26654ok 5116 parallel/test-whatwg-webstreams-transfer26655 ---26656 duration_ms: 135.0150026657 ...26658ok 5117 parallel/test-worker26659 ---26660 duration_ms: 107.9020026661 ...26662ok 5118 parallel/test-worker-beforeexit-throw-exit26663 ---26664 duration_ms: 110.4920026665 ...26666ok 5119 parallel/test-worker26667 ---26668 duration_ms: 137.7460026669 ...26670ok 5120 parallel/test-worker-abort-on-uncaught-exception26671 ---26672 duration_ms: 135.8640026673 ...26674ok 5121 parallel/test-worker-abort-on-uncaught-exception-terminate26675 ---26676 duration_ms: 135.6270026677 ...26678ok 5122 parallel/test-v8-stop-coverage26679 ---26680 duration_ms: 2308.3650026681 ...26682ok 5123 parallel/test-worker-cleanup-handles26683 ---26684 duration_ms: 115.5710026685 ...26686ok 5124 parallel/test-worker-broadcastchannel26687 ---26688 duration_ms: 136.2100026689 ...26690ok 5125 parallel/test-worker-broadcastchannel-wpt26691 ---26692 duration_ms: 138.6400026693 ...26694ok 5126 parallel/test-worker-cjs-workerdata26695 ---26696 duration_ms: 137.1010026697 ...26698ok 5127 parallel/test-worker-crypto-sign-transfer-result26699 ---26700 duration_ms: 135.4940026701 ...26702ok 5128 parallel/test-worker-cleanexit-with-js26703 ---26704 duration_ms: 172.0950026705 ...26706ok 5129 parallel/test-worker-dispose26707 ---26708 duration_ms: 118.6830026709 ...26710ok 5130 parallel/test-worker-cwd-race-condition26711 ---26712 duration_ms: 136.9570026713 ...26714ok 5131 parallel/test-worker-console-listeners26715 ---26716 duration_ms: 174.1670026717 ...26718ok 5132 parallel/test-worker-dns-terminate26719 ---26720 duration_ms: 123.7850026721 ...26722ok 5133 parallel/test-worker-cpu-usage26723 ---26724 duration_ms: 168.8020026725 ...26726ok 5134 parallel/test-worker-data-url26727 ---26728 duration_ms: 168.4310026729 ...26730ok 5135 parallel/test-worker-error-primitive26731 ---26732 duration_ms: 119.0480026733 ...26734ok 5136 parallel/test-worker-error-stack-getter-throws26735 ---26736 duration_ms: 113.5670026737 ...26738ok 5137 parallel/test-worker-cli-options26739 ---26740 duration_ms: 212.0010026741 ...26742ok 5138 parallel/test-worker-cpu-profile26743 ---26744 duration_ms: 210.5930026745 ...26746ok 5139 parallel/test-worker-esm-exit26747 ---26748 duration_ms: 111.2890026749 ...26750ok 5140 parallel/test-worker-esm-missing-main26751 ---26752 duration_ms: 110.3550026753 ...26754ok 5141 parallel/test-worker-esmodule26755 ---26756 duration_ms: 110.4110026757 ...26758ok 5142 parallel/test-worker-dns-terminate-during-query26759 ---26760 duration_ms: 147.5670026761 ...26762ok 5143 parallel/test-worker-arraybuffer-zerofill26763 ---26764 duration_ms: 266.2730026765 ...26766ok 5144 parallel/test-worker-event26767 ---26768 duration_ms: 108.2710026769 ...26770ok 5145 parallel/test-worker-execargv-invalid26771 ---26772 duration_ms: 89.2480026773 ...26774ok 5146 parallel/test-worker-execargv26775 ---26776 duration_ms: 107.9480026777 ...26778ok 5147 parallel/test-worker-exit-event-error26779 ---26780 duration_ms: 109.1780026781 ...26782ok 5148 parallel/test-worker-environmentdata26783 ---26784 duration_ms: 220.8730026785 ...26786ok 5149 parallel/test-worker-exit-from-uncaught-exception26787 ---26788 duration_ms: 135.9370026789 ...26790ok 5150 parallel/test-worker-fs-stat-watcher26791 ---26792 duration_ms: 134.2800026793 ...26794ok 5151 parallel/test-worker-exit-code26795 ---26796 duration_ms: 170.2720026797 ...26798ok 5152 parallel/test-worker-hasref26799 ---26800 duration_ms: 137.7550026801 ...26802ok 5153 parallel/test-worker-heap-profile26803 ---26804 duration_ms: 136.7020026805 ...26806ok 5154 parallel/test-worker-invalid-workerdata26807 ---26808 duration_ms: 113.1740026809 ...26810ok 5155 parallel/test-worker-heap-statistics26811 ---26812 duration_ms: 141.7370026813 ...26814ok 5156 parallel/test-worker-heapdump-failure26815 ---26816 duration_ms: 141.3510026817 ...26818ok 5157 parallel/test-worker-http2-generic-streams-terminate26819 ---26820 duration_ms: 140.2550026821 ...26822ok 5158 parallel/test-worker-debug26823 ---26824 duration_ms: 337.0060026825 ...26826ok 5159 parallel/test-worker-internal-modules26827 ---26828 duration_ms: 169.7580026829 ...26830ok 5160 parallel/test-worker-message-channel26831 ---26832 duration_ms: 139.1600026833 ...26834ok 5161 parallel/test-worker-cleanexit-with-moduleload26835 ---26836 duration_ms: 410.1470026837 ...26838ok 5162 parallel/test-worker-load-file-with-extension-other-than-js26839 ---26840 duration_ms: 172.7100026841 ...26842ok 5163 parallel/test-worker-message-event26843 ---26844 duration_ms: 135.7830026845 ...26846ok 5164 parallel/test-worker-message-port-close26847 ---26848 duration_ms: 101.2450026849 ...26850ok 5165 parallel/test-worker-message-port-close-while-receiving26851 ---26852 duration_ms: 103.7380026853 ...26854ok 5166 parallel/test-worker-message-mark-as-uncloneable26855 ---26856 duration_ms: 140.1000026857 ...26858ok 5167 parallel/test-worker-message-channel-sharedarraybuffer26859 ---26860 duration_ms: 176.3350026861 ...26862ok 5168 parallel/test-worker-message-port-arraybuffer26863 ---26864 duration_ms: 121.2730026865 ...26866ok 5169 parallel/test-worker-message-port-constructor26867 ---26868 duration_ms: 120.9180026869 ...26870ok 5170 parallel/test-worker-message-port-infinite-message-loop26871 ---26872 duration_ms: 120.3010026873 ...26874ok 5171 parallel/test-worker-message-port26875 ---26876 duration_ms: 149.9040026877 ...26878ok 5172 parallel/test-worker-message-not-serializable26879 ---26880 duration_ms: 177.5260026881 ...26882ok 5173 parallel/test-worker-message-port-inspect-during-init-hook26883 ---26884 duration_ms: 131.1790026885 ...26886ok 5174 parallel/test-worker-message-port-message-port-transferring26887 ---26888 duration_ms: 102.2180026889 ...26890ok 5175 parallel/test-worker-message-port-jstransferable-nested-untransferable26891 ---26892 duration_ms: 113.4670026893 ...26894ok 5176 parallel/test-watch-mode-kill-signal-default26895 ---26896 duration_ms: 1511.9800026897 ...26898ok 5177 parallel/test-watch-mode-kill-signal-override26899 ---26900 duration_ms: 1511.9740026901 ...26902ok 5178 parallel/test-worker-message-port-drain26903 ---26904 duration_ms: 189.1820026905 ...26906ok 5179 parallel/test-worker-message-port-move26907 ---26908 duration_ms: 138.5540026909 ...26910ok 5180 parallel/test-webstorage26911 ---26912 duration_ms: 1111.6440026913 ...26914ok 5181 parallel/test-worker-message-port-multiple-sharedarraybuffers26915 ---26916 duration_ms: 120.3150026917 ...26918ok 5182 parallel/test-worker-message-port-receive-message26919 ---26920 duration_ms: 118.5180026921 ...26922ok 5183 parallel/test-worker-message-port-transfer-duplicate26923 ---26924 duration_ms: 108.9400026925 ...26926ok 5184 parallel/test-worker-message-port-transfer-fake-js-transferable-internal26927 ---26928 duration_ms: 98.2350026929 ...26930ok 5185 parallel/test-worker-message-port-transfer-closed26931 ---26932 duration_ms: 122.5980026933 ...26934ok 5186 parallel/test-worker-message-port-transfer-fake-js-transferable26935 ---26936 duration_ms: 123.0040026937 ...26938ok 5187 parallel/test-worker-message-port-transfer-filehandle26939 ---26940 duration_ms: 123.1070026941 ...26942ok 5188 parallel/test-worker-message-port-transfer-native26943 ---26944 duration_ms: 112.6270026945 ...26946ok 5189 parallel/test-worker-exit-heapsnapshot26947 ---26948 duration_ms: 422.3170026949 ...26950ok 5190 parallel/test-worker-eval-typescript26951 ---26952 duration_ms: 777.3390026953 ...26954ok 5191 parallel/test-worker-message-port-transfer-target26955 ---26956 duration_ms: 399.1650026957 ...26958ok 5192 parallel/test-worker-message-port-transfer-self26959 ---26960 duration_ms: 408.1910026961 ...26962ok 5193 parallel/test-worker-heap-snapshot26963 ---26964 duration_ms: 693.1340026965 ...26966ok 5194 parallel/test-worker-http2-stream-terminate26967 ---26968 duration_ms: 682.4520026969 ...26970ok 5195 parallel/test-worker-memory26971 ---26972 duration_ms: 648.0230026973 ...26974ok 5196 parallel/test-worker-nested-on-process-exit26975 ---26976 duration_ms: 304.3200026977 ...26978ok 5197 parallel/test-worker-nearheaplimit-deadlock26979 ---26980 duration_ms: 320.5560026981 ...26982ok 5198 parallel/test-worker-name26983 ---26984 duration_ms: 333.6700026985 ...26986ok 5199 parallel/test-worker-mjs-workerdata26987 ---26988 duration_ms: 335.1030026989 ...26990ok 5200 parallel/test-worker-messaging-errors-invalid26991 ---26992 duration_ms: 350.7030026993 ...26994ok 5201 parallel/test-worker-messaging-errors-handler26995 ---26996 duration_ms: 352.4110026997 ...26998ok 5202 parallel/test-worker-message-type-unknown26999 ---27000 duration_ms: 371.6430027001 ...27002ok 5203 parallel/test-worker-messageport-hasref27003 ---27004 duration_ms: 369.0510027005 ...27006ok 5204 parallel/test-worker-messaging27007 ---27008 duration_ms: 368.2960027009 ...27010ok 5205 parallel/test-worker-message-port-transfer-terminate27011 ---27012 duration_ms: 415.8330027013 ...27014ok 5206 parallel/test-worker-message-port-wasm-threads27015 ---27016 duration_ms: 395.1450027017 ...27018ok 5207 parallel/test-worker-message-transfer-port-mark-as-untransferable27019 ---27020 duration_ms: 393.4030027021 ...27022ok 5208 parallel/test-worker-message-port-wasm-module27023 ---27024 duration_ms: 419.2060027025 ...27026ok 5209 parallel/test-worker-message-port-terminate-transfer-list27027 ---27028 duration_ms: 494.4720027029 ...27030ok 5210 parallel/test-worker-message-port-message-before-close27031 ---27032 duration_ms: 555.6020027033 ...27034ok 5211 parallel/test-worker-init-failure27035 ---27036 duration_ms: 779.6110027037 ...27038ok 5212 parallel/test-worker-ref-onexit27039 ---27040 duration_ms: 107.7990027041 ...27042ok 5213 parallel/test-worker-ref27043 ---27044 duration_ms: 109.3830027045 ...27046ok 5214 parallel/test-worker-nexttick-terminate27047 ---27048 duration_ms: 137.5130027049 ...27050ok 5215 parallel/test-worker-no-sab27051 ---27052 duration_ms: 136.6510027053 ...27054ok 5216 parallel/test-worker-nested-uncaught27055 ---27056 duration_ms: 439.7550027057 ...27058ok 5217 parallel/test-worker-non-fatal-uncaught-exception27059 ---27060 duration_ms: 136.6640027061 ...27062ok 5218 parallel/test-worker-onmessage27063 ---27064 duration_ms: 137.1090027065 ...27066ok 5219 parallel/test-worker-no-stdin-stdout-interaction27067 ---27068 duration_ms: 137.4150027069 ...27070ok 5220 parallel/test-worker-parent-port-ref27071 ---27072 duration_ms: 137.7010027073 ...27074ok 5221 parallel/test-worker-process-argv27075 ---27076 duration_ms: 136.3920027077 ...27078ok 5222 parallel/test-worker-onmessage-not-a-function27079 ---27080 duration_ms: 137.5830027081 ...27082ok 5223 parallel/test-worker-process-env-shared27083 ---27084 duration_ms: 135.2070027085 ...27086ok 5224 parallel/test-worker-process-exit-async-module27087 ---27088 duration_ms: 135.1020027089 ...27090ok 5225 parallel/test-worker-relative-path27091 ---27092 duration_ms: 135.0900027093 ...27094ok 5226 parallel/test-worker-relative-path-double-dot27095 ---27096 duration_ms: 135.2270027097 ...27098ok 5227 parallel/test-worker-safe-getters27099 ---27100 duration_ms: 134.1680027101 ...27102ok 5228 parallel/test-worker-sharedarraybuffer-from-worker-thread27103 ---27104 duration_ms: 134.3460027105 ...27106ok 5229 parallel/test-worker-process-cwd27107 ---27108 duration_ms: 169.1460027109 ...27110ok 5230 parallel/test-worker-spec-differences27111 ---27112 duration_ms: 134.2880027113 ...27114ok 5231 parallel/test-worker-on-process-exit27115 ---27116 duration_ms: 211.8350027117 ...27118ok 5232 parallel/test-worker-stack-overflow27119 ---27120 duration_ms: 135.9660027121 ...27122ok 5233 parallel/test-worker-terminate-null-handler27123 ---27124 duration_ms: 108.4520027125 ...27126ok 5234 parallel/test-worker-stdio27127 ---27128 duration_ms: 134.2240027129 ...27130ok 5235 parallel/test-worker-node-options27131 ---27132 duration_ms: 262.5800027133 ...27134ok 5236 parallel/test-worker-terminate-timers27135 ---27136 duration_ms: 111.9000027137 ...27138ok 5237 parallel/test-worker-type-check27139 ---27140 duration_ms: 92.3030027141 ...27142ok 5238 parallel/test-worker-process-env27143 ---27144 duration_ms: 261.9650027145 ...27146ok 5239 parallel/test-worker-stdio-flush27147 ---27148 duration_ms: 136.6060027149 ...27150ok 5240 parallel/test-worker-stdio-from-preload-module27151 ---27152 duration_ms: 135.9800027153 ...27154ok 5241 parallel/test-worker-stdio-flush-inflight27155 ---27156 duration_ms: 137.5010027157 ...27158ok 5242 parallel/test-worker-syntax-error-file27159 ---27160 duration_ms: 136.0300027161 ...27162ok 5243 parallel/test-worker-terminate-microtask-loop27163 ---27164 duration_ms: 135.2250027165 ...27166ok 5244 parallel/test-worker-terminate-http2-respond-with-file27167 ---27168 duration_ms: 137.0310027169 ...27170ok 5245 parallel/test-worker-terminate-nested27171 ---27172 duration_ms: 135.3780027173 ...27174ok 5246 parallel/test-worker-terminate-ref-public-port27175 ---27176 duration_ms: 134.5370027177 ...27178ok 5247 parallel/test-worker-resource-limits27179 ---27180 duration_ms: 260.9900027181 ...27182ok 5248 parallel/test-worker-terminate-unrefed27183 ---27184 duration_ms: 135.1960027185 ...27186ok 5249 parallel/test-worker-uncaught-exception27187 ---27188 duration_ms: 108.8070027189 ...27190ok 5250 parallel/test-worker-thread-name27191 ---27192 duration_ms: 134.8200027193 ...27194ok 5251 parallel/test-worker-syntax-error27195 ---27196 duration_ms: 169.3710027197 ...27198ok 5252 parallel/test-worker-terminate-source-map27199 ---27200 duration_ms: 167.7970027201 ...27202ok 5253 parallel/test-worker-unsupported-eval-on-url27203 ---27204 duration_ms: 86.6210027205 ...27206ok 5254 parallel/test-worker-unsupported-path27207 ---27208 duration_ms: 86.1720027209 ...27210ok 5255 parallel/test-worker-track-unmanaged-fds27211 ---27212 duration_ms: 171.3090027213 ...27214ok 5256 parallel/test-worker-uncaught-exception-async27215 ---27216 duration_ms: 137.0830027217 ...27218ok 5257 parallel/test-wrap-js-stream-duplex27219 ---27220 duration_ms: 87.1840027221 ...27222ok 5258 parallel/test-wrap-js-stream-exceptions27223 ---27224 duration_ms: 87.2610027225 ...27226ok 5259 parallel/test-wrap-js-stream-read-stop27227 ---27228 duration_ms: 87.3180027229 ...27230ok 5260 parallel/test-worker-messaging-errors-timeout27231 ---27232 duration_ms: 708.9980027233 ...27234ok 5261 parallel/test-zlib-brotli-flush27235 ---27236 duration_ms: 86.4040027237 ...27238ok 5262 parallel/test-worker-workerdata-messageport27239 ---27240 duration_ms: 109.3650027241 ...27242ok 5263 parallel/test-worker-stack-overflow-stack-size27243 ---27244 duration_ms: 261.8070027245 ...27246ok 5264 parallel/test-wrap-js-stream-destroy27247 ---27248 duration_ms: 109.2000027249 ...27250ok 5265 parallel/test-zlib-brotli-flush-invalid-kind27251 ---27252 duration_ms: 86.4410027253 ...27254ok 5266 parallel/test-worker-unsupported-things27255 ---27256 duration_ms: 135.0560027257 ...27258ok 5267 parallel/test-worker-voluntarily-exit-followed-by-addition27259 ---27260 duration_ms: 134.3600027261 ...27262ok 5268 parallel/test-zlib-brotli-dictionary27263 ---27264 duration_ms: 108.5420027265 ...27266ok 5269 parallel/test-worker-voluntarily-exit-followed-by-throw27267 ---27268 duration_ms: 134.6760027269 ...27270ok 5270 parallel/test-worker-workerdata-sharedarraybuffer27271 ---27272 duration_ms: 134.8780027273 ...27274ok 5271 parallel/test-zlib-brotli27275 ---27276 duration_ms: 134.6120027277 ...27278ok 5272 parallel/test-zlib-brotli-from-brotli27279 ---27280 duration_ms: 107.7230027281 ...27282ok 5273 parallel/test-zlib-brotli-from-string27283 ---27284 duration_ms: 87.2330027285 ...27286ok 5274 parallel/test-zlib-brotli-kmaxlength-rangeerror27287 ---27288 duration_ms: 86.5840027289 ...27290ok 5275 parallel/test-zlib-close-after-error27291 ---27292 duration_ms: 86.7230027293 ...27294ok 5276 parallel/test-zlib-const27295 ---27296 duration_ms: 87.1120027297 ...27298ok 5277 parallel/test-zlib-crc3227299 ---27300 duration_ms: 86.5370027301 ...27302ok 5278 parallel/test-zlib-close-after-write27303 ---27304 duration_ms: 107.9780027305 ...27306ok 5279 parallel/test-zlib-create-raw27307 ---27308 duration_ms: 87.4340027309 ...27310ok 5280 parallel/test-zlib-deflate-constructors27311 ---27312 duration_ms: 87.2950027313 ...27314ok 5281 parallel/test-zlib-deflate-raw-inherits27315 ---27316 duration_ms: 87.3020027317 ...27318ok 5282 parallel/test-zlib-destroy27319 ---27320 duration_ms: 87.5150027321 ...27322ok 5283 parallel/test-worker-vm-context-terminate27323 ---27324 duration_ms: 209.0180027325 ...27326ok 5284 parallel/test-zlib-dictionary27327 ---27328 duration_ms: 87.0540027329 ...27330ok 5285 parallel/test-zlib-failed-init27331 ---27332 duration_ms: 86.6730027333 ...27334ok 5286 parallel/test-worker-unref-from-message-during-exit27335 ---27336 duration_ms: 261.0830027337 ...27338ok 5287 parallel/test-trace-events-http27339 ---27340 duration_ms: 4253.2550027341 ...27342ok 5288 parallel/test-zlib-close-in-ondata27343 ---27344 duration_ms: 135.1210027345 ...27346ok 5289 parallel/test-zlib-flush-drain-longblock27347 ---27348 duration_ms: 86.4670027349 ...27350ok 5290 parallel/test-zlib-empty-buffer27351 ---27352 duration_ms: 108.2310027353 ...27354ok 5291 parallel/test-zlib-dictionary-fail27355 ---27356 duration_ms: 109.1310027357 ...27358ok 5292 parallel/test-zlib-flush-flags27359 ---27360 duration_ms: 87.0640027361 ...27362ok 5293 parallel/test-zlib-flush-write-sync-interleaved27363 ---27364 duration_ms: 86.7090027365 ...27366ok 5294 parallel/test-zlib-flush27367 ---27368 duration_ms: 108.8860027369 ...27370ok 5295 parallel/test-zlib-from-concatenated-gzip27371 ---27372 duration_ms: 86.8660027373 ...27374ok 5296 parallel/test-zlib-flush-drain27375 ---27376 duration_ms: 108.3330027377 ...27378ok 5297 parallel/test-zlib-destroy-pipe27379 ---27380 duration_ms: 134.4920027381 ...27382ok 5298 parallel/test-zlib-from-string27383 ---27384 duration_ms: 86.6570027385 ...27386ok 5299 parallel/test-zlib-no-stream27387 ---27388 duration_ms: 56.4060027389 ...27390ok 5300 parallel/test-zlib-invalid-arg-value-brotli-compress27391 ---27392 duration_ms: 87.1540027393 ...27394ok 5301 parallel/test-zlib-invalid-input27395 ---27396 duration_ms: 86.9740027397 ...27398ok 5302 parallel/test-zlib-kmaxlength-rangeerror27399 ---27400 duration_ms: 87.0110027401 ...27402ok 5303 parallel/test-zlib-from-gzip27403 ---27404 duration_ms: 108.5160027405 ...27406ok 5304 parallel/test-zlib-maxOutputLength27407 ---27408 duration_ms: 86.5990027409 ...27410ok 5305 parallel/test-zlib-from-gzip-with-trailing-garbage27411 ---27412 duration_ms: 108.1040027413 ...27414ok 5306 parallel/test-zlib-negative-zero27415 ---27416 duration_ms: 87.4330027417 ...27418ok 5307 parallel/test-zlib-convenience-methods27419 ---27420 duration_ms: 210.9400027421 ...27422ok 5308 parallel/test-zlib-invalid-input-memory27423 ---27424 duration_ms: 110.1240027425 ...27426ok 5309 parallel/test-zlib-not-string-or-buffer27427 ---27428 duration_ms: 87.3040027429 ...27430ok 5310 parallel/test-zlib-object-write27431 ---27432 duration_ms: 86.5940027433 ...27434ok 5311 parallel/test-zlib-premature-end27435 ---27436 duration_ms: 87.6450027437 ...27438ok 5312 parallel/test-zlib-random-byte-pipes27439 ---27440 duration_ms: 87.5810027441 ...27442ok 5313 parallel/test-zlib-reset-before-write27443 ---27444 duration_ms: 86.9110027445 ...27446ok 5314 parallel/test-zlib-reset-during-write27447 ---27448 duration_ms: 87.0750027449 ...27450ok 5315 parallel/test-zlib-sync-no-event27451 ---27452 duration_ms: 87.1550027453 ...27454ok 5316 parallel/test-zlib27455 ---27456 duration_ms: 325.6040027457 ...27458ok 5317 parallel/test-zlib-params27459 ---27460 duration_ms: 109.0520027461 ...27462ok 5318 parallel/test-zlib-reject-garbage-after-end27463 ---27464 duration_ms: 108.6730027465 ...27466ok 5319 parallel/test-zlib-truncated27467 ---27468 duration_ms: 109.3220027469 ...27470ok 5320 parallel/test-zlib-unzip-one-byte-chunks27471 ---27472 duration_ms: 87.3460027473 ...27474ok 5321 parallel/test-zlib-write-after-close27475 ---27476 duration_ms: 88.8520027477 ...27478ok 5322 parallel/test-zlib-write-after-flush27479 ---27480 duration_ms: 86.8800027481 ...27482ok 5323 parallel/test-zlib-zero-byte27483 ---27484 duration_ms: 87.5600027485 ...27486ok 5324 parallel/test-zlib-type-error27487 ---27488 duration_ms: 134.4830027489 ...27490ok 5325 parallel/test-zlib-unused-weak27491 ---27492 duration_ms: 134.4720027493 ...27494ok 5326 parallel/test-zlib-write-after-end27495 ---27496 duration_ms: 108.5040027497 ...27498ok 5327 parallel/test-zlib-zero-windowBits27499 ---27500 duration_ms: 107.9790027501 ...27502ok 5328 parallel/test-zlib-zip-internals27503 ---27504 duration_ms: 107.9980027505 ...27506ok 5329 parallel/test-zlib-zip-edgecases27507 ---27508 duration_ms: 134.7270027509 ...27510ok 5330 parallel/test-zlib-zip-encoding27511 ---27512 duration_ms: 135.0410027513 ...27514ok 5331 parallel/test-zlib-zip27515 ---27516 duration_ms: 168.4900027517 ...27518ok 5332 parallel/test-zlib-zip-metadata27519 ---27520 duration_ms: 135.9890027521 ...27522ok 5333 parallel/test-zlib-zip-file-lifecycle27523 ---27524 duration_ms: 168.0870027525 ...27526ok 5334 parallel/test-zlib-zip-sync27527 ---27528 duration_ms: 135.0450027529 ...27530ok 5335 parallel/test-zlib-zip-vfs27531 ---27532 duration_ms: 134.3040027533 ...27534ok 5336 parallel/test-zlib-zstd-dictionary27535 ---27536 duration_ms: 108.5960027537 ...27538ok 5337 parallel/test-zlib-zstd-flush27539 ---27540 duration_ms: 108.4760027541 ...27542ok 5338 parallel/test-zlib-zip-interop27543 ---27544 duration_ms: 169.1610027545 ...27546ok 5339 parallel/test-zlib-zstd-from-string27547 ---27548 duration_ms: 109.4830027549 ...27550ok 5340 parallel/test-zlib-zstd-from-zstd27551 ---27552 duration_ms: 107.9820027553 ...27554ok 5341 parallel/test-zlib-zstd27555 ---27556 duration_ms: 134.4030027557 ...27558ok 5342 parallel/test-x509-escaping27559 ---27560 duration_ms: 507.8310027561 ...27562ok 5343 parallel/test-zlib-zip-files27563 ---27564 duration_ms: 209.4640027565 ...27566ok 5344 parallel/test-zlib-zip-hardening27567 ---27568 duration_ms: 209.5690027569 ...27570ok 5345 parallel/test-zlib-zip-property27571 ---27572 duration_ms: 209.2510027573 ...27574ok 5346 parallel/test-zlib-zstd-kmaxlength-rangeerror27575 ---27576 duration_ms: 110.9130027577 ...27578ok 5347 sea/test-build-sea-already-exists # skip Running the resultant binary fails with `/home/iojs/node-tmp/.tmp.2379/sea: error while loading shared libraries: libicui18n.so.71: cannot open shared object file: No such file or directory`.27579 ---27580 duration_ms: 87.8920027581 ...27582ok 5348 sea/test-build-sea # skip Running the resultant binary fails with `/home/iojs/node-tmp/.tmp.2379/sea: error while loading shared libraries: libicui18n.so.71: cannot open shared object file: No such file or directory`.27583 ---27584 duration_ms: 109.5060027585 ...27586ok 5349 parallel/test-zlib-zstd-pledged-src-size27587 ---27588 duration_ms: 111.4410027589 ...27590ok 5350 parallel/test-zlib-zip-security-hardening27591 ---27592 duration_ms: 209.1520027593 ...27594ok 5351 parallel/test-zlib-zip-writable27595 ---27596 duration_ms: 209.8670027597 ...27598ok 5352 sea/test-build-sea-config-not-found # skip Running the resultant binary fails with `/home/iojs/node-tmp/.tmp.2379/sea: error while loading shared libraries: libicui18n.so.71: cannot open shared object file: No such file or directory`.27599 ---27600 duration_ms: 108.4310027601 ...27602ok 5353 sea/test-build-sea-elf-segments # skip Running the resultant binary fails with `/home/iojs/node-tmp/.tmp.2379/sea: error while loading shared libraries: libicui18n.so.71: cannot open shared object file: No such file or directory`.27603 ---27604 duration_ms: 87.0210027605 ...27606ok 5354 sea/test-build-sea-custom-argv0 # skip Running the resultant binary fails with `/home/iojs/node-tmp/.tmp.2379/sea: error while loading shared libraries: libicui18n.so.71: cannot open shared object file: No such file or directory`.27607 ---27608 duration_ms: 107.8500027609 ...27610ok 5355 sea/test-build-sea-invalid-executable # skip Running the resultant binary fails with `/home/iojs/node-tmp/.tmp.2379/sea: error while loading shared libraries: libicui18n.so.71: cannot open shared object file: No such file or directory`.27611 ---27612 duration_ms: 86.9940027613 ...27614ok 5356 sea/test-build-sea-invalid-exec-argv # skip Running the resultant binary fails with `/home/iojs/node-tmp/.tmp.2379/sea: error while loading shared libraries: libicui18n.so.71: cannot open shared object file: No such file or directory`.27615 ---27616 duration_ms: 88.3330027617 ...27618ok 5357 sea/test-build-sea-invalid-json # skip Running the resultant binary fails with `/home/iojs/node-tmp/.tmp.2379/sea: error while loading shared libraries: libicui18n.so.71: cannot open shared object file: No such file or directory`.27619 ---27620 duration_ms: 88.0040027621 ...27622ok 5358 sea/test-build-sea-invalid-assets # skip Running the resultant binary fails with `/home/iojs/node-tmp/.tmp.2379/sea: error while loading shared libraries: libicui18n.so.71: cannot open shared object file: No such file or directory`.27623 ---27624 duration_ms: 107.9090027625 ...27626ok 5359 sea/test-build-sea-executable-field # skip Running the resultant binary fails with `/home/iojs/node-tmp/.tmp.2379/sea: error while loading shared libraries: libicui18n.so.71: cannot open shared object file: No such file or directory`.27627 ---27628 duration_ms: 109.7620027629 ...27630ok 5360 sea/test-build-sea-invalid-boolean-fields # skip Running the resultant binary fails with `/home/iojs/node-tmp/.tmp.2379/sea: error while loading shared libraries: libicui18n.so.71: cannot open shared object file: No such file or directory`.27631 ---27632 duration_ms: 108.3650027633 ...27634ok 5361 sea/test-build-sea-missing-main # skip Running the resultant binary fails with `/home/iojs/node-tmp/.tmp.2379/sea: error while loading shared libraries: libicui18n.so.71: cannot open shared object file: No such file or directory`.27635 ---27636 duration_ms: 110.0170027637 ...27638ok 5362 sea/test-build-sea-missing-output # skip Running the resultant binary fails with `/home/iojs/node-tmp/.tmp.2379/sea: error while loading shared libraries: libicui18n.so.71: cannot open shared object file: No such file or directory`.27639 ---27640 duration_ms: 107.9390027641 ...27642ok 5363 sea/test-single-executable-application-asset-keys # skip Running the resultant binary fails with `/home/iojs/node-tmp/.tmp.2379/sea: error while loading shared libraries: libicui18n.so.71: cannot open shared object file: No such file or directory`.27643 ---27644 duration_ms: 86.5790027645 ...27646ok 5364 sea/test-build-sea-vfs-incompatible-options # skip Running the resultant binary fails with `/home/iojs/node-tmp/.tmp.2379/sea: error while loading shared libraries: libicui18n.so.71: cannot open shared object file: No such file or directory`.27647 ---27648 duration_ms: 108.3540027649 ...27650ok 5365 sea/test-single-executable-application # skip Running the resultant binary fails with `/home/iojs/node-tmp/.tmp.2379/sea: error while loading shared libraries: libicui18n.so.71: cannot open shared object file: No such file or directory`.27651 ---27652 duration_ms: 108.5140027653 ...27654ok 5366 sea/test-single-executable-application-assets # skip Running the resultant binary fails with `/home/iojs/node-tmp/.tmp.2379/sea: error while loading shared libraries: libicui18n.so.71: cannot open shared object file: No such file or directory`.27655 ---27656 duration_ms: 108.3010027657 ...27658ok 5367 sea/test-single-executable-application-asset-keys-empty # skip Running the resultant binary fails with `/home/iojs/node-tmp/.tmp.2379/sea: error while loading shared libraries: libicui18n.so.71: cannot open shared object file: No such file or directory`.27659 ---27660 duration_ms: 110.2220027661 ...27662ok 5368 sea/test-single-executable-application-assets-raw # skip Running the resultant binary fails with `/home/iojs/node-tmp/.tmp.2379/sea: error while loading shared libraries: libicui18n.so.71: cannot open shared object file: No such file or directory`.27663 ---27664 duration_ms: 108.2320027665 ...27666ok 5369 sea/test-single-executable-application-esm # skip Running the resultant binary fails with `/home/iojs/node-tmp/.tmp.2379/sea: error while loading shared libraries: libicui18n.so.71: cannot open shared object file: No such file or directory`.27667 ---27668 duration_ms: 86.6880027669 ...27670ok 5370 sea/test-single-executable-application-esm-code-cache # skip Running the resultant binary fails with `/home/iojs/node-tmp/.tmp.2379/sea: error while loading shared libraries: libicui18n.so.71: cannot open shared object file: No such file or directory`.27671 ---27672 duration_ms: 87.1750027673 ...27674ok 5371 sea/test-single-executable-application-assets-nonexistent-file27675 ---27676 duration_ms: 134.5180027677 ...27678ok 5372 sea/test-single-executable-application-assets-invalid-type27679 ---27680 duration_ms: 136.8540027681 ...27682ok 5373 sea/test-single-executable-application-empty # skip Running the resultant binary fails with `/home/iojs/node-tmp/.tmp.2379/sea: error while loading shared libraries: libicui18n.so.71: cannot open shared object file: No such file or directory`.27683 ---27684 duration_ms: 108.9410027685 ...27686ok 5374 sea/test-single-executable-application-disable-experimental-sea-warning # skip Running the resultant binary fails with `/home/iojs/node-tmp/.tmp.2379/sea: error while loading shared libraries: libicui18n.so.71: cannot open shared object file: No such file or directory`.27687 ---27688 duration_ms: 110.1870027689 ...27690ok 5375 sea/test-single-executable-application-exec-argv-extension-env # skip Running the resultant binary fails with `/home/iojs/node-tmp/.tmp.2379/sea: error while loading shared libraries: libicui18n.so.71: cannot open shared object file: No such file or directory`.27691 ---27692 duration_ms: 87.1330027693 ...27694ok 5376 sea/test-single-executable-application-exec-argv-empty # skip Running the resultant binary fails with `/home/iojs/node-tmp/.tmp.2379/sea: error while loading shared libraries: libicui18n.so.71: cannot open shared object file: No such file or directory`.27695 ---27696 duration_ms: 109.0060027697 ...27698ok 5377 sea/test-single-executable-application-exec-argv # skip Running the resultant binary fails with `/home/iojs/node-tmp/.tmp.2379/sea: error while loading shared libraries: libicui18n.so.71: cannot open shared object file: No such file or directory`.27699 ---27700 duration_ms: 110.4750027701 ...27702ok 5378 sea/test-single-executable-application-exec-argv-extension-cli # skip Running the resultant binary fails with `/home/iojs/node-tmp/.tmp.2379/sea: error while loading shared libraries: libicui18n.so.71: cannot open shared object file: No such file or directory`.27703 ---27704 duration_ms: 108.4310027705 ...27706ok 5379 sea/test-single-executable-application-inspect-in-sea-flags # skip Running the resultant binary fails with `/home/iojs/node-tmp/.tmp.2379/sea: error while loading shared libraries: libicui18n.so.71: cannot open shared object file: No such file or directory`.27707 ---27708 duration_ms: 86.9030027709 ...27710ok 5380 sea/test-single-executable-application-snapshot # skip Running the resultant binary fails with `/home/iojs/node-tmp/.tmp.2379/sea: error while loading shared libraries: libicui18n.so.71: cannot open shared object file: No such file or directory`.27711 ---27712 duration_ms: 86.7630027713 ...27714ok 5381 sea/test-single-executable-application-exec-argv-extension-none # skip Running the resultant binary fails with `/home/iojs/node-tmp/.tmp.2379/sea: error while loading shared libraries: libicui18n.so.71: cannot open shared object file: No such file or directory`.27715 ---27716 duration_ms: 107.8630027717 ...27718ok 5382 sea/test-single-executable-application-inspect # skip Running the resultant binary fails with `/home/iojs/node-tmp/.tmp.2379/sea: error while loading shared libraries: libicui18n.so.71: cannot open shared object file: No such file or directory`.27719 ---27720 duration_ms: 108.1050027721 ...27722ok 5383 sea/test-single-executable-application-snapshot-and-code-cache # skip Running the resultant binary fails with `/home/iojs/node-tmp/.tmp.2379/sea: error while loading shared libraries: libicui18n.so.71: cannot open shared object file: No such file or directory`.27723 ---27724 duration_ms: 87.6080027725 ...27726ok 5384 sea/test-single-executable-application-snapshot-worker # skip Running the resultant binary fails with `/home/iojs/node-tmp/.tmp.2379/sea: error while loading shared libraries: libicui18n.so.71: cannot open shared object file: No such file or directory`.27727 ---27728 duration_ms: 87.0600027729 ...27730ok 5385 parallel/test-zlib-zip-fuzz27731 ---27732 duration_ms: 407.3130027733 ...27734ok 5386 sea/test-single-executable-application-vfs # skip Running the resultant binary fails with `/home/iojs/node-tmp/.tmp.2379/sea: error while loading shared libraries: libicui18n.so.71: cannot open shared object file: No such file or directory`.27735 ---27736 duration_ms: 87.4050027737 ...27738ok 5387 sea/test-single-executable-application-vfs-esm # skip Running the resultant binary fails with `/home/iojs/node-tmp/.tmp.2379/sea: error while loading shared libraries: libicui18n.so.71: cannot open shared object file: No such file or directory`.27739 ---27740 duration_ms: 87.5050027741 ...27742ok 5388 sea/test-single-executable-application-use-code-cache # skip Running the resultant binary fails with `/home/iojs/node-tmp/.tmp.2379/sea: error while loading shared libraries: libicui18n.so.71: cannot open shared object file: No such file or directory`.27743 ---27744 duration_ms: 108.1420027745 ...27746ok 5389 parallel/test-zlib-zip-experimental-warning27747 ---27748 duration_ms: 507.0650027749 ...27750ok 5390 parallel/test-zlib-brotli-16GB27751 ---27752 duration_ms: 806.7790027753 ...27754ok 5391 parallel/test-zlib-zip-security27755 ---27756 duration_ms: 508.2240027757 ...27758ok 5392 module-hooks/test-async-loader-hooks-called-with-expected-args27759 ---27760 duration_ms: 209.7510027761 ...27762ok 5393 module-hooks/test-async-loader-hooks-called-with-register27763 ---27764 duration_ms: 209.2710027765 ...27766ok 5394 module-hooks/test-async-loader-hooks-globalpreload-no-warning-with-initialize27767 ---27768 duration_ms: 209.4080027769 ...27770ok 5395 module-hooks/test-async-loader-hooks-globalpreload-warning27771 ---27772 duration_ms: 209.4670027773 ...27774ok 5396 module-hooks/test-async-loader-hooks-initialize-in-sequence27775 ---27776 duration_ms: 208.9880027777 ...27778ok 5397 parallel/test-zlib-zip-coverage27779 ---27780 duration_ms: 607.8110027781 ...27782ok 5398 module-hooks/test-async-loader-hooks-initialize-invoke27783 ---27784 duration_ms: 209.2020027785 ...27786ok 5399 module-hooks/test-async-loader-hooks-initialize-never-settling27787 ---27788 duration_ms: 210.0760027789 ...27790ok 5400 module-hooks/test-async-loader-hooks-initialize-process-exit27791 ---27792 duration_ms: 209.9120027793 ...27794ok 5401 module-hooks/test-async-loader-hooks-initialize-rejecting27795 ---27796 duration_ms: 209.2360027797 ...27798ok 5402 module-hooks/test-async-loader-hooks-initialize-throw-null27799 ---27800 duration_ms: 209.6260027801 ...27802ok 5403 module-hooks/test-async-loader-hooks-mixed-opt-in27803 ---27804 duration_ms: 208.8580027805 ...27806ok 5404 module-hooks/test-async-loader-hooks-never-settling-import-meta-resolve27807 ---27808 duration_ms: 209.2490027809 ...27810ok 5405 parallel/test-v8-take-coverage-noop27811 ---27812 duration_ms: 4288.5520027813 ...27814ok 5406 parallel/test-v8-take-coverage27815 ---27816 duration_ms: 4303.1300027817 ...27818ok 5407 sea/test-single-executable-blob-config27819 ---27820 duration_ms: 263.0060027821 ...27822ok 5408 module-hooks/test-async-loader-hooks-never-settling-load-esm-no-warning27823 ---27824 duration_ms: 210.9420027825 ...27826ok 5409 module-hooks/test-async-loader-hooks-never-settling-load-esm-with-warning27827 ---27828 duration_ms: 211.9590027829 ...27830ok 5410 module-hooks/test-async-loader-hooks-never-settling-load-cjs27831 ---27832 duration_ms: 214.0390027833 ...27834ok 5411 module-hooks/test-async-loader-hooks-never-settling-race-cjs27835 ---27836 duration_ms: 209.1590027837 ...27838ok 5412 module-hooks/test-async-loader-hooks-never-settling-resolve-cjs27839 ---27840 duration_ms: 209.5310027841 ...27842ok 5413 module-hooks/test-async-loader-hooks-never-settling-race-esm27843 ---27844 duration_ms: 211.5770027845 ...27846ok 5414 module-hooks/test-async-loader-hooks-never-settling-resolve-esm-no-warning27847 ---27848 duration_ms: 210.5720027849 ...27850ok 5415 module-hooks/test-async-loader-hooks-never-settling-resolve-esm-with-warning27851 ---27852 duration_ms: 167.4650027853 ...27854ok 5416 module-hooks/test-async-loader-hooks-process-exit-async27855 ---27856 duration_ms: 168.5140027857 ...27858ok 5417 module-hooks/test-async-loader-hooks-no-leak-internals27859 ---27860 duration_ms: 209.8410027861 ...27862ok 5418 module-hooks/test-async-loader-hooks-process-exit-sync27863 ---27864 duration_ms: 209.1820027865 ...27866ok 5419 module-hooks/test-async-loader-hooks-throw-empty-object27867 ---27868 duration_ms: 172.6430027869 ...27870ok 5420 module-hooks/test-async-loader-hooks-process-exit-top-level27871 ---27872 duration_ms: 209.5450027873 ...27874ok 5421 module-hooks/test-async-loader-hooks-throw-number27875 ---27876 duration_ms: 173.7890027877 ...27878ok 5422 module-hooks/test-async-loader-hooks-register-with-import27879 ---27880 duration_ms: 209.4840027881 ...27882ok 5423 module-hooks/test-async-loader-hooks-register-with-cjs27883 ---27884 duration_ms: 211.9610027885 ...27886ok 5424 module-hooks/test-async-loader-hooks-register-with-require27887 ---27888 duration_ms: 210.0370027889 ...27890ok 5425 module-hooks/test-async-loader-hooks-register-with-ports27891 ---27892 duration_ms: 212.4870027893 ...27894ok 5426 module-hooks/test-async-loader-hooks-register-with-url-parenturl27895 ---27896 duration_ms: 210.8030027897 ...27898ok 5427 module-hooks/test-async-loader-hooks-require-resolve-opt-in27899 ---27900 duration_ms: 211.5570027901 ...27902ok 5428 module-hooks/test-async-loader-hooks-source-maps-cjs27903 ---27904 duration_ms: 211.6270027905 ...27906ok 5429 module-hooks/test-async-loader-hooks-throw-bigint27907 ---27908 duration_ms: 212.9030027909 ...27910ok 5430 module-hooks/test-async-loader-hooks-throw-boolean27911 ---27912 duration_ms: 213.0890027913 ...27914ok 5431 module-hooks/test-async-loader-hooks-throw-error27915 ---27916 duration_ms: 211.9060027917 ...27918ok 5432 module-hooks/test-async-loader-hooks-throw-function27919 ---27920 duration_ms: 211.7010027921 ...27922ok 5433 module-hooks/test-async-loader-hooks-throw-object27923 ---27924 duration_ms: 210.6570027925 ...27926ok 5434 module-hooks/test-async-loader-hooks-throw-null27927 ---27928 duration_ms: 213.8260027929 ...27930ok 5435 module-hooks/test-async-loader-hooks-throw-string27931 ---27932 duration_ms: 213.7780027933 ...27934ok 5436 module-hooks/test-async-loader-hooks-throw-symbol27935 ---27936 duration_ms: 210.7120027937 ...27938ok 5437 module-hooks/test-async-loader-hooks-throw-undefined27939 ---27940 duration_ms: 211.9390027941 ...27942ok 5438 module-hooks/test-async-loader-hooks-require-resolve-default27943 ---27944 duration_ms: 263.0040027945 ...27946ok 5439 sea/test-single-executable-blob-config-errors27947 ---27948 duration_ms: 508.8590027949 ...27950ok 5440 module-hooks/test-async-loader-hooks-use-hooks-require-esm27951 ---27952 duration_ms: 212.6920027953 ...27954ok 5441 module-hooks/test-module-hooks-builtin-require27955 ---27956 duration_ms: 86.5350027957 ...27958ok 5442 module-hooks/test-async-loader-hooks-with-worker-permission-restricted27959 ---27960 duration_ms: 169.1390027961 ...27962ok 5443 module-hooks/test-module-hooks-create-require-with-url27963 ---27964 duration_ms: 86.5760027965 ...27966ok 5444 module-hooks/test-module-hooks-custom-conditions27967 ---27968 duration_ms: 86.9230027969 ...27970ok 5445 module-hooks/test-module-hooks-custom-conditions-cjs27971 ---27972 duration_ms: 86.7300027973 ...27974ok 5446 module-hooks/test-module-hooks-custom-conditions-special-values27975 ---27976 duration_ms: 86.6640027977 ...27978ok 5447 module-hooks/test-module-hooks-dispose27979 ---27980 duration_ms: 86.8060027981 ...27982ok 5448 module-hooks/test-async-loader-hooks-with-worker-permission-allowed27983 ---27984 duration_ms: 211.2410027985 ...27986ok 5449 module-hooks/test-module-hooks-load-buffers27987 ---27988 duration_ms: 86.8500027989 ...27990ok 5450 module-hooks/test-async-loader-hooks-without-worker-permission27991 ---27992 duration_ms: 169.3240027993 ...27994ok 5451 module-hooks/test-module-hooks-load-builtin-import27995 ---27996 duration_ms: 86.6910027997 ...27998ok 5452 module-hooks/test-module-hooks-load-builtin-override-commonjs27999 ---28000 duration_ms: 87.2450028001 ...28002ok 5453 module-hooks/test-module-hooks-load-builtin-override-json28003 ---28004 duration_ms: 86.5240028005 ...28006ok 5454 module-hooks/test-module-hooks-import-wasm28007 ---28008 duration_ms: 108.6910028009 ...28010ok 5455 module-hooks/test-module-hooks-load-builtin-override-module28011 ---28012 duration_ms: 87.0020028013 ...28014ok 5456 module-hooks/test-module-hooks-load-builtin-require28015 ---28016 duration_ms: 87.2330028017 ...28018ok 5457 module-hooks/test-module-hooks-load-chained28019 ---28020 duration_ms: 86.8150028021 ...28022ok 5458 module-hooks/test-module-hooks-load-context-merged28023 ---28024 duration_ms: 86.9330028025 ...28026ok 5459 module-hooks/test-async-loader-hooks-remove-beforeexit-listener28027 ---28028 duration_ms: 325.8410028029 ...28030ok 5460 module-hooks/test-module-hooks-load-context-optional28031 ---28032 duration_ms: 86.6540028033 ...28034ok 5461 module-hooks/test-module-hooks-load-context-merged-esm28035 ---28036 duration_ms: 108.4160028037 ...28038ok 5462 module-hooks/test-module-hooks-load-detection28039 ---28040 duration_ms: 87.3780028041 ...28042ok 5463 module-hooks/test-module-hooks-load-esm-mock28043 ---28044 duration_ms: 86.3660028045 ...28046ok 5464 module-hooks/test-module-hooks-load-import-cjs28047 ---28048 duration_ms: 86.8090028049 ...28050ok 5465 module-hooks/test-module-hooks-load-context-optional-esm28051 ---28052 duration_ms: 107.8600028053 ...28054ok 5466 module-hooks/test-module-hooks-load-short-circuit28055 ---28056 duration_ms: 87.6000028057 ...28058ok 5467 module-hooks/test-module-hooks-load-short-circuit-required-middle28059 ---28060 duration_ms: 87.5180028061 ...28062ok 5468 module-hooks/test-module-hooks-load-esm28063 ---28064 duration_ms: 107.9780028065 ...28066ok 5469 module-hooks/test-module-hooks-load-url-change-import28067 ---28068 duration_ms: 87.1450028069 ...28070ok 5470 module-hooks/test-module-hooks-load-import-cjs-custom-source28071 ---28072 duration_ms: 107.9010028073 ...28074ok 5471 module-hooks/test-module-hooks-load-invalid28075 ---28076 duration_ms: 108.0910028077 ...28078ok 5472 module-hooks/test-module-hooks-load-mock28079 ---28080 duration_ms: 108.2470028081 ...28082ok 5473 module-hooks/test-module-hooks-require-wasm28083 ---28084 duration_ms: 87.3050028085 ...28086ok 5474 module-hooks/test-module-hooks-load-short-circuit-required-start28087 ---28088 duration_ms: 108.6050028089 ...28090ok 5475 module-hooks/test-module-hooks-load-url-change-require28091 ---28092 duration_ms: 107.9160028093 ...28094ok 5476 module-hooks/test-module-hooks-resolve-builtin-on-disk-import28095 ---28096 duration_ms: 86.6740028097 ...28098ok 5477 module-hooks/test-module-hooks-resolve-context-merged28099 ---28100 duration_ms: 87.2200028101 ...28102ok 5478 module-hooks/test-module-hooks-resolve-context-merged-esm28103 ---28104 duration_ms: 87.5540028105 ...28106ok 5479 module-hooks/test-module-hooks-resolve-context-optional28107 ---28108 duration_ms: 87.1620028109 ...28110ok 5480 module-hooks/test-module-hooks-resolve-builtin-builtin-import28111 ---28112 duration_ms: 108.4970028113 ...28114ok 5481 module-hooks/test-module-hooks-resolve-builtin-builtin-require28115 ---28116 duration_ms: 108.5800028117 ...28118ok 5482 module-hooks/test-module-hooks-resolve-context-optional-esm28119 ---28120 duration_ms: 86.6800028121 ...28122ok 5483 module-hooks/test-module-hooks-resolve-builtin-on-disk-require28123 ---28124 duration_ms: 108.1330028125 ...28126ok 5484 module-hooks/test-module-hooks-resolve-builtin-on-disk-require-with-prefix28127 ---28128 duration_ms: 108.4740028129 ...28130ok 5485 module-hooks/test-module-hooks-resolve-load-builtin-override-both-prefix28131 ---28132 duration_ms: 86.4990028133 ...28134ok 5486 module-hooks/test-module-hooks-resolve-load-builtin-redirect28135 ---28136 duration_ms: 86.3760028137 ...28138ok 5487 module-hooks/test-module-hooks-resolve-invalid28139 ---28140 duration_ms: 107.7600028141 ...28142ok 5488 module-hooks/test-module-hooks-resolve-import-cjs28143 ---28144 duration_ms: 111.3550028145 ...28146ok 5489 module-hooks/test-module-hooks-resolve-load-builtin-override-both28147 ---28148 duration_ms: 108.3500028149 ...28150ok 5490 module-hooks/test-module-hooks-resolve-require-resolve-consistency28151 ---28152 duration_ms: 87.1280028153 ...28154ok 5491 module-hooks/test-module-hooks-resolve-load-builtin-redirect-prefix28155 ---28156 duration_ms: 108.5000028157 ...28158ok 5492 module-hooks/test-module-hooks-resolve-require-resolve-builtin28159 ---28160 duration_ms: 112.5960028161 ...28162ok 5493 module-hooks/test-module-hooks-resolve-require-resolve-create-require28163 ---28164 duration_ms: 107.9330028165 ...28166ok 5494 module-hooks/test-module-hooks-resolve-require-resolve-fallthrough28167 ---28168 duration_ms: 108.4300028169 ...28170ok 5495 module-hooks/test-module-hooks-resolve-require-resolve-imported-cjs28171 ---28172 duration_ms: 108.6210028173 ...28174ok 5496 module-hooks/test-module-hooks-resolve-short-circuit-required-start28175 ---28176 duration_ms: 87.7390028177 ...28178ok 5497 module-hooks/test-module-hooks-resolve-require-resolve-paths28179 ---28180 duration_ms: 109.8660028181 ...28182ok 5498 module-hooks/test-module-hooks-resolve-require-resolve-redirect28183 ---28184 duration_ms: 109.4750028185 ...28186ok 5499 module-hooks/test-module-hooks-resolve-short-circuit28187 ---28188 duration_ms: 108.2590028189 ...28190ok 5500 module-hooks/test-module-hooks-resolve-short-circuit-required-middle28191 ---28192 duration_ms: 108.0460028193 ...28194ok 5501 report/test-report-config28195 ---28196 duration_ms: 107.8910028197 ...28198ok 5502 module-hooks/test-module-hooks-resolve-require-resolve-loaded-with-source28199 ---28200 duration_ms: 134.9400028201 ...28202ok 5503 report/test-report-signal28203 ---28204 duration_ms: 110.0320028205 ...28206ok 5504 report/test-report-getreport28207 ---28208 duration_ms: 138.0300028209 ...28210ok 5505 report/test-report-uncaught-exception-handled28211 ---28212 duration_ms: 107.9370028213 ...28214ok 5506 report/test-report-uncaught-exception-override28215 ---28216 duration_ms: 108.9870028217 ...28218ok 5507 module-hooks/test-module-hooks-require-esm28219 ---28220 duration_ms: 326.2180028221 ...28222ok 5508 report/test-report-writereport-exclude-env28223 ---28224 duration_ms: 139.3170028225 ...28226ok 5509 module-hooks/test-module-hooks-resolve-load-import-inline-typescript28227 ---28228 duration_ms: 326.2650028229 ...28230ok 5510 module-hooks/test-module-hooks-resolve-load-require-inline-typescript-override28231 ---28232 duration_ms: 326.1820028233 ...28234ok 5511 report/test-report-worker28235 ---28236 duration_ms: 212.8200028237 ...28238ok 5512 report/test-report-uncaught-exception28239 ---28240 duration_ms: 261.7300028241 ...28242ok 5513 report/test-report-exclude-network28243 ---28244 duration_ms: 327.5390028245 ...28246ok 5514 report/test-report-uncaught-exception-compat28247 ---28248 duration_ms: 261.9070028249 ...28250ok 5515 report/test-report-uncaught-exception-primitives28251 ---28252 duration_ms: 261.0290028253 ...28254ok 5516 report/test-report-uncaught-exception-symbols28255 ---28256 duration_ms: 261.8780028257 ...28258ok 5517 module-hooks/test-module-hooks-resolve-load-import-inline-typescript-override28259 ---28260 duration_ms: 408.2400028261 ...28262ok 5518 report/test-report-fatalerror-oomerror-not-set28263 ---28264 duration_ms: 326.5550028265 ...28266ok 5519 module-hooks/test-module-hooks-resolve-load-require-inline-typescript28267 ---28268 duration_ms: 407.7380028269 ...28270ok 5520 report/test-report-uv-handles28271 ---28272 duration_ms: 266.1430028273 ...28274ok 5521 module-hooks/test-module-hooks-load-async-and-sync28275 ---28276 duration_ms: 609.6710028277 ...28278ok 5522 parallel/test-v8-collect-gc-profile28279 ---28280 duration_ms: 5223.1950028281 ...28282ok 5523 parallel/test-v8-collect-gc-profile-in-worker28283 ---28284 duration_ms: 5217.8640028285 ...28286ok 5524 report/test-report-fatalerror-oomerror-compact28287 ---28288 duration_ms: 408.4820028289 ...28290ok 5525 report/test-report-fatalerror-oomerror-directory28291 ---28292 duration_ms: 406.8780028293 ...28294ok 5526 report/test-report-fatalerror-oomerror-filename28295 ---28296 duration_ms: 409.8160028297 ...28298ok 5527 report/test-report-fatalerror-oomerror-set28299 ---28300 duration_ms: 408.3420028301 ...28302ok 5528 report/test-report-writereport28303 ---28304 duration_ms: 407.3980028305 ...28306ok 5529 pummel/test-array-hash-collision28307 ---28308 duration_ms: 325.0710028309 ...28310ok 5530 module-hooks/test-module-hooks-preload28311 ---28312 duration_ms: 1006.9840028313 ...28314ok 5531 parallel/test-zlib-zip-zip6428315 ---28316 duration_ms: 2310.0130028317 ...28318ok 5532 parallel/test-stream-iter-broadcast-from28319 ---28320 duration_ms: 10216.4900028321 ...28322ok 5533 pummel/test-blob-slice-with-large-size28323 ---28324 duration_ms: 1506.6570028325 ...28326ok 5534 pummel/test-buffer-large-size-buffer-alloc28327 ---28328 duration_ms: 1507.5320028329 ...28330ok 5535 pummel/test-buffer-large-size-buffer-alloc-unsafe28331 ---28332 duration_ms: 1407.0510028333 ...28334ok 5536 pummel/test-buffer-large-size-buffer-alloc-unsafe-slow28335 ---28336 duration_ms: 1507.1460028337 ...28338ok 5537 pummel/test-buffer-large-size-buffer-write28339 ---28340 duration_ms: 69.5020028341 ...28342ok 5538 pummel/test-buffer-large-size-copy28343 ---28344 duration_ms: 2507.5320028345 ...28346ok 5539 pummel/test-buffer-large-size-slowbuffer28347 ---28348 duration_ms: 1407.1490028349 ...28350ok 5540 pummel/test-child-process-spawn-loop28351 ---28352 duration_ms: 807.0660028353 ...28354ok 5541 pummel/test-crypto-argon2-nonblocking-constructor28355 ---28356 duration_ms: 1306.9920028357 ...28358ok 5542 pummel/test-crypto-dh-hash28359 ---28360 duration_ms: 134.2760028361 ...28362ok 5543 pummel/test-crypto-dh-keys28363 ---28364 duration_ms: 209.2430028365 ...28366ok 5544 parallel/test-runner-execution-ordered-bypass28367 ---28368 duration_ms: 30401.1110028369 ...28370ok 5545 pummel/test-crypto-pqc-sign-verify-slh-dsa28371 ---28372 duration_ms: 7110.7620028373 ...28374ok 5546 pummel/test-dh-regr28375 ---28376 duration_ms: 15815.5800028377 ...28378ok 5547 pummel/test-fs-largefile28379 ---28380 duration_ms: 69.5020028381 ...28382ok 5548 pummel/test-fs-read-file-sync-utf8-memory28383 ---28384 duration_ms: 606.7980028385 ...28386ok 5549 pummel/test-fs-readfile-tostring-fail28387 ---28388 duration_ms: 807.1530028389 ...28390ok 5550 pummel/test-heap-profile-and-snapshot-near-heap-limit28391 ---28392 duration_ms: 706.6140028393 ...28394ok 5551 pummel/test-heap-profile-near-heap-limit28395 ---28396 duration_ms: 606.7810028397 ...28398ok 5552 pummel/test-heapdump-dns28399 ---28400 duration_ms: 1207.2530028401 ...28402ok 5553 pummel/test-heapdump-env28403 ---28404 duration_ms: 506.8370028405 ...28406ok 5554 pummel/test-heapdump-fs-promise28407 ---28408 duration_ms: 907.4010028409 ...28410ok 5555 pummel/test-heapdump-http228411 ---28412 duration_ms: 1507.6790028413 ...28414ok 5556 pummel/test-heapdump-inspector28415 ---28416 duration_ms: 907.1730028417 ...28418ok 5557 pummel/test-heapdump-shadow-realm28419 ---28420 duration_ms: 2007.7920028421 ...28422ok 5558 pummel/test-heapdump-tls28423 ---28424 duration_ms: 1006.9240028425 ...28426ok 5559 pummel/test-heapdump-urlpattern28427 ---28428 duration_ms: 907.1490028429 ...28430ok 5560 pummel/test-heapdump-vm-script28431 ---28432 duration_ms: 506.5410028433 ...28434ok 5561 pummel/test-heapdump-worker28435 ---28436 duration_ms: 907.3150028437 ...28438ok 5562 pummel/test-heapdump-zlib28439 ---28440 duration_ms: 7812.7410028441 ...28442ok 5563 pummel/test-heapdump-zstd28443 ---28444 duration_ms: 1207.0740028445 ...28446ok 5564 pummel/test-heapsnapshot-near-heap-limit28447 ---28448 duration_ms: 1808.0060028449 ...28450ok 5565 pummel/test-heapsnapshot-near-heap-limit-big28451 ---28452 duration_ms: 2008.3110028453 ...28454ok 5566 pummel/test-heapsnapshot-near-heap-limit-bounded28455 ---28456 duration_ms: 1607.6050028457 ...28458ok 5567 pummel/test-heapsnapshot-near-heap-limit-by-api28459 ---28460 duration_ms: 2608.9760028461 ...28462ok 5568 pummel/test-http-many-keep-alive-connections28463 ---28464 duration_ms: 706.9060028465 ...28466ok 5569 pummel/test-http-upload-timeout28467 ---28468 duration_ms: 3313.1650028469 ...28470ok 5570 pummel/test-https-large-response28471 ---28472 duration_ms: 167.7410028473 ...28474ok 5571 pummel/test-https-no-reader28475 ---28476 duration_ms: 2311.9290028477 ...28478ok 5572 pummel/test-keep-alive # skip test requires `wrk` to be installed first28479 ---28480 duration_ms: 86.4790028481 ...28482ok 5573 pummel/test-net-many-clients28483 ---28484 duration_ms: 167.2020028485 ...28486ok 5574 pummel/test-net-pause28487 ---28488 duration_ms: 2309.0800028489 ...28490ok 5575 pummel/test-net-pingpong28491 ---28492 duration_ms: 209.5400028493 ...28494ok 5576 pummel/test-net-pingpong-delay28495 ---28496 duration_ms: 406.1450028497 ...28498ok 5577 pummel/test-net-timeout28499 ---28500 duration_ms: 3718.3620028501 ...28502ok 5578 pummel/test-net-timeout228503 ---28504 duration_ms: 5216.6090028505 ...28506ok 5579 pummel/test-net-write-callbacks28507 ---28508 duration_ms: 707.6860028509 ...28510ok 5580 pummel/test-next-tick-infinite-calls28511 ---28512 duration_ms: 3909.7440028513 ...28514ok 5581 pummel/test-process-cpuUsage28515 ---28516 duration_ms: 706.9280028517 ...28518ok 5582 pummel/test-process-hrtime28519 ---28520 duration_ms: 2207.6910028521 ...28522ok 5583 pummel/test-regress-GH-89228523 ---28524 duration_ms: 261.0190028525 ...28526ok 5584 pummel/test-repl-paste-big-data28527 ---28528 duration_ms: 506.8800028529 ...28530ok 5585 pummel/test-stream-pipe-multi28531 ---28532 duration_ms: 815.9770028533 ...28534ok 5586 pummel/test-string-decoder-large-buffer28535 ---28536 duration_ms: 69.3600028537 ...28538ok 5587 pummel/test-structuredclone-jstransferable28539 ---28540 duration_ms: 807.1190028541 ...28542ok 5588 pummel/test-timers28543 ---28544 duration_ms: 3216.6670028545 ...28546ok 5589 pummel/test-tls-server-large-request28547 ---28548 duration_ms: 209.3430028549 ...28550ok 5590 pummel/test-tls-throttle28551 ---28552 duration_ms: 167.5780028553 ...28554ok 5591 pummel/test-vm-memleak28555 ---28556 duration_ms: 5409.3370028557 ...28558ok 5592 pummel/test-vm-race28559 ---28560 duration_ms: 5209.9890028561 ...28562ok 5593 pummel/test-watch-file28563 ---28564 duration_ms: 5222.4450028565 ...28566ok 5594 pummel/test-webcrypto-derivebits-pbkdf228567 ---28568 duration_ms: 2708.3300028569 ...28570ok 5595 pummel/test-webcrypto-kangarootwelve-32bit-overflow # skip only relevant when kMaxLength < 2^3228571 ---28572 duration_ms: 69.6910028573 ...28574ok 5596 pummel/test-worker-take-heapsnapshot28575 ---28576 duration_ms: 406.5030028577 ...28578ok 5597 pummel/test-zlib-zip-slow28579 ---28580 duration_ms: 11121.2370028581 ...28582ok 5598 wpt/test-abort28583 ---28584 duration_ms: 2310.3090028585 ...28586ok 5599 wpt/test-atob28587 ---28588 duration_ms: 167.7980028589 ...28590ok 5600 wpt/test-blob28591 ---28592 duration_ms: 209.0410028593 ...28594ok 5601 wpt/test-broadcastchannel28595 ---28596 duration_ms: 167.3460028597 ...28598ok 5602 wpt/test-compression28599 ---28600 duration_ms: 710.7990028601 ...28602ok 5603 wpt/test-console28603 ---28604 duration_ms: 260.9540028605 ...28606ok 5604 wpt/test-encoding28607 ---28608 duration_ms: 509.8810028609 ...28610ok 5605 wpt/test-events28611 ---28612 duration_ms: 209.0950028613 ...28614ok 5606 wpt/test-file28615 ---28616 duration_ms: 134.1030028617 ...28618ok 5607 wpt/test-hr-time28619 ---28620 duration_ms: 2210.3750028621 ...28622ok 5608 wpt/test-microtask-queuing28623 ---28624 duration_ms: 167.3910028625 ...28626ok 5609 wpt/test-performance-timeline28627 ---28628 duration_ms: 2311.9070028629 ...28630ok 5610 wpt/test-resource-timing28631 ---28632 duration_ms: 261.0650028633 ...28634ok 5611 wpt/test-streams28635 ---28636 duration_ms: 2613.7410028637 ...28638ok 5612 wpt/test-structured-clone28639 ---28640 duration_ms: 167.6980028641 ...28642ok 5613 wpt/test-timers28643 ---28644 duration_ms: 807.1790028645 ...28646ok 5614 wpt/test-url # skip Different versions of Ada affect the WPT tests28647 ---28648 duration_ms: 69.4010028649 ...28650ok 5615 wpt/test-urlpattern28651 ---28652 duration_ms: 209.0870028653 ...28654ok 5616 wpt/test-wasm-jsapi28655 ---28656 duration_ms: 908.9700028657 ...28658ok 5617 wpt/test-wasm-webapi28659 ---28660 duration_ms: 208.9030028661 ...28662ok 5618 wpt/test-web-locks28663 ---28664 duration_ms: 1507.7090028665 ...28666ok 5619 wpt/test-webcrypto28667 ---28668 duration_ms: 4954.9780028669 ...28670ok 5620 wpt/test-webidl28671 ---28672 duration_ms: 327.0420028673 ...28674ok 5621 wpt/test-webstorage28675 ---28676 duration_ms: 1507.5860028677 ...28678ok 5622 wpt/test-workers28679 ---28680 duration_ms: 606.6830028681 ...28682ok 5623 wasm-allocation/test-wasm-allocation28683 ---28684 duration_ms: 90.6370028685 ...28686ok 5624 wasm-allocation/test-wasm-allocation-auto-adapt28687 ---28688 duration_ms: 73.4900028689 ...28690ok 5625 wasm-allocation/test-wasm-allocation-disable-trap-handler28691 ---28692 duration_ms: 73.2550028693 ...28694ok 5626 wasm-allocation/test-wasm-allocation-memory6428695 ---28696 duration_ms: 73.3940028697 ...28698ok 5627 known_issues/test-cli-print-var-crypto28699 ---28700 duration_ms: 134.3340028701 ...28702ok 5628 known_issues/test-cwd-enoent-file28703 ---28704 duration_ms: 134.4680028705 ...28706ok 5629 known_issues/test-dgram-bind-shared-ports-after-port-028707 ---28708 duration_ms: 208.7420028709 ...28710ok 5630 known_issues/test-fs-cp-async-buffer28711 ---28712 duration_ms: 69.3740028713 ...28714ok 5631 known_issues/test-fs-cp-filter28715 ---28716 duration_ms: 69.3100028717 ...28718ok 5632 known_issues/test-fs-cp-non-utf828719 ---28720 duration_ms: 69.3530028721 ...28722ok 5633 known_issues/test-fs-writeFileSync-invalid-windows28723 ---28724 duration_ms: 69.3250028725 ...28726ok 5634 known_issues/test-http-clientrequest-end-contentlength28727 ---28728 duration_ms: 86.5500028729 ...28730ok 5635 known_issues/test-http-clientrequest-end-empty-response-body28731 ---28732 duration_ms: 86.4570028733 ...28734ok 5636 known_issues/test-http-clientrequest-write-chunked28735 ---28736 duration_ms: 86.3200028737 ...28738ok 5637 known_issues/test-http-path-contains-unicode28739 ---28740 duration_ms: 69.3520028741 ...28742ok 5638 known_issues/test-inspector-cluster-port-clash28743 ---28744 duration_ms: 167.2340028745 ...28746ok 5639 known_issues/test-inspector-instrumentation-breakpoint28747 ---28748 duration_ms: 15343.6430028749 ...28750ok 5640 known_issues/test-repl-require-context28751 ---28752 duration_ms: 107.7370028753 ...28754ok 5641 known_issues/test-stdin-is-always-net.socket28755 ---28756 duration_ms: 167.2340028757 ...28758ok 5642 known_issues/test-stream-writable-sync-error28759 ---28760 duration_ms: 86.3690028761 ...28762ok 5643 known_issues/test-url-parse-conformance28763 ---28764 duration_ms: 107.6960028765 ...28766ok 5644 known_issues/test-vm-function-declaration-uses-define28767 ---28768 duration_ms: 69.1860028769 ...28770ok 5645 known_issues/test-vm-timeout-escape-nexttick28771 ---28772 duration_ms: 807.0340028773 ...28774ok 5646 abort/test-abort-backtrace28775 ---28776 duration_ms: 213.1280028777 ...28778ok 5647 abort/test-abort-fatal-error28779 ---28780 duration_ms: 264.5770028781 ...28782ok 5648 abort/test-abort-uncaught-exception28783 ---28784 duration_ms: 212.5890028785 ...28786ok 5649 abort/test-addon-register-signal-handler # skip binding not built yet28787 ---28788 duration_ms: 72.9520028789 ...28790ok 5650 abort/test-addon-uv-handle-leak # skip binding not built yet28791 ---28792 duration_ms: 72.3990028793 ...28794ok 5651 abort/test-http-parser-consume28795 ---28796 duration_ms: 212.6510028797 ...28798ok 5652 abort/test-process-abort-exitcode28799 ---28800 duration_ms: 212.6530028801 ...28802ok 5653 abort/test-signal-handler28803 ---28804 duration_ms: 212.3380028805 ...28806ok 5654 abort/test-worker-abort-uncaught-exception28807 ---28808 duration_ms: 264.5640028809 ...28810ok 5655 abort/test-zlib-invalid-internals-usage28811 ---28812 duration_ms: 212.8560028813 ...28814ok 5656 sequential/test-async-wrap-getasyncid28815 ---28816 duration_ms: 208.8040028817 ...28818ok 5657 sequential/test-buffer-creation-regression28819 ---28820 duration_ms: 69.4080028821 ...28822ok 5658 sequential/test-child-process-emfile28823 ---28824 duration_ms: 167.2500028825 ...28826ok 5659 sequential/test-child-process-execsync28827 ---28828 duration_ms: 606.9430028829 ...28830ok 5660 sequential/test-child-process-exit28831 ---28832 duration_ms: 406.1160028833 ...28834ok 5661 sequential/test-child-process-pass-fd28835 ---28836 duration_ms: 507.1240028837 ...28838ok 5662 sequential/test-cli-syntax-bad28839 ---28840 duration_ms: 506.5310028841 ...28842ok 5663 sequential/test-cli-syntax-file-not-found28843 ---28844 duration_ms: 134.4450028845 ...28846ok 5664 sequential/test-cli-syntax-good28847 ---28848 duration_ms: 167.3680028849 ...28850ok 5665 sequential/test-cli-syntax-require28851 ---28852 duration_ms: 260.5570028853 ...28854ok 5666 sequential/test-cluster-inspect-brk28855 ---28856 duration_ms: 134.0560028857 ...28858ok 5667 sequential/test-cluster-net-listen-ipv6only-none28859 ---28860 duration_ms: 167.5410028861 ...28862ok 5668 sequential/test-cluster-net-listen-ipv6only-rr28863 ---28864 duration_ms: 167.2660028865 ...28866ok 5669 sequential/test-cluster-port-reuse-between-workers28867 ---28868 duration_ms: 208.8490028869 ...28870ok 5670 sequential/test-cluster-send-handle-large-payload28871 ---28872 duration_ms: 167.3260028873 ...28874ok 5671 sequential/test-cpu-prof-default28875 ---28876 duration_ms: 906.7460028877 ...28878ok 5672 sequential/test-cpu-prof-dir-absolute28879 ---28880 duration_ms: 906.9580028881 ...28882ok 5673 sequential/test-cpu-prof-dir-and-name28883 ---28884 duration_ms: 906.7030028885 ...28886ok 5674 sequential/test-cpu-prof-dir-relative28887 ---28888 duration_ms: 906.9490028889 ...28890ok 5675 sequential/test-cpu-prof-drained28891 ---28892 duration_ms: 906.6610028893 ...28894ok 5676 sequential/test-cpu-prof-exit28895 ---28896 duration_ms: 208.8710028897 ...28898ok 5677 sequential/test-cpu-prof-invalid-options28899 ---28900 duration_ms: 167.1910028901 ...28902ok 5678 sequential/test-cpu-prof-kill28903 ---28904 duration_ms: 208.7570028905 ...28906ok 5679 sequential/test-cpu-prof-name28907 ---28908 duration_ms: 1606.9960028909 ...28910ok 5680 sequential/test-cpu-prof-worker-argv28911 ---28912 duration_ms: 906.6460028913 ...28914ok 5681 sequential/test-crypto-timing-safe-equal28915 ---28916 duration_ms: 69.3440028917 ...28918ok 5682 sequential/test-crypto-timing-safe-equal-fast28919 ---28920 duration_ms: 86.3090028921 ...28922ok 5683 sequential/test-debug-prompt28923 ---28924 duration_ms: 607.5290028925 ...28926ok 5684 sequential/test-debugger-custom-port28927 ---28928 duration_ms: 607.7770028929 ...28930ok 5685 sequential/test-debugger-debug-brk28931 ---28932 duration_ms: 134.4980028933 ...28934ok 5686 sequential/test-debugger-invalid-args28935 ---28936 duration_ms: 5321.3750028937 ...28938ok 5687 sequential/test-debugger-launch28939 ---28940 duration_ms: 708.4740028941 ...28942ok 5688 sequential/test-debugger-pid28943 ---28944 duration_ms: 406.3680028945 ...28946ok 5689 sequential/test-deprecation-flags28947 ---28948 duration_ms: 134.3930028949 ...28950ok 5690 sequential/test-dgram-bind-shared-ports28951 ---28952 duration_ms: 260.8480028953 ...28954ok 5691 sequential/test-dgram-implicit-bind-failure28955 ---28956 duration_ms: 69.5970028957 ...28958ok 5692 sequential/test-dgram-pingpong28959 ---28960 duration_ms: 86.3480028961 ...28962ok 5693 sequential/test-diagnostic-dir-cpu-prof28963 ---28964 duration_ms: 1606.5710028965 ...28966ok 5694 sequential/test-diagnostic-dir-heap-prof28967 ---28968 duration_ms: 1207.4030028969 ...28970ok 5695 sequential/test-dtls-interop-openssl-client # skip DTLS is not enabled28971 ---28972 duration_ms: 86.3060028973 ...28974ok 5696 sequential/test-dtls-interop-openssl-server # skip DTLS is not enabled28975 ---28976 duration_ms: 55.5600028977 ...28978ok 5697 sequential/test-error-serdes28979 ---28980 duration_ms: 69.2790028981 ...28982ok 5698 sequential/test-fs-opendir-recursive28983 ---28984 duration_ms: 134.0590028985 ...28986ok 5699 sequential/test-fs-readdir-recursive28987 ---28988 duration_ms: 86.3700028989 ...28990ok 5700 sequential/test-fs-stat-sync-overflow28991 ---28992 duration_ms: 167.1910028993 ...28994ok 5701 sequential/test-gc-http-client28995 ---28996 duration_ms: 506.6040028997 ...28998ok 5702 sequential/test-gc-http-client-onerror28999 ---29000 duration_ms: 506.5890029001 ...29002ok 5703 sequential/test-gc-http-client-timeout29003 ---29004 duration_ms: 406.5680029005 ...29006ok 5704 sequential/test-get-heapsnapshot-options29007 ---29008 duration_ms: 1007.1050029009 ...29010ok 5705 sequential/test-heapdump29011 ---29012 duration_ms: 506.5430029013 ...29014ok 5706 sequential/test-heapdump-flag29015 ---29016 duration_ms: 406.3860029017 ...29018ok 5707 sequential/test-heapdump-flag-custom-dir29019 ---29020 duration_ms: 406.4650029021 ...29022ok 5708 sequential/test-http-econnrefused29023 ---29024 duration_ms: 86.6250029025 ...29026ok 5709 sequential/test-http-keep-alive-large-write29027 ---29028 duration_ms: 86.2420029029 ...29030ok 5710 sequential/test-http-keepalive-maxsockets29031 ---29032 duration_ms: 407.3950029033 ...29034ok 5711 sequential/test-http-regr-gh-292829035 ---29036 duration_ms: 86.4060029037 ...29038ok 5712 sequential/test-http-server-keep-alive-timeout-slow-client-headers29039 ---29040 duration_ms: 1911.8920029041 ...29042ok 5713 sequential/test-http-server-keep-alive-timeout-slow-server29043 ---29044 duration_ms: 708.1210029045 ...29046ok 5714 sequential/test-http2-max-session-memory29047 ---29048 duration_ms: 107.7100029049 ...29050ok 5715 sequential/test-http2-ping-flood29051 ---29052 duration_ms: 107.6380029053 ...29054ok 5716 sequential/test-http2-settings-flood29055 ---29056 duration_ms: 107.6920029057 ...29058ok 5717 sequential/test-http2-timeout-large-write29059 ---29060 duration_ms: 2815.5270029061 ...29062ok 5718 sequential/test-http2-timeout-large-write-file29063 ---29064 duration_ms: 2811.9020029065 ...29066ok 5719 sequential/test-https-connect-localport29067 ---29068 duration_ms: 6226.7250029069 ...29070ok 5720 sequential/test-https-server-keep-alive-timeout29071 ---29072 duration_ms: 1812.6690029073 ...29074ok 5721 sequential/test-init29075 ---29076 duration_ms: 167.4720029077 ...29078ok 5722 sequential/test-inspector-network-resource29079 ---29080 duration_ms: 1509.2590029081 ...29082ok 5723 sequential/test-inspector-open-dispose29083 ---29084 duration_ms: 167.5140029085 ...29086ok 5724 sequential/test-inspector-port-cluster29087 ---29088 duration_ms: 406.7070029089 ...29090ok 5725 sequential/test-module-loading29091 ---29092 duration_ms: 86.5050029093 ...29094ok 5726 sequential/test-net-GH-550429095 ---29096 duration_ms: 260.3410029097 ...29098ok 5727 sequential/test-net-better-error-messages-port29099 ---29100 duration_ms: 86.4080029101 ...29102ok 5728 sequential/test-net-connect-econnrefused29103 ---29104 duration_ms: 133.9650029105 ...29106ok 5729 sequential/test-net-connect-handle-econnrefused29107 ---29108 duration_ms: 69.1350029109 ...29110ok 5730 sequential/test-net-connect-local-error29111 ---29112 duration_ms: 69.0410029113 ...29114ok 5731 sequential/test-net-listen-ipv6only29115 ---29116 duration_ms: 86.0220029117 ...29118ok 5732 sequential/test-net-listen-shared-ports29119 ---29120 duration_ms: 260.6650029121 ...29122ok 5733 sequential/test-net-localport29123 ---29124 duration_ms: 69.5800029125 ...29126ok 5734 sequential/test-net-reconnect-error29127 ---29128 duration_ms: 86.2220029129 ...29130ok 5735 sequential/test-net-response-size29131 ---29132 duration_ms: 1306.8780029133 ...29134ok 5736 sequential/test-net-server-address29135 ---29136 duration_ms: 86.3920029137 ...29138ok 5737 sequential/test-net-server-bind29139 ---29140 duration_ms: 209.3510029141 ...29142ok 5738 sequential/test-net-server-listen-ipv6-link-local29143 ---29144 duration_ms: 86.6680029145 ...29146ok 5739 sequential/test-next-tick-error-spin29147 ---29148 duration_ms: 134.0700029149 ...29150ok 5740 sequential/test-perf-hooks29151 ---29152 duration_ms: 1209.6970029153 ...29154ok 5741 sequential/test-performance-eventloopdelay29155 ---29156 duration_ms: 7219.1300029157 ...29158ok 5742 sequential/test-pipe29159 ---29160 duration_ms: 4317.2820029161 ...29162ok 5743 sequential/test-process-title29163 ---29164 duration_ms: 134.6180029165 ...29166ok 5744 sequential/test-process-warnings29167 ---29168 duration_ms: 134.2960029169 ...29170ok 5745 sequential/test-repl-timeout-throw29171 ---29172 duration_ms: 260.7840029173 ...29174ok 5746 sequential/test-require-cache-without-stat29175 ---29176 duration_ms: 86.5660029177 ...29178ok 5747 sequential/test-resolution-inspect-brk29179 ---29180 duration_ms: 134.1750029181 ...29182ok 5748 sequential/test-stream2-fs29183 ---29184 duration_ms: 86.6880029185 ...29186ok 5749 sequential/test-stream2-stderr-sync29187 ---29188 duration_ms: 167.3300029189 ...29190ok 5750 sequential/test-timers-block-eventloop29191 ---29192 duration_ms: 134.2720029193 ...29194ok 5751 sequential/test-timers-set-interval-excludes-callback-duration29195 ---29196 duration_ms: 508.5130029197 ...29198ok 5752 sequential/test-tls-connect29199 ---29200 duration_ms: 86.7430029201 ...29202ok 5753 sequential/test-tls-lookup29203 ---29204 duration_ms: 86.4060029205 ...29206ok 5754 sequential/test-tls-psk-client # skip missing openssl cli29207 ---29208 duration_ms: 86.3740029209 ...29210ok 5755 sequential/test-tls-session-timeout # skip node compiled without OpenSSL CLI.29211 ---29212 duration_ms: 86.3110029213 ...29214ok 5756 sequential/test-util-debug29215 ---29216 duration_ms: 325.3830029217 ...29218ok 5757 sequential/test-vm-break-on-sigint29219 ---29220 duration_ms: 167.6040029221 ...29222ok 5758 sequential/test-vm-timeout-escape-promise-module-229223 ---29224 duration_ms: 86.3640029225 ...29226ok 5759 sequential/test-vm-timeout-rethrow29227 ---29228 duration_ms: 167.4370029229 ...29230ok 5760 sequential/test-watch-mode-restart-esm-loading-error29231 ---29232 duration_ms: 2312.9060029233 ...29234ok 5761 sequential/test-watch-mode-watch-flags29235 ---29236 duration_ms: 325.6400029237 ...29238ok 5762 sequential/test-watch-mode-worker29239 ---29240 duration_ms: 2209.1540029241 ...29242ok 5763 sequential/test-without-async-context-frame29243 ---29244 duration_ms: 1207.2090029245 ...29246ok 5764 sequential/test-worker-eventlooputil29247 ---29248 duration_ms: 261.5880029249 ...29250ok 5765 sequential/test-worker-fshandles-error-on-termination29251 ---29252 duration_ms: 261.0870029253 ...29254ok 5766 sequential/test-worker-fshandles-open-close-on-termination29255 ---29256 duration_ms: 260.9920029257 ...29258ok 5767 sequential/test-worker-heapsnapshot-options29259 ---29260 duration_ms: 606.5750029261 ...29262ok 5768 sequential/test-worker-prof29263 ---29264 duration_ms: 1907.6460029265 ...29266ok 5769 sequential/test-write-heapsnapshot-options29267 ---29268 duration_ms: 1007.0550029269 ...29270ok 5770 sequential/test-zlib-crc32-fast-api29271 ---29272 duration_ms: 107.6890029273 ...2927429275Failed tests:29276out/Release/node /build/node-v26.9.0/test/parallel/test-fs-cp-async-file-modes.mjs29277make: *** [Makefile:631: test-ci-js] Error 1