nixbot

builds
1structuredAttrs is enabled
unpackPhase
2unpacking source archive /nix/store/7ajvk1c4mspigbdgf21bn9d7f7p9kmgk-node-v26.9.0.tar.xz3source root is node-v26.9.04setting SOURCE_DATE_EPOCH to timestamp 1789550914 of file "node-v26.9.0/tools/nix/v8.nix"
patchPhase
5applying patch /nix/store/j4p9lc7z8hi4g40cpqpj3qxb9a7bvanp-configure-armv6-vfpv2.patch6patching file configure.py7Hunk #1 succeeded at 49 with fuzz 1 (offset -1 lines).8applying patch /nix/store/igz0qnjkvwi4f2mn7i13h3ndxl9n5ryi-node-npm-build-npm-package-logic.patch9patching file deps/npm/node_modules/@npmcli/run-script/lib/set-path.js10Hunk #1 succeeded at 13 with fuzz 2 (offset 1 line).11Hunk #2 succeeded at 37 (offset 8 lines).12patching file deps/npm/node_modules/pacote/lib/git.js13Hunk #1 succeeded at 186 (offset -2 lines).14patching file deps/npm/node_modules/@npmcli/arborist/lib/arborist/build-ideal-tree.js15Hunk #1 succeeded at 802 (offset 62 lines).16patching file deps/npm/node_modules/@npmcli/arborist/lib/arborist/load-actual.js17Hunk #1 succeeded at 121 with fuzz 1 (offset -26 lines).18applying patch /nix/store/57n0csr7hpdd0y91ljxpiwlfw7fsx3kl-use-correct-env-in-tests.patch19patching file test/parallel/test-child-process-default-options.js20patching file test/parallel/test-child-process-env.js21patching file test/parallel/test-child-process-exec-env.js22applying patch /nix/store/p2mhv95s89kaqmdynhz6y6asalf8y4dh-bin-sh-node-run-v22.patch23patching file test/fixtures/run-script/node_modules/.bin/positional-args24Hunk #1 succeeded at 1 with fuzz 1.25applying patch /nix/store/3za8p3x3hjfr1a9b1lc3z4aapp9sm2ja-use-nix-codesign.patch26patching file test/parallel/test-macos-app-sandbox.js27applying patch /nix/store/6whc7i794ygkcwjwrprw7y9aglfl238g-fix-temporal-integration-with-shared-icu.patch28patching file deps/v8/src/objects/js-temporal-zoneinfo64.cc29patching file tools/v8_gypfiles/v8.gyp30Hunk #1 succeeded at 1398 (offset 19 lines).31Hunk #2 succeeded at 2051 (offset 93 lines).
updateAutotoolsGnuConfigScriptsPhase
32Updating Autotools / GNU config script to a newer upstream version: ./deps/libffi/config.sub33Updating Autotools / GNU config script to a newer upstream version: ./deps/cares/config/config.sub34Updating Autotools / GNU config script to a newer upstream version: ./deps/ngtcp2/ngtcp2/third-party/libev/config.sub35Updating Autotools / GNU config script to a newer upstream version: ./deps/libffi/config.guess36Updating Autotools / GNU config script to a newer upstream version: ./deps/cares/config/config.guess37Updating Autotools / GNU config script to a newer upstream version: ./deps/ngtcp2/ngtcp2/third-party/libev/config.guess
configurePhase
38fixing libtool script ./deps/libffi/ltmain.sh39fixing libtool script ./deps/cares/config/ltmain.sh40fixing libtool script ./deps/ngtcp2/ngtcp2/third-party/libev/ltmain.sh41./deps/libffi/configure42./deps/cares/configure43./deps/ngtcp2/ngtcp2/third-party/libev/configure44configure flags: --prefix=/nix/store/mn8r5sjblqmigxv5lg89q4wcj5zqb16n-nodejs-slim-26.9.0 --ninja --with-intl=system-icu --openssl-use-def-ca-store --no-cross-compiling --dest-os=linux --dest-cpu=x64 --v8-enable-temporal-support --use-prefix-to-find-headers --shared-abseil --shared-abseil-libpath=/nix/store/iqvb7h1ykhm12304qwx17xbncrhhy1g4-abseil-cpp-20260107.1/lib --shared-ada --shared-ada-libpath=/nix/store/vk3yq4nzlrdvq1qxgy3764qaycanr0mc-ada-4.0.0/lib --shared-brotli --shared-brotli-libpath=/nix/store/xhgd6rb4h8ssid9yw8nvw74cwq69md5y-brotli-1.2.0-lib/lib --shared-cares --shared-cares-libpath=/nix/store/68syfccdbv3hlz7imlc9xl9fzyz4v8gx-c-ares-1.34.8/lib --shared-ffi --shared-ffi-libpath=/nix/store/3r5wfb1dl3sfknvy1yringvmap0hxj4r-libffi-3.8.0/lib --shared-gtest --shared-gtest-libpath=/nix/store/5sdsmm8s00hck28yp95fk993rg42mqsp-gtest-1.18.0/lib --shared-hdr-histogram --shared-hdr-histogram-libpath=/nix/store/9g532g9jf92xy9xh68p99ml815q11zs0-hdrhistogram_c-0.11.10/lib --shared-highway --shared-highway-libpath=/nix/store/xs1jbkdzxs4ym0rh89nx8xfwj387x3aj-libhwy-1.4.0/lib --shared-http-parser --shared-http-parser-libpath=/nix/store/1lw7d9jsv7qb6nvc4fmvvqsyphaacqcs-llhttp-9.4.3/lib --shared-libuv --shared-libuv-libpath=/nix/store/68b1blnvl4scgdq48d4p7h4lw4pm5w0w-libuv-1.52.1/lib --shared-lief --shared-lief-libpath=/nix/store/nx4g3j20wvgq36b406q6rysvqzzrxaci-lief-0.17.6/lib --shared-merve --shared-merve-libpath=/nix/store/2gj58j8rd88kaan7bsqhl9fjxxp11qqi-merve-1.2.2/lib --shared-nbytes --shared-nbytes-libpath=/nix/store/zf8c839ahp1fn736lih7ai2y14rrx2gn-nbytes-0.1.4/lib --shared-nghttp2 --shared-nghttp2-libpath=/nix/store/6avzrsm02jh7q48ym3hgznj3ypc2shc2-nghttp2-1.70.0-lib/lib --shared-nghttp3 --shared-nghttp3-libpath=/nix/store/dki4fkk75v2x4aqkszmi257wxq6rkkyr-nghttp3-1.16.0/lib --shared-ngtcp2 --shared-ngtcp2-libpath=/nix/store/2hc131frgdz45bjbajmpvlrj185lah7p-ngtcp2-1.23.0/lib --shared-openssl --shared-openssl-libpath=/nix/store/yj34vymbqf7mf4lmffipy8jqc4kwr1mc-openssl-3.6.4/lib --shared-simdjson --shared-simdjson-libpath=/nix/store/129shchmqszagbb0m8kk7ddzb7nnklxv-simdjson-4.6.8/lib --shared-simdutf --shared-simdutf-libpath=/nix/store/dw6xlar7m4qfrhbk63zhcc5pmixa1ga1-simdutf-9.1.0/lib --shared-sqlite --shared-sqlite-libpath=/nix/store/7a0nx1a0rdc5s07vxrsdhplqnzncl5z9-sqlite-3.53.3/lib --shared-temporal_capi --shared-temporal_capi-libpath=/nix/store/7hrx4vyx67h46xxwqj3zw4nafa1m8d04-temporal_capi-0.2.6/lib --shared-uvwasi --shared-uvwasi-libpath=/nix/store/qnbgx63w8yya5330xcxyixja3ah6gfzm-uvwasi-0.0.23/lib --shared-zlib --shared-zlib-libpath=/nix/store/lw86vj9kfwgvlivg3p8qg2nibpmhmsl9-zlib-1.3.2/lib --shared-zstd --shared-zstd-libpath=/nix/store/8ik1d1r4l2jzm9mjh6bc0a13yczx62wg-zstd-1.5.7/lib45INFO: configure completed successfully
buildPhase
46build flags: -j32 SHELL=/nix/store/svx59425zxp552p2b8gm11qj5r09b56i-bash-5.3p15/bin/bash47TERM=dumb ninja -C out/Release -j3248ninja: Entering directory `out/Release'49[1/1871] CXX obj/deps/v8/src/base/v8_libbase.abort-mode.o50[2/1871] CXX obj/deps/v8/src/base/v8_libbase.fpu.o51[3/1871] CXX obj/deps/v8/src/base/v8_libbase.once.o52[4/1871] CXX obj/deps/v8/src/base/v8_libbase.bits.o53[5/1871] CXX obj/deps/v8/src/base/v8_libbase.division-by-constant.o54[6/1871] CXX obj/deps/v8/src/base/v8_libbase.cpu.o55[7/1871] CXX obj/deps/v8/src/base/debug/v8_libbase.stack_trace.o56[8/1871] CXX obj/deps/v8/src/base/numbers/v8_libbase.cached-powers.o57[9/1871] CXX obj/deps/v8/src/base/platform/v8_libbase.semaphore.o58[10/1871] CXX obj/deps/v8/src/base/platform/v8_libbase.platform.o59[11/1871] CXX obj/deps/v8/src/base/v8_libbase.file-utils.o60[12/1871] CXX obj/deps/v8/src/base/v8_libbase.page-allocator.o61[13/1871] CXX obj/deps/v8/src/base/numbers/v8_libbase.dtoa.o62[14/1871] CXX obj/deps/v8/src/base/v8_libbase.sys-info.o63[15/1871] CXX obj/deps/v8/src/base/platform/v8_libbase.memory-protection-key.o64[16/1871] CXX obj/deps/v8/src/base/numbers/v8_libbase.bignum-dtoa.o65[17/1871] CXX obj/deps/v8/src/base/v8_libbase.strings.o66[18/1871] CXX obj/deps/v8/src/base/v8_libbase.region-allocator.o67[19/1871] CXX obj/deps/v8/src/base/sanitizer/v8_libbase.lsan-virtual-address-space.o68[20/1871] CXX obj/deps/v8/src/base/numbers/v8_libbase.diy-fp.o69[21/1871] CXX obj/deps/v8/src/base/numbers/v8_libbase.strtod.o70[22/1871] CXX obj/deps/v8/src/base/numbers/v8_libbase.fixed-dtoa.o71[23/1871] CXX obj/deps/v8/src/base/numbers/v8_libbase.bignum.o72[24/1871] CXX obj/deps/v8/src/base/numbers/v8_libbase.fast-dtoa.o73[25/1871] CXX obj/deps/v8/src/base/sanitizer/v8_libbase.lsan-page-allocator.o74[26/1871] CXX obj/deps/v8/src/base/v8_libbase.ieee754.o75[27/1871] CXX obj/deps/v8/src/base/v8_libbase.vlq-base64.o76[28/1871] CXX obj/deps/v8/src/base/platform/v8_libbase.condition-variable.o77[29/1871] CXX obj/deps/v8/src/base/platform/v8_libbase.mutex.o78[30/1871] CXX obj/deps/v8/src/base/platform/v8_libbase.time.o79[31/1871] CXX obj/deps/v8/src/base/v8_libbase.logging.o80[32/1871] CXX obj/deps/v8/src/base/v8_libbase.emulated-virtual-address-subspace.o81[33/1871] CXX obj/deps/v8/src/base/platform/v8_libbase.platform-posix-time.o82[34/1871] CXX obj/deps/v8/src/base/v8_libbase.bounded-page-allocator.o83[35/1871] CXX obj/deps/v8/src/base/debug/v8_libbase.stack_trace_posix.o84[36/1871] CXX obj/deps/v8/src/base/platform/v8_libbase.platform-linux.o85[37/1871] CXX obj/deps/v8/src/base/utils/v8_libbase.random-number-generator.o86[38/1871] CXX obj/deps/v8/src/base/v8_libbase.virtual-address-space-page-allocator.o87[39/1871] ACTION Checking inspector protocol compatibility88[40/1871] CXX obj/deps/v8/src/base/platform/v8_libbase.platform-posix.o89[41/1871] CXX obj/deps/v8/src/base/v8_libbase.virtual-address-space.o90[42/1871] AR obj/tools/v8_gypfiles/libv8_libbase.a91[43/1871] STAMP obj/tools/v8_gypfiles/v8_flags.actions_depends.stamp92[44/1871] ACTION Generating temporal zoneinfo static data93[45/1871] CC obj/deps/v8/third_party/zlib/v8_zlib.adler32.o94cc1: warning: command-line option '-fvisibility-inlines-hidden' is valid for C++/ObjC++ but not for C95[46/1871] CXX obj/deps/v8/src/torque/torque_base.cpp-builder.o96[47/1871] CC obj/deps/v8/third_party/zlib/v8_zlib.compress.o97cc1: warning: command-line option '-fvisibility-inlines-hidden' is valid for C++/ObjC++ but not for C98[48/1871] CXX obj/deps/v8/src/torque/torque_base.source-positions.o99[49/1871] CC obj/deps/v8/third_party/zlib/v8_zlib.cpu_features.o100cc1: warning: command-line option '-fvisibility-inlines-hidden' is valid for C++/ObjC++ but not for C101[50/1871] ACTION Generating inspector protocol sources from protocol json102[51/1871] STAMP obj/tools/v8_gypfiles/v8_inspector_headers.actions_rules_copies.stamp103[52/1871] CC obj/deps/v8/third_party/zlib/v8_zlib.gzclose.o104cc1: warning: command-line option '-fvisibility-inlines-hidden' is valid for C++/ObjC++ but not for C105[53/1871] CC obj/deps/v8/third_party/zlib/v8_zlib.gzlib.o106cc1: warning: command-line option '-fvisibility-inlines-hidden' is valid for C++/ObjC++ but not for C107[54/1871] CC obj/deps/v8/third_party/zlib/v8_zlib.crc32.o108cc1: warning: command-line option '-fvisibility-inlines-hidden' is valid for C++/ObjC++ but not for C109[55/1871] CXX obj/deps/v8/src/interpreter/bytecode_builtins_list_generator.bytecode-operands.o110[56/1871] CC obj/deps/v8/third_party/zlib/v8_zlib.gzread.o111cc1: warning: command-line option '-fvisibility-inlines-hidden' is valid for C++/ObjC++ but not for C112[57/1871] CC obj/deps/v8/third_party/zlib/v8_zlib.gzwrite.o113cc1: warning: command-line option '-fvisibility-inlines-hidden' is valid for C++/ObjC++ but not for C114[58/1871] CXX obj/deps/v8/src/builtins/bytecode_builtins_list_generator.generate-bytecodes-builtins-list.o115[59/1871] CC obj/deps/v8/third_party/zlib/v8_zlib.deflate.o116cc1: warning: command-line option '-fvisibility-inlines-hidden' is valid for C++/ObjC++ but not for C117[60/1871] CC obj/deps/v8/third_party/zlib/v8_zlib.infback.o118cc1: warning: command-line option '-fvisibility-inlines-hidden' is valid for C++/ObjC++ but not for C119[61/1871] CXX obj/deps/v8/src/interpreter/bytecode_builtins_list_generator.bytecodes.o120[62/1871] CC obj/deps/v8/third_party/zlib/v8_zlib.uncompr.o121cc1: warning: command-line option '-fvisibility-inlines-hidden' is valid for C++/ObjC++ but not for C122[63/1871] CC obj/deps/v8/third_party/zlib/v8_zlib.inftrees.o123cc1: warning: command-line option '-fvisibility-inlines-hidden' is valid for C++/ObjC++ but not for C124[64/1871] CC obj/deps/v8/third_party/zlib/v8_zlib.inffast.o125cc1: warning: command-line option '-fvisibility-inlines-hidden' is valid for C++/ObjC++ but not for C126[65/1871] CC obj/deps/v8/third_party/zlib/v8_zlib.zutil.o127cc1: warning: command-line option '-fvisibility-inlines-hidden' is valid for C++/ObjC++ but not for C128[66/1871] CXX obj/deps/v8/third_party/zlib/google/v8_zlib.compression_utils_portable.o129[67/1871] CXX obj/deps/v8/src/regexp/gen-regexp-special-case.gen-regexp-special-case.o130[68/1871] CXX obj/deps/v8/src/torque/torque_base.declarable.o131[69/1871] CXX obj/deps/v8/src/torque/torque_base.global-context.o132[70/1871] CC obj/deps/v8/third_party/zlib/v8_zlib.trees.o133cc1: warning: command-line option '-fvisibility-inlines-hidden' is valid for C++/ObjC++ but not for C134[71/1871] CXX obj/deps/v8/src/torque/torque_base.type-inference.o135[72/1871] CXX obj/deps/v8/src/torque/torque_base.earley-parser.o136[73/1871] CXX obj/deps/v8/src/torque/torque_base.torque-code-generator.o137[74/1871] CC obj/deps/v8/third_party/zlib/v8_zlib.inflate.o138cc1: warning: command-line option '-fvisibility-inlines-hidden' is valid for C++/ObjC++ but not for C139[75/1871] LINK bytecode_builtins_list_generator140[76/1871] ACTION generate_bytecode_builtins_list: generate_bytecode_builtins_list_action_73a03d1964edbe79fc19deb968fa21d5c456544c3d095b62158c8959ed2aeed1141[77/1871] CXX obj/deps/v8/src/torque/torque_base.type-oracle.o142[78/1871] LINK gen-regexp-special-case143[79/1871] ACTION run_gen-regexp-special-case: run_gen-regexp-special-case_action_72d03329d19e24c609ee6e65eeeb110034e9261c37b8a8d83522628d574e9fa7144[80/1871] CXX obj/deps/v8/src/torque/torque_base.server-data.o145[81/1871] CXX obj/deps/v8/src/libplatform/v8_libplatform.default-thread-isolated-allocator.o146[82/1871] CXX obj/deps/v8/src/torque/torque_base.utils.o147[83/1871] AR obj/tools/v8_gypfiles/libv8_zlib.a148[84/1871] CXX obj/deps/v8/src/torque/torque_base.kythe-data.o149[85/1871] CXX obj/deps/v8/src/torque/torque_base.cfg.o150[86/1871] CXX obj/deps/v8/src/libplatform/tracing/v8_libplatform.trace-config.o151[87/1871] CXX obj/src/node_js2c.embedded_data.o152[88/1871] CXX obj/deps/v8/src/libplatform/tracing/v8_libplatform.trace-object.o153[89/1871] CXX obj/deps/v8/src/libplatform/tracing/v8_libplatform.trace-writer.o154[90/1871] CXX obj/deps/v8/src/torque/torque_base.instance-type-generator.o155[91/1871] CXX obj/src/node_js2c.builtin_info.o156[92/1871] CXX obj/deps/v8/src/torque/torque_base.class-debug-reader-generator.o157[93/1871] CXX obj/deps/v8/src/libplatform/v8_libplatform.default-job.o158[94/1871] CXX obj/deps/v8/src/libplatform/v8_libplatform.delayed-task-queue.o159[95/1871] CXX obj/deps/v8/src/libplatform/v8_libplatform.task-queue.o160[96/1871] CXX obj/deps/inspector_protocol/crdtp/crdtp.error_support.o161[97/1871] CC obj/test/nop/nop.nop.o162[98/1871] CXX obj/deps/v8/src/libplatform/v8_libplatform.worker-thread.o163[99/1871] CXX obj/deps/v8/src/libplatform/tracing/v8_libplatform.trace-buffer.o164[100/1871] CC obj/test/overlapped-checker/overlapped-checker.main_unix.o165[101/1871] CXX obj/deps/v8/src/libplatform/v8_libplatform.default-worker-threads-task-runner.o166[102/1871] CXX obj/deps/ncrypto/ncrypto_engine.engine.o167[103/1871] AR obj/deps/ncrypto/libncrypto_engine.a168[104/1871] CXX obj/deps/inspector_protocol/crdtp/crdtp.json_platform.o169[105/1871] CXX obj/deps/inspector_protocol/crdtp/crdtp.span.o170[106/1871] CXX obj/deps/v8/src/torque/torque.torque.o171[107/1871] LINK overlapped-checker172[108/1871] LINK nop173[109/1871] CXX obj/deps/v8/src/libplatform/v8_libplatform.default-foreground-task-runner.o174[110/1871] CXX obj/deps/v8/src/torque/torque_base.cc-generator.o175[111/1871] CXX obj/deps/v8/src/libplatform/v8_libplatform.default-platform.o176[112/1871] CXX obj/deps/inspector_protocol/crdtp/crdtp.status.o177[113/1871] CXX obj/deps/inspector_protocol/crdtp/crdtp.serializable.o178[114/1871] CXX obj/deps/v8/src/libplatform/tracing/v8_libplatform.tracing-controller.o179[115/1871] AR obj/tools/v8_gypfiles/libv8_libplatform.a180[116/1871] CXX obj/deps/v8/src/torque/torque_base.declarations.o181[117/1871] CXX obj/deps/inspector_protocol/crdtp/crdtp.cbor.o182[118/1871] CXX obj/deps/v8/src/torque/torque_base.instructions.o183[119/1871] CXX obj/deps/inspector_protocol/crdtp/crdtp.protocol_core.o184[120/1871] CXX obj/deps/v8/src/torque/torque_base.csa-generator.o185[121/1871] CXX obj/deps/v8/src/torque/torque_base.torque-compiler.o186[122/1871] CXX obj/deps/v8/src/torque/torque_base.declaration-visitor.o187[123/1871] CXX obj/deps/inspector_protocol/crdtp/crdtp.dispatch.o188[124/1871] CXX obj/deps/v8/src/torque/torque_base.type-visitor.o189[125/1871] CXX obj/tools/node_js2c.js2c.o190[126/1871] LINK node_js2c191[127/1871] STAMP obj/node_base.actions_depends.stamp192[128/1871] ACTION node_base: convert_node_protocol_to_json_f26a10641803f604d1307d23f68bde8b450ad8f073bd43313642df31e7a3478c193[129/1871] ACTION node_base: node_js2c_f26a10641803f604d1307d23f68bde8b450ad8f073bd43313642df31e7a3478c194[130/1871] ACTION node_base: concatenate_protocols_f26a10641803f604d1307d23f68bde8b450ad8f073bd43313642df31e7a3478c195[131/1871] ACTION node_base: v8_inspector_compress_protocol_json_f26a10641803f604d1307d23f68bde8b450ad8f073bd43313642df31e7a3478c196[132/1871] CXX obj/deps/inspector_protocol/crdtp/crdtp.json.o197[133/1871] AR obj/deps/inspector_protocol/libcrdtp.a198[134/1871] ACTION Generating node protocol sources from protocol json199[135/1871] STAMP obj/node_base.actions_rules_copies.stamp200[136/1871] CXX obj/src/node_base.builtin_info.o201[137/1871] CXX obj/deps/v8/src/torque/torque_base.types.o202[138/1871] CXX obj/src/api/node_base.utils.o203[139/1871] CXX obj/deps/ncrypto/ncrypto.ncrypto.o204[140/1871] CXX obj/src/node_base.embedded_data.o205[141/1871] CXX obj/gen/src/node/inspector/protocol/node_base.IO.o206In file included from ../../src/util.h:29,207 from ../../src/inspector/node_string.h:10,208 from gen/src/node/inspector/protocol/Forward.h:19,209 from gen/src/node/inspector/protocol/Protocol.h:18,210 from gen/src/node/inspector/protocol/IO.h:10,211 from gen/src/node/inspector/protocol/IO.cpp:7:212../../deps/v8/include/v8-profiler.h: In constructor 'v8::HeapProfiler::HeapSnapshotOptions::HeapSnapshotOptions()':213../../deps/v8/include/v8-profiler.h:1128:27: warning: 'v8::HeapProfiler::HeapSnapshotOptions::global_object_name_resolver' is deprecated: Use context_name_resolver callback instead. [-Wdeprecated-declarations]214 1128 | HeapSnapshotOptions() {}215 | ^216../../deps/v8/include/v8-profiler.h:1142:25: note: declared here217 1142 | ObjectNameResolver* global_object_name_resolver = nullptr;218 | ^~~~~~~~~~~~~~~~~~~~~~~~~~~219../../deps/v8/include/v8-profiler.h:1128:27: warning: 'v8::HeapProfiler::HeapSnapshotOptions::global_object_name_resolver' is deprecated: Use context_name_resolver callback instead. [-Wdeprecated-declarations]220 1128 | HeapSnapshotOptions() {}221 | ^222../../deps/v8/include/v8-profiler.h:1142:25: note: declared here223 1142 | ObjectNameResolver* global_object_name_resolver = nullptr;224 | ^~~~~~~~~~~~~~~~~~~~~~~~~~~225[142/1871] CXX obj/gen/src/node/inspector/protocol/node_base.Storage.o226In file included from ../../src/util.h:29,227 from ../../src/inspector/node_string.h:10,228 from gen/src/node/inspector/protocol/Forward.h:19,229 from gen/src/node/inspector/protocol/Protocol.h:18,230 from gen/src/node/inspector/protocol/Storage.h:10,231 from gen/src/node/inspector/protocol/Storage.cpp:7:232../../deps/v8/include/v8-profiler.h: In constructor 'v8::HeapProfiler::HeapSnapshotOptions::HeapSnapshotOptions()':233../../deps/v8/include/v8-profiler.h:1128:27: warning: 'v8::HeapProfiler::HeapSnapshotOptions::global_object_name_resolver' is deprecated: Use context_name_resolver callback instead. [-Wdeprecated-declarations]234 1128 | HeapSnapshotOptions() {}235 | ^236../../deps/v8/include/v8-profiler.h:1142:25: note: declared here237 1142 | ObjectNameResolver* global_object_name_resolver = nullptr;238 | ^~~~~~~~~~~~~~~~~~~~~~~~~~~239../../deps/v8/include/v8-profiler.h:1128:27: warning: 'v8::HeapProfiler::HeapSnapshotOptions::global_object_name_resolver' is deprecated: Use context_name_resolver callback instead. [-Wdeprecated-declarations]240 1128 | HeapSnapshotOptions() {}241 | ^242../../deps/v8/include/v8-profiler.h:1142:25: note: declared here243 1142 | ObjectNameResolver* global_object_name_resolver = nullptr;244 | ^~~~~~~~~~~~~~~~~~~~~~~~~~~245[143/1871] CXX obj/src/node_base.cleanup_queue.o246In file included from ../../src/memory_tracker.h:6,247 from ../../src/cleanup_queue.h:11,248 from ../../src/cleanup_queue.cc:1:249../../deps/v8/include/v8-profiler.h: In constructor 'v8::HeapProfiler::HeapSnapshotOptions::HeapSnapshotOptions()':250../../deps/v8/include/v8-profiler.h:1128:27: warning: 'v8::HeapProfiler::HeapSnapshotOptions::global_object_name_resolver' is deprecated: Use context_name_resolver callback instead. [-Wdeprecated-declarations]251 1128 | HeapSnapshotOptions() {}252 | ^253../../deps/v8/include/v8-profiler.h:1142:25: note: declared here254 1142 | ObjectNameResolver* global_object_name_resolver = nullptr;255 | ^~~~~~~~~~~~~~~~~~~~~~~~~~~256../../deps/v8/include/v8-profiler.h:1128:27: warning: 'v8::HeapProfiler::HeapSnapshotOptions::global_object_name_resolver' is deprecated: Use context_name_resolver callback instead. [-Wdeprecated-declarations]257 1128 | HeapSnapshotOptions() {}258 | ^259../../deps/v8/include/v8-profiler.h:1142:25: note: declared here260 1142 | ObjectNameResolver* global_object_name_resolver = nullptr;261 | ^~~~~~~~~~~~~~~~~~~~~~~~~~~262[144/1871] CXX obj/gen/src/node/inspector/protocol/node_base.NodeRuntime.o263In file included from ../../src/util.h:29,264 from ../../src/inspector/node_string.h:10,265 from gen/src/node/inspector/protocol/Forward.h:19,266 from gen/src/node/inspector/protocol/Protocol.h:18,267 from gen/src/node/inspector/protocol/NodeRuntime.h:10,268 from gen/src/node/inspector/protocol/NodeRuntime.cpp:7:269../../deps/v8/include/v8-profiler.h: In constructor 'v8::HeapProfiler::HeapSnapshotOptions::HeapSnapshotOptions()':270../../deps/v8/include/v8-profiler.h:1128:27: warning: 'v8::HeapProfiler::HeapSnapshotOptions::global_object_name_resolver' is deprecated: Use context_name_resolver callback instead. [-Wdeprecated-declarations]271 1128 | HeapSnapshotOptions() {}272 | ^273../../deps/v8/include/v8-profiler.h:1142:25: note: declared here274 1142 | ObjectNameResolver* global_object_name_resolver = nullptr;275 | ^~~~~~~~~~~~~~~~~~~~~~~~~~~276../../deps/v8/include/v8-profiler.h:1128:27: warning: 'v8::HeapProfiler::HeapSnapshotOptions::global_object_name_resolver' is deprecated: Use context_name_resolver callback instead. [-Wdeprecated-declarations]277 1128 | HeapSnapshotOptions() {}278 | ^279../../deps/v8/include/v8-profiler.h:1142:25: note: declared here280 1142 | ObjectNameResolver* global_object_name_resolver = nullptr;281 | ^~~~~~~~~~~~~~~~~~~~~~~~~~~282[145/1871] CXX obj/gen/src/node/inspector/protocol/node_base.NodeWorker.o283In file included from ../../src/util.h:29,284 from ../../src/inspector/node_string.h:10,285 from gen/src/node/inspector/protocol/Forward.h:19,286 from gen/src/node/inspector/protocol/Protocol.h:18,287 from gen/src/node/inspector/protocol/NodeWorker.h:10,288 from gen/src/node/inspector/protocol/NodeWorker.cpp:7:289../../deps/v8/include/v8-profiler.h: In constructor 'v8::HeapProfiler::HeapSnapshotOptions::HeapSnapshotOptions()':290../../deps/v8/include/v8-profiler.h:1128:27: warning: 'v8::HeapProfiler::HeapSnapshotOptions::global_object_name_resolver' is deprecated: Use context_name_resolver callback instead. [-Wdeprecated-declarations]291 1128 | HeapSnapshotOptions() {}292 | ^293../../deps/v8/include/v8-profiler.h:1142:25: note: declared here294 1142 | ObjectNameResolver* global_object_name_resolver = nullptr;295 | ^~~~~~~~~~~~~~~~~~~~~~~~~~~296../../deps/v8/include/v8-profiler.h:1128:27: warning: 'v8::HeapProfiler::HeapSnapshotOptions::global_object_name_resolver' is deprecated: Use context_name_resolver callback instead. [-Wdeprecated-declarations]297 1128 | HeapSnapshotOptions() {}298 | ^299../../deps/v8/include/v8-profiler.h:1142:25: note: declared here300 1142 | ObjectNameResolver* global_object_name_resolver = nullptr;301 | ^~~~~~~~~~~~~~~~~~~~~~~~~~~302[146/1871] CXX obj/gen/src/node/inspector/protocol/node_base.Target.o303In file included from ../../src/util.h:29,304 from ../../src/inspector/node_string.h:10,305 from gen/src/node/inspector/protocol/Forward.h:19,306 from gen/src/node/inspector/protocol/Protocol.h:18,307 from gen/src/node/inspector/protocol/Target.h:10,308 from gen/src/node/inspector/protocol/Target.cpp:7:309../../deps/v8/include/v8-profiler.h: In constructor 'v8::HeapProfiler::HeapSnapshotOptions::HeapSnapshotOptions()':310../../deps/v8/include/v8-profiler.h:1128:27: warning: 'v8::HeapProfiler::HeapSnapshotOptions::global_object_name_resolver' is deprecated: Use context_name_resolver callback instead. [-Wdeprecated-declarations]311 1128 | HeapSnapshotOptions() {}312 | ^313../../deps/v8/include/v8-profiler.h:1142:25: note: declared here314 1142 | ObjectNameResolver* global_object_name_resolver = nullptr;315 | ^~~~~~~~~~~~~~~~~~~~~~~~~~~316../../deps/v8/include/v8-profiler.h:1128:27: warning: 'v8::HeapProfiler::HeapSnapshotOptions::global_object_name_resolver' is deprecated: Use context_name_resolver callback instead. [-Wdeprecated-declarations]317 1128 | HeapSnapshotOptions() {}318 | ^319../../deps/v8/include/v8-profiler.h:1142:25: note: declared here320 1142 | ObjectNameResolver* global_object_name_resolver = nullptr;321 | ^~~~~~~~~~~~~~~~~~~~~~~~~~~322[147/1871] CXX obj/gen/src/node/inspector/protocol/node_base.NodeTracing.o323In file included from ../../src/util.h:29,324 from ../../src/inspector/node_string.h:10,325 from gen/src/node/inspector/protocol/Forward.h:19,326 from gen/src/node/inspector/protocol/Protocol.h:18,327 from gen/src/node/inspector/protocol/NodeTracing.h:10,328 from gen/src/node/inspector/protocol/NodeTracing.cpp:7:329../../deps/v8/include/v8-profiler.h: In constructor 'v8::HeapProfiler::HeapSnapshotOptions::HeapSnapshotOptions()':330../../deps/v8/include/v8-profiler.h:1128:27: warning: 'v8::HeapProfiler::HeapSnapshotOptions::global_object_name_resolver' is deprecated: Use context_name_resolver callback instead. [-Wdeprecated-declarations]331 1128 | HeapSnapshotOptions() {}332 | ^333../../deps/v8/include/v8-profiler.h:1142:25: note: declared here334 1142 | ObjectNameResolver* global_object_name_resolver = nullptr;335 | ^~~~~~~~~~~~~~~~~~~~~~~~~~~336../../deps/v8/include/v8-profiler.h:1128:27: warning: 'v8::HeapProfiler::HeapSnapshotOptions::global_object_name_resolver' is deprecated: Use context_name_resolver callback instead. [-Wdeprecated-declarations]337 1128 | HeapSnapshotOptions() {}338 | ^339../../deps/v8/include/v8-profiler.h:1142:25: note: declared here340 1142 | ObjectNameResolver* global_object_name_resolver = nullptr;341 | ^~~~~~~~~~~~~~~~~~~~~~~~~~~342[148/1871] CXX obj/gen/src/node/inspector/protocol/node_base.Network.o343In file included from ../../src/util.h:29,344 from ../../src/inspector/node_string.h:10,345 from gen/src/node/inspector/protocol/Forward.h:19,346 from gen/src/node/inspector/protocol/Protocol.h:18,347 from gen/src/node/inspector/protocol/Network.h:10,348 from gen/src/node/inspector/protocol/Network.cpp:7:349../../deps/v8/include/v8-profiler.h: In constructor 'v8::HeapProfiler::HeapSnapshotOptions::HeapSnapshotOptions()':350../../deps/v8/include/v8-profiler.h:1128:27: warning: 'v8::HeapProfiler::HeapSnapshotOptions::global_object_name_resolver' is deprecated: Use context_name_resolver callback instead. [-Wdeprecated-declarations]351 1128 | HeapSnapshotOptions() {}352 | ^353../../deps/v8/include/v8-profiler.h:1142:25: note: declared here354 1142 | ObjectNameResolver* global_object_name_resolver = nullptr;355 | ^~~~~~~~~~~~~~~~~~~~~~~~~~~356../../deps/v8/include/v8-profiler.h:1128:27: warning: 'v8::HeapProfiler::HeapSnapshotOptions::global_object_name_resolver' is deprecated: Use context_name_resolver callback instead. [-Wdeprecated-declarations]357 1128 | HeapSnapshotOptions() {}358 | ^359../../deps/v8/include/v8-profiler.h:1142:25: note: declared here360 1142 | ObjectNameResolver* global_object_name_resolver = nullptr;361 | ^~~~~~~~~~~~~~~~~~~~~~~~~~~362[149/1871] CXX obj/gen/src/node/inspector/protocol/node_base.DOMStorage.o363In file included from ../../src/util.h:29,364 from ../../src/inspector/node_string.h:10,365 from gen/src/node/inspector/protocol/Forward.h:19,366 from gen/src/node/inspector/protocol/Protocol.h:18,367 from gen/src/node/inspector/protocol/DOMStorage.h:10,368 from gen/src/node/inspector/protocol/DOMStorage.cpp:7:369../../deps/v8/include/v8-profiler.h: In constructor 'v8::HeapProfiler::HeapSnapshotOptions::HeapSnapshotOptions()':370../../deps/v8/include/v8-profiler.h:1128:27: warning: 'v8::HeapProfiler::HeapSnapshotOptions::global_object_name_resolver' is deprecated: Use context_name_resolver callback instead. [-Wdeprecated-declarations]371 1128 | HeapSnapshotOptions() {}372 | ^373../../deps/v8/include/v8-profiler.h:1142:25: note: declared here374 1142 | ObjectNameResolver* global_object_name_resolver = nullptr;375 | ^~~~~~~~~~~~~~~~~~~~~~~~~~~376../../deps/v8/include/v8-profiler.h:1128:27: warning: 'v8::HeapProfiler::HeapSnapshotOptions::global_object_name_resolver' is deprecated: Use context_name_resolver callback instead. [-Wdeprecated-declarations]377 1128 | HeapSnapshotOptions() {}378 | ^379../../deps/v8/include/v8-profiler.h:1142:25: note: declared here380 1142 | ObjectNameResolver* global_object_name_resolver = nullptr;381 | ^~~~~~~~~~~~~~~~~~~~~~~~~~~382[150/1871] CXX obj/gen/src/node/inspector/protocol/node_base.Protocol.o383In file included from ../../src/util.h:29,384 from ../../src/inspector/node_string.h:10,385 from gen/src/node/inspector/protocol/Forward.h:19,386 from gen/src/node/inspector/protocol/Protocol.h:18,387 from gen/src/node/inspector/protocol/Protocol.cpp:7:388../../deps/v8/include/v8-profiler.h: In constructor 'v8::HeapProfiler::HeapSnapshotOptions::HeapSnapshotOptions()':389../../deps/v8/include/v8-profiler.h:1128:27: warning: 'v8::HeapProfiler::HeapSnapshotOptions::global_object_name_resolver' is deprecated: Use context_name_resolver callback instead. [-Wdeprecated-declarations]390 1128 | HeapSnapshotOptions() {}391 | ^392../../deps/v8/include/v8-profiler.h:1142:25: note: declared here393 1142 | ObjectNameResolver* global_object_name_resolver = nullptr;394 | ^~~~~~~~~~~~~~~~~~~~~~~~~~~395../../deps/v8/include/v8-profiler.h:1128:27: warning: 'v8::HeapProfiler::HeapSnapshotOptions::global_object_name_resolver' is deprecated: Use context_name_resolver callback instead. [-Wdeprecated-declarations]396 1128 | HeapSnapshotOptions() {}397 | ^398../../deps/v8/include/v8-profiler.h:1142:25: note: declared here399 1142 | ObjectNameResolver* global_object_name_resolver = nullptr;400 | ^~~~~~~~~~~~~~~~~~~~~~~~~~~401[151/1871] CXX obj/src/node_base.internal_only_v8.o402In file included from ../../src/util.h:29,403 from ../../src/util-inl.h:33,404 from ../../src/internal_only_v8.cc:3:405../../deps/v8/include/v8-profiler.h: In constructor 'v8::HeapProfiler::HeapSnapshotOptions::HeapSnapshotOptions()':406../../deps/v8/include/v8-profiler.h:1128:27: warning: 'v8::HeapProfiler::HeapSnapshotOptions::global_object_name_resolver' is deprecated: Use context_name_resolver callback instead. [-Wdeprecated-declarations]407 1128 | HeapSnapshotOptions() {}408 | ^409../../deps/v8/include/v8-profiler.h:1142:25: note: declared here410 1142 | ObjectNameResolver* global_object_name_resolver = nullptr;411 | ^~~~~~~~~~~~~~~~~~~~~~~~~~~412../../deps/v8/include/v8-profiler.h:1128:27: warning: 'v8::HeapProfiler::HeapSnapshotOptions::global_object_name_resolver' is deprecated: Use context_name_resolver callback instead. [-Wdeprecated-declarations]413 1128 | HeapSnapshotOptions() {}414 | ^415../../deps/v8/include/v8-profiler.h:1142:25: note: declared here416 1142 | ObjectNameResolver* global_object_name_resolver = nullptr;417 | ^~~~~~~~~~~~~~~~~~~~~~~~~~~418[152/1871] CXX obj/src/node_base.json_utils.o419[153/1871] CXX obj/src/api/node_base.encoding.o420In file included from ../../src/memory_tracker.h:6,421 from ../../src/aliased_buffer.h:7,422 from ../../src/aliased_buffer-inl.h:6,423 from ../../src/env-inl.h:27,424 from ../../src/string_bytes.h:30,425 from ../../src/api/encoding.cc:2:426../../deps/v8/include/v8-profiler.h: In constructor 'v8::HeapProfiler::HeapSnapshotOptions::HeapSnapshotOptions()':427../../deps/v8/include/v8-profiler.h:1128:27: warning: 'v8::HeapProfiler::HeapSnapshotOptions::global_object_name_resolver' is deprecated: Use context_name_resolver callback instead. [-Wdeprecated-declarations]428 1128 | HeapSnapshotOptions() {}429 | ^430../../deps/v8/include/v8-profiler.h:1142:25: note: declared here431 1142 | ObjectNameResolver* global_object_name_resolver = nullptr;432 | ^~~~~~~~~~~~~~~~~~~~~~~~~~~433../../deps/v8/include/v8-profiler.h:1128:27: warning: 'v8::HeapProfiler::HeapSnapshotOptions::global_object_name_resolver' is deprecated: Use context_name_resolver callback instead. [-Wdeprecated-declarations]434 1128 | HeapSnapshotOptions() {}435 | ^436../../deps/v8/include/v8-profiler.h:1142:25: note: declared here437 1142 | ObjectNameResolver* global_object_name_resolver = nullptr;438 | ^~~~~~~~~~~~~~~~~~~~~~~~~~~439[154/1871] CXX obj/src/node_base.connection_wrap.o440In file included from ../../src/memory_tracker.h:6,441 from ../../src/aliased_buffer.h:7,442 from ../../src/env.h:27,443 from ../../src/stream_base.h:6,444 from ../../src/stream_wrap.h:27,445 from ../../src/connection_wrap.h:6,446 from ../../src/connection_wrap.cc:1:447../../deps/v8/include/v8-profiler.h: In constructor 'v8::HeapProfiler::HeapSnapshotOptions::HeapSnapshotOptions()':448../../deps/v8/include/v8-profiler.h:1128:27: warning: 'v8::HeapProfiler::HeapSnapshotOptions::global_object_name_resolver' is deprecated: Use context_name_resolver callback instead. [-Wdeprecated-declarations]449 1128 | HeapSnapshotOptions() {}450 | ^451../../deps/v8/include/v8-profiler.h:1142:25: note: declared here452 1142 | ObjectNameResolver* global_object_name_resolver = nullptr;453 | ^~~~~~~~~~~~~~~~~~~~~~~~~~~454../../deps/v8/include/v8-profiler.h:1128:27: warning: 'v8::HeapProfiler::HeapSnapshotOptions::global_object_name_resolver' is deprecated: Use context_name_resolver callback instead. [-Wdeprecated-declarations]455 1128 | HeapSnapshotOptions() {}456 | ^457../../deps/v8/include/v8-profiler.h:1142:25: note: declared here458 1142 | ObjectNameResolver* global_object_name_resolver = nullptr;459 | ^~~~~~~~~~~~~~~~~~~~~~~~~~~460[155/1871] CXX obj/src/api/node_base.hooks.o461In file included from ../../src/memory_tracker.h:6,462 from ../../src/aliased_buffer.h:7,463 from ../../src/aliased_buffer-inl.h:6,464 from ../../src/env-inl.h:27,465 from ../../src/api/hooks.cc:1:466../../deps/v8/include/v8-profiler.h: In constructor 'v8::HeapProfiler::HeapSnapshotOptions::HeapSnapshotOptions()':467../../deps/v8/include/v8-profiler.h:1128:27: warning: 'v8::HeapProfiler::HeapSnapshotOptions::global_object_name_resolver' is deprecated: Use context_name_resolver callback instead. [-Wdeprecated-declarations]468 1128 | HeapSnapshotOptions() {}469 | ^470../../deps/v8/include/v8-profiler.h:1142:25: note: declared here471 1142 | ObjectNameResolver* global_object_name_resolver = nullptr;472 | ^~~~~~~~~~~~~~~~~~~~~~~~~~~473../../deps/v8/include/v8-profiler.h:1128:27: warning: 'v8::HeapProfiler::HeapSnapshotOptions::global_object_name_resolver' is deprecated: Use context_name_resolver callback instead. [-Wdeprecated-declarations]474 1128 | HeapSnapshotOptions() {}475 | ^476../../deps/v8/include/v8-profiler.h:1142:25: note: declared here477 1142 | ObjectNameResolver* global_object_name_resolver = nullptr;478 | ^~~~~~~~~~~~~~~~~~~~~~~~~~~479[156/1871] CXX obj/src/node_base.base_object.o480In file included from ../../src/memory_tracker.h:6,481 from ../../src/base_object.h:29,482 from ../../src/base_object.cc:1:483../../deps/v8/include/v8-profiler.h: In constructor 'v8::HeapProfiler::HeapSnapshotOptions::HeapSnapshotOptions()':484../../deps/v8/include/v8-profiler.h:1128:27: warning: 'v8::HeapProfiler::HeapSnapshotOptions::global_object_name_resolver' is deprecated: Use context_name_resolver callback instead. [-Wdeprecated-declarations]485 1128 | HeapSnapshotOptions() {}486 | ^487../../deps/v8/include/v8-profiler.h:1142:25: note: declared here488 1142 | ObjectNameResolver* global_object_name_resolver = nullptr;489 | ^~~~~~~~~~~~~~~~~~~~~~~~~~~490../../deps/v8/include/v8-profiler.h:1128:27: warning: 'v8::HeapProfiler::HeapSnapshotOptions::global_object_name_resolver' is deprecated: Use context_name_resolver callback instead. [-Wdeprecated-declarations]491 1128 | HeapSnapshotOptions() {}492 | ^493../../deps/v8/include/v8-profiler.h:1142:25: note: declared here494 1142 | ObjectNameResolver* global_object_name_resolver = nullptr;495 | ^~~~~~~~~~~~~~~~~~~~~~~~~~~496[157/1871] CXX obj/src/api/node_base.async_resource.o497In file included from ../../src/memory_tracker.h:6,498 from ../../src/base_object.h:29,499 from ../../src/async_context_frame.h:6,500 from ../../src/api/async_resource.cc:1:501../../deps/v8/include/v8-profiler.h: In constructor 'v8::HeapProfiler::HeapSnapshotOptions::HeapSnapshotOptions()':502../../deps/v8/include/v8-profiler.h:1128:27: warning: 'v8::HeapProfiler::HeapSnapshotOptions::global_object_name_resolver' is deprecated: Use context_name_resolver callback instead. [-Wdeprecated-declarations]503 1128 | HeapSnapshotOptions() {}504 | ^505../../deps/v8/include/v8-profiler.h:1142:25: note: declared here506 1142 | ObjectNameResolver* global_object_name_resolver = nullptr;507 | ^~~~~~~~~~~~~~~~~~~~~~~~~~~508../../deps/v8/include/v8-profiler.h:1128:27: warning: 'v8::HeapProfiler::HeapSnapshotOptions::global_object_name_resolver' is deprecated: Use context_name_resolver callback instead. [-Wdeprecated-declarations]509 1128 | HeapSnapshotOptions() {}510 | ^511../../deps/v8/include/v8-profiler.h:1142:25: note: declared here512 1142 | ObjectNameResolver* global_object_name_resolver = nullptr;513 | ^~~~~~~~~~~~~~~~~~~~~~~~~~~514[158/1871] CXX obj/src/node_base.connect_wrap.o515In file included from ../../src/memory_tracker.h:6,516 from ../../src/base_object.h:29,517 from ../../src/async_wrap.h:27,518 from ../../src/req_wrap.h:6,519 from ../../src/req_wrap-inl.h:6,520 from ../../src/connect_wrap.h:6,521 from ../../src/connect_wrap.cc:1:522../../deps/v8/include/v8-profiler.h: In constructor 'v8::HeapProfiler::HeapSnapshotOptions::HeapSnapshotOptions()':523../../deps/v8/include/v8-profiler.h:1128:27: warning: 'v8::HeapProfiler::HeapSnapshotOptions::global_object_name_resolver' is deprecated: Use context_name_resolver callback instead. [-Wdeprecated-declarations]524 1128 | HeapSnapshotOptions() {}525 | ^526../../deps/v8/include/v8-profiler.h:1142:25: note: declared here527 1142 | ObjectNameResolver* global_object_name_resolver = nullptr;528 | ^~~~~~~~~~~~~~~~~~~~~~~~~~~529../../deps/v8/include/v8-profiler.h:1128:27: warning: 'v8::HeapProfiler::HeapSnapshotOptions::global_object_name_resolver' is deprecated: Use context_name_resolver callback instead. [-Wdeprecated-declarations]530 1128 | HeapSnapshotOptions() {}531 | ^532../../deps/v8/include/v8-profiler.h:1142:25: note: declared here533 1142 | ObjectNameResolver* global_object_name_resolver = nullptr;534 | ^~~~~~~~~~~~~~~~~~~~~~~~~~~535[159/1871] CXX obj/src/api/node_base.embed_helpers.o536In file included from ../../src/memory_tracker.h:6,537 from ../../src/base_object.h:29,538 from ../../src/async_wrap.h:27,539 from ../../src/debug_utils.h:6,540 from ../../src/debug_utils-inl.h:6,541 from ../../src/api/embed_helpers.cc:1:542../../deps/v8/include/v8-profiler.h: In constructor 'v8::HeapProfiler::HeapSnapshotOptions::HeapSnapshotOptions()':543../../deps/v8/include/v8-profiler.h:1128:27: warning: 'v8::HeapProfiler::HeapSnapshotOptions::global_object_name_resolver' is deprecated: Use context_name_resolver callback instead. [-Wdeprecated-declarations]544 1128 | HeapSnapshotOptions() {}545 | ^546../../deps/v8/include/v8-profiler.h:1142:25: note: declared here547 1142 | ObjectNameResolver* global_object_name_resolver = nullptr;548 | ^~~~~~~~~~~~~~~~~~~~~~~~~~~549../../deps/v8/include/v8-profiler.h:1128:27: warning: 'v8::HeapProfiler::HeapSnapshotOptions::global_object_name_resolver' is deprecated: Use context_name_resolver callback instead. [-Wdeprecated-declarations]550 1128 | HeapSnapshotOptions() {}551 | ^552../../deps/v8/include/v8-profiler.h:1142:25: note: declared here553 1142 | ObjectNameResolver* global_object_name_resolver = nullptr;554 | ^~~~~~~~~~~~~~~~~~~~~~~~~~~555[160/1871] CXX obj/src/api/node_base.exceptions.o556In file included from ../../src/memory_tracker.h:6,557 from ../../src/aliased_buffer.h:7,558 from ../../src/aliased_buffer-inl.h:6,559 from ../../src/env-inl.h:27,560 from ../../src/api/exceptions.cc:3:561../../deps/v8/include/v8-profiler.h: In constructor 'v8::HeapProfiler::HeapSnapshotOptions::HeapSnapshotOptions()':562../../deps/v8/include/v8-profiler.h:1128:27: warning: 'v8::HeapProfiler::HeapSnapshotOptions::global_object_name_resolver' is deprecated: Use context_name_resolver callback instead. [-Wdeprecated-declarations]563 1128 | HeapSnapshotOptions() {}564 | ^565../../deps/v8/include/v8-profiler.h:1142:25: note: declared here566 1142 | ObjectNameResolver* global_object_name_resolver = nullptr;567 | ^~~~~~~~~~~~~~~~~~~~~~~~~~~568../../deps/v8/include/v8-profiler.h:1128:27: warning: 'v8::HeapProfiler::HeapSnapshotOptions::global_object_name_resolver' is deprecated: Use context_name_resolver callback instead. [-Wdeprecated-declarations]569 1128 | HeapSnapshotOptions() {}570 | ^571../../deps/v8/include/v8-profiler.h:1142:25: note: declared here572 1142 | ObjectNameResolver* global_object_name_resolver = nullptr;573 | ^~~~~~~~~~~~~~~~~~~~~~~~~~~574[161/1871] CXX obj/src/api/node_base.callback.o575In file included from ../../src/memory_tracker.h:6,576 from ../../src/base_object.h:29,577 from ../../src/async_context_frame.h:6,578 from ../../src/api/callback.cc:1:579../../deps/v8/include/v8-profiler.h: In constructor 'v8::HeapProfiler::HeapSnapshotOptions::HeapSnapshotOptions()':580../../deps/v8/include/v8-profiler.h:1128:27: warning: 'v8::HeapProfiler::HeapSnapshotOptions::global_object_name_resolver' is deprecated: Use context_name_resolver callback instead. [-Wdeprecated-declarations]581 1128 | HeapSnapshotOptions() {}582 | ^583../../deps/v8/include/v8-profiler.h:1142:25: note: declared here584 1142 | ObjectNameResolver* global_object_name_resolver = nullptr;585 | ^~~~~~~~~~~~~~~~~~~~~~~~~~~586../../deps/v8/include/v8-profiler.h:1128:27: warning: 'v8::HeapProfiler::HeapSnapshotOptions::global_object_name_resolver' is deprecated: Use context_name_resolver callback instead. [-Wdeprecated-declarations]587 1128 | HeapSnapshotOptions() {}588 | ^589../../deps/v8/include/v8-profiler.h:1142:25: note: declared here590 1142 | ObjectNameResolver* global_object_name_resolver = nullptr;591 | ^~~~~~~~~~~~~~~~~~~~~~~~~~~592[162/1871] CXX obj/src/node_base.async_context_frame.o593In file included from ../../src/memory_tracker.h:6,594 from ../../src/base_object.h:29,595 from ../../src/async_context_frame.h:6,596 from ../../src/async_context_frame.cc:1:597../../deps/v8/include/v8-profiler.h: In constructor 'v8::HeapProfiler::HeapSnapshotOptions::HeapSnapshotOptions()':598../../deps/v8/include/v8-profiler.h:1128:27: warning: 'v8::HeapProfiler::HeapSnapshotOptions::global_object_name_resolver' is deprecated: Use context_name_resolver callback instead. [-Wdeprecated-declarations]599 1128 | HeapSnapshotOptions() {}600 | ^601../../deps/v8/include/v8-profiler.h:1142:25: note: declared here602 1142 | ObjectNameResolver* global_object_name_resolver = nullptr;603 | ^~~~~~~~~~~~~~~~~~~~~~~~~~~604../../deps/v8/include/v8-profiler.h:1128:27: warning: 'v8::HeapProfiler::HeapSnapshotOptions::global_object_name_resolver' is deprecated: Use context_name_resolver callback instead. [-Wdeprecated-declarations]605 1128 | HeapSnapshotOptions() {}606 | ^607../../deps/v8/include/v8-profiler.h:1142:25: note: declared here608 1142 | ObjectNameResolver* global_object_name_resolver = nullptr;609 | ^~~~~~~~~~~~~~~~~~~~~~~~~~~610[163/1871] CXX obj/src/node_base.debug_utils.o611In file included from ../../src/memory_tracker.h:6,612 from ../../src/base_object.h:29,613 from ../../src/async_wrap.h:27,614 from ../../src/debug_utils.h:6,615 from ../../src/debug_utils-inl.h:6,616 from ../../src/debug_utils.cc:1:617../../deps/v8/include/v8-profiler.h: In constructor 'v8::HeapProfiler::HeapSnapshotOptions::HeapSnapshotOptions()':618../../deps/v8/include/v8-profiler.h:1128:27: warning: 'v8::HeapProfiler::HeapSnapshotOptions::global_object_name_resolver' is deprecated: Use context_name_resolver callback instead. [-Wdeprecated-declarations]619 1128 | HeapSnapshotOptions() {}620 | ^621../../deps/v8/include/v8-profiler.h:1142:25: note: declared here622 1142 | ObjectNameResolver* global_object_name_resolver = nullptr;623 | ^~~~~~~~~~~~~~~~~~~~~~~~~~~624../../deps/v8/include/v8-profiler.h:1128:27: warning: 'v8::HeapProfiler::HeapSnapshotOptions::global_object_name_resolver' is deprecated: Use context_name_resolver callback instead. [-Wdeprecated-declarations]625 1128 | HeapSnapshotOptions() {}626 | ^627../../deps/v8/include/v8-profiler.h:1142:25: note: declared here628 1142 | ObjectNameResolver* global_object_name_resolver = nullptr;629 | ^~~~~~~~~~~~~~~~~~~~~~~~~~~630[164/1871] CXX obj/src/node_base.compile_cache.o631In file included from ../../src/memory_tracker.h:6,632 from ../../src/base_object.h:29,633 from ../../src/async_wrap.h:27,634 from ../../src/debug_utils.h:6,635 from ../../src/debug_utils-inl.h:6,636 from ../../src/compile_cache.cc:3:637../../deps/v8/include/v8-profiler.h: In constructor 'v8::HeapProfiler::HeapSnapshotOptions::HeapSnapshotOptions()':638../../deps/v8/include/v8-profiler.h:1128:27: warning: 'v8::HeapProfiler::HeapSnapshotOptions::global_object_name_resolver' is deprecated: Use context_name_resolver callback instead. [-Wdeprecated-declarations]639 1128 | HeapSnapshotOptions() {}640 | ^641../../deps/v8/include/v8-profiler.h:1142:25: note: declared here642 1142 | ObjectNameResolver* global_object_name_resolver = nullptr;643 | ^~~~~~~~~~~~~~~~~~~~~~~~~~~644../../deps/v8/include/v8-profiler.h:1128:27: warning: 'v8::HeapProfiler::HeapSnapshotOptions::global_object_name_resolver' is deprecated: Use context_name_resolver callback instead. [-Wdeprecated-declarations]645 1128 | HeapSnapshotOptions() {}646 | ^647../../deps/v8/include/v8-profiler.h:1142:25: note: declared here648 1142 | ObjectNameResolver* global_object_name_resolver = nullptr;649 | ^~~~~~~~~~~~~~~~~~~~~~~~~~~650[165/1871] CXX obj/src/node_base.node_debug.o651[166/1871] CXX obj/src/api/node_base.environment.o652In file included from ../../src/memory_tracker.h:6,653 from ../../src/base_object.h:29,654 from ../../src/async_wrap.h:27,655 from ../../src/crypto/crypto_util.h:6,656 from ../../src/api/environment.cc:3:657../../deps/v8/include/v8-profiler.h: In constructor 'v8::HeapProfiler::HeapSnapshotOptions::HeapSnapshotOptions()':658../../deps/v8/include/v8-profiler.h:1128:27: warning: 'v8::HeapProfiler::HeapSnapshotOptions::global_object_name_resolver' is deprecated: Use context_name_resolver callback instead. [-Wdeprecated-declarations]659 1128 | HeapSnapshotOptions() {}660 | ^661../../deps/v8/include/v8-profiler.h:1142:25: note: declared here662 1142 | ObjectNameResolver* global_object_name_resolver = nullptr;663 | ^~~~~~~~~~~~~~~~~~~~~~~~~~~664../../deps/v8/include/v8-profiler.h:1128:27: warning: 'v8::HeapProfiler::HeapSnapshotOptions::global_object_name_resolver' is deprecated: Use context_name_resolver callback instead. [-Wdeprecated-declarations]665 1128 | HeapSnapshotOptions() {}666 | ^667../../deps/v8/include/v8-profiler.h:1142:25: note: declared here668 1142 | ObjectNameResolver* global_object_name_resolver = nullptr;669 | ^~~~~~~~~~~~~~~~~~~~~~~~~~~670[167/1871] CXX obj/src/node_base.async_wrap.o671In file included from ../../src/memory_tracker.h:6,672 from ../../src/base_object.h:29,673 from ../../src/async_wrap.h:27,674 from ../../src/async_wrap.cc:22:675../../deps/v8/include/v8-profiler.h: In constructor 'v8::HeapProfiler::HeapSnapshotOptions::HeapSnapshotOptions()':676../../deps/v8/include/v8-profiler.h:1128:27: warning: 'v8::HeapProfiler::HeapSnapshotOptions::global_object_name_resolver' is deprecated: Use context_name_resolver callback instead. [-Wdeprecated-declarations]677 1128 | HeapSnapshotOptions() {}678 | ^679../../deps/v8/include/v8-profiler.h:1142:25: note: declared here680 1142 | ObjectNameResolver* global_object_name_resolver = nullptr;681 | ^~~~~~~~~~~~~~~~~~~~~~~~~~~682../../deps/v8/include/v8-profiler.h:1128:27: warning: 'v8::HeapProfiler::HeapSnapshotOptions::global_object_name_resolver' is deprecated: Use context_name_resolver callback instead. [-Wdeprecated-declarations]683 1128 | HeapSnapshotOptions() {}684 | ^685../../deps/v8/include/v8-profiler.h:1142:25: note: declared here686 1142 | ObjectNameResolver* global_object_name_resolver = nullptr;687 | ^~~~~~~~~~~~~~~~~~~~~~~~~~~688[168/1871] CXX obj/src/node_base.heap_utils.o689In file included from ../../src/memory_tracker.h:6,690 from ../../src/aliased_buffer.h:7,691 from ../../src/env.h:27,692 from ../../src/node_internals.h:27,693 from ../../src/diagnosticfilename-inl.h:6,694 from ../../src/heap_utils.cc:1:695../../deps/v8/include/v8-profiler.h: In constructor 'v8::HeapProfiler::HeapSnapshotOptions::HeapSnapshotOptions()':696../../deps/v8/include/v8-profiler.h:1128:27: warning: 'v8::HeapProfiler::HeapSnapshotOptions::global_object_name_resolver' is deprecated: Use context_name_resolver callback instead. [-Wdeprecated-declarations]697 1128 | HeapSnapshotOptions() {}698 | ^699../../deps/v8/include/v8-profiler.h:1142:25: note: declared here700 1142 | ObjectNameResolver* global_object_name_resolver = nullptr;701 | ^~~~~~~~~~~~~~~~~~~~~~~~~~~702../../deps/v8/include/v8-profiler.h:1128:27: warning: 'v8::HeapProfiler::HeapSnapshotOptions::global_object_name_resolver' is deprecated: Use context_name_resolver callback instead. [-Wdeprecated-declarations]703 1128 | HeapSnapshotOptions() {}704 | ^705../../deps/v8/include/v8-profiler.h:1142:25: note: declared here706 1142 | ObjectNameResolver* global_object_name_resolver = nullptr;707 | ^~~~~~~~~~~~~~~~~~~~~~~~~~~708[169/1871] CXX obj/src/node_base.fs_event_wrap.o709In file included from ../../src/memory_tracker.h:6,710 from ../../src/base_object.h:29,711 from ../../src/async_wrap.h:27,712 from ../../src/async_wrap-inl.h:27,713 from ../../src/fs_event_wrap.cc:22:714../../deps/v8/include/v8-profiler.h: In constructor 'v8::HeapProfiler::HeapSnapshotOptions::HeapSnapshotOptions()':715../../deps/v8/include/v8-profiler.h:1128:27: warning: 'v8::HeapProfiler::HeapSnapshotOptions::global_object_name_resolver' is deprecated: Use context_name_resolver callback instead. [-Wdeprecated-declarations]716 1128 | HeapSnapshotOptions() {}717 | ^718../../deps/v8/include/v8-profiler.h:1142:25: note: declared here719 1142 | ObjectNameResolver* global_object_name_resolver = nullptr;720 | ^~~~~~~~~~~~~~~~~~~~~~~~~~~721../../deps/v8/include/v8-profiler.h:1128:27: warning: 'v8::HeapProfiler::HeapSnapshotOptions::global_object_name_resolver' is deprecated: Use context_name_resolver callback instead. [-Wdeprecated-declarations]722 1128 | HeapSnapshotOptions() {}723 | ^724../../deps/v8/include/v8-profiler.h:1142:25: note: declared here725 1142 | ObjectNameResolver* global_object_name_resolver = nullptr;726 | ^~~~~~~~~~~~~~~~~~~~~~~~~~~727[170/1871] CXX obj/src/node_base.js_stream.o728In file included from ../../src/memory_tracker.h:6,729 from ../../src/base_object.h:29,730 from ../../src/async_wrap.h:27,731 from ../../src/js_stream.h:6,732 from ../../src/js_stream.cc:1:733../../deps/v8/include/v8-profiler.h: In constructor 'v8::HeapProfiler::HeapSnapshotOptions::HeapSnapshotOptions()':734../../deps/v8/include/v8-profiler.h:1128:27: warning: 'v8::HeapProfiler::HeapSnapshotOptions::global_object_name_resolver' is deprecated: Use context_name_resolver callback instead. [-Wdeprecated-declarations]735 1128 | HeapSnapshotOptions() {}736 | ^737../../deps/v8/include/v8-profiler.h:1142:25: note: declared here738 1142 | ObjectNameResolver* global_object_name_resolver = nullptr;739 | ^~~~~~~~~~~~~~~~~~~~~~~~~~~740../../deps/v8/include/v8-profiler.h:1128:27: warning: 'v8::HeapProfiler::HeapSnapshotOptions::global_object_name_resolver' is deprecated: Use context_name_resolver callback instead. [-Wdeprecated-declarations]741 1128 | HeapSnapshotOptions() {}742 | ^743../../deps/v8/include/v8-profiler.h:1142:25: note: declared here744 1142 | ObjectNameResolver* global_object_name_resolver = nullptr;745 | ^~~~~~~~~~~~~~~~~~~~~~~~~~~746[171/1871] CXX obj/src/node_base.handle_wrap.o747In file included from ../../src/memory_tracker.h:6,748 from ../../src/base_object.h:29,749 from ../../src/async_wrap.h:27,750 from ../../src/handle_wrap.h:27,751 from ../../src/handle_wrap.cc:22:752../../deps/v8/include/v8-profiler.h: In constructor 'v8::HeapProfiler::HeapSnapshotOptions::HeapSnapshotOptions()':753../../deps/v8/include/v8-profiler.h:1128:27: warning: 'v8::HeapProfiler::HeapSnapshotOptions::global_object_name_resolver' is deprecated: Use context_name_resolver callback instead. [-Wdeprecated-declarations]754 1128 | HeapSnapshotOptions() {}755 | ^756../../deps/v8/include/v8-profiler.h:1142:25: note: declared here757 1142 | ObjectNameResolver* global_object_name_resolver = nullptr;758 | ^~~~~~~~~~~~~~~~~~~~~~~~~~~759../../deps/v8/include/v8-profiler.h:1128:27: warning: 'v8::HeapProfiler::HeapSnapshotOptions::global_object_name_resolver' is deprecated: Use context_name_resolver callback instead. [-Wdeprecated-declarations]760 1128 | HeapSnapshotOptions() {}761 | ^762../../deps/v8/include/v8-profiler.h:1142:25: note: declared here763 1142 | ObjectNameResolver* global_object_name_resolver = nullptr;764 | ^~~~~~~~~~~~~~~~~~~~~~~~~~~765[172/1871] CXX obj/src/node_base.js_udp_wrap.o766In file included from ../../src/memory_tracker.h:6,767 from ../../src/base_object.h:29,768 from ../../src/async_wrap.h:27,769 from ../../src/handle_wrap.h:27,770 from ../../src/udp_wrap.h:27,771 from ../../src/js_udp_wrap.cc:1:772../../deps/v8/include/v8-profiler.h: In constructor 'v8::HeapProfiler::HeapSnapshotOptions::HeapSnapshotOptions()':773../../deps/v8/include/v8-profiler.h:1128:27: warning: 'v8::HeapProfiler::HeapSnapshotOptions::global_object_name_resolver' is deprecated: Use context_name_resolver callback instead. [-Wdeprecated-declarations]774 1128 | HeapSnapshotOptions() {}775 | ^776../../deps/v8/include/v8-profiler.h:1142:25: note: declared here777 1142 | ObjectNameResolver* global_object_name_resolver = nullptr;778 | ^~~~~~~~~~~~~~~~~~~~~~~~~~~779../../deps/v8/include/v8-profiler.h:1128:27: warning: 'v8::HeapProfiler::HeapSnapshotOptions::global_object_name_resolver' is deprecated: Use context_name_resolver callback instead. [-Wdeprecated-declarations]780 1128 | HeapSnapshotOptions() {}781 | ^782../../deps/v8/include/v8-profiler.h:1142:25: note: declared here783 1142 | ObjectNameResolver* global_object_name_resolver = nullptr;784 | ^~~~~~~~~~~~~~~~~~~~~~~~~~~785[173/1871] CXX obj/src/node_base.encoding_binding.o786In file included from ../../src/memory_tracker.h:6,787 from ../../src/aliased_buffer.h:7,788 from ../../src/encoding_binding.h:7,789 from ../../src/encoding_binding.cc:1:790../../deps/v8/include/v8-profiler.h: In constructor 'v8::HeapProfiler::HeapSnapshotOptions::HeapSnapshotOptions()':791../../deps/v8/include/v8-profiler.h:1128:27: warning: 'v8::HeapProfiler::HeapSnapshotOptions::global_object_name_resolver' is deprecated: Use context_name_resolver callback instead. [-Wdeprecated-declarations]792 1128 | HeapSnapshotOptions() {}793 | ^794../../deps/v8/include/v8-profiler.h:1142:25: note: declared here795 1142 | ObjectNameResolver* global_object_name_resolver = nullptr;796 | ^~~~~~~~~~~~~~~~~~~~~~~~~~~797../../deps/v8/include/v8-profiler.h:1128:27: warning: 'v8::HeapProfiler::HeapSnapshotOptions::global_object_name_resolver' is deprecated: Use context_name_resolver callback instead. [-Wdeprecated-declarations]798 1128 | HeapSnapshotOptions() {}799 | ^800../../deps/v8/include/v8-profiler.h:1142:25: note: declared here801 1142 | ObjectNameResolver* global_object_name_resolver = nullptr;802 | ^~~~~~~~~~~~~~~~~~~~~~~~~~~803[174/1871] CXX obj/src/dataqueue/node_base.queue.o804In file included from ../../src/memory_tracker.h:6,805 from ../../src/base_object.h:29,806 from ../../src/dataqueue/queue.h:5,807 from ../../src/dataqueue/queue.cc:1:808../../deps/v8/include/v8-profiler.h: In constructor 'v8::HeapProfiler::HeapSnapshotOptions::HeapSnapshotOptions()':809../../deps/v8/include/v8-profiler.h:1128:27: warning: 'v8::HeapProfiler::HeapSnapshotOptions::global_object_name_resolver' is deprecated: Use context_name_resolver callback instead. [-Wdeprecated-declarations]810 1128 | HeapSnapshotOptions() {}811 | ^812../../deps/v8/include/v8-profiler.h:1142:25: note: declared here813 1142 | ObjectNameResolver* global_object_name_resolver = nullptr;814 | ^~~~~~~~~~~~~~~~~~~~~~~~~~~815../../deps/v8/include/v8-profiler.h:1128:27: warning: 'v8::HeapProfiler::HeapSnapshotOptions::global_object_name_resolver' is deprecated: Use context_name_resolver callback instead. [-Wdeprecated-declarations]816 1128 | HeapSnapshotOptions() {}817 | ^818../../deps/v8/include/v8-profiler.h:1142:25: note: declared here819 1142 | ObjectNameResolver* global_object_name_resolver = nullptr;820 | ^~~~~~~~~~~~~~~~~~~~~~~~~~~821[175/1871] CXX obj/src/node_base.node_file_utils.o822In file included from ../../src/util.h:29,823 from ../../src/util-inl.h:33,824 from ../../src/node_file_utils.cc:10:825../../deps/v8/include/v8-profiler.h: In constructor 'v8::HeapProfiler::HeapSnapshotOptions::HeapSnapshotOptions()':826../../deps/v8/include/v8-profiler.h:1128:27: warning: 'v8::HeapProfiler::HeapSnapshotOptions::global_object_name_resolver' is deprecated: Use context_name_resolver callback instead. [-Wdeprecated-declarations]827 1128 | HeapSnapshotOptions() {}828 | ^829../../deps/v8/include/v8-profiler.h:1142:25: note: declared here830 1142 | ObjectNameResolver* global_object_name_resolver = nullptr;831 | ^~~~~~~~~~~~~~~~~~~~~~~~~~~832../../deps/v8/include/v8-profiler.h:1128:27: warning: 'v8::HeapProfiler::HeapSnapshotOptions::global_object_name_resolver' is deprecated: Use context_name_resolver callback instead. [-Wdeprecated-declarations]833 1128 | HeapSnapshotOptions() {}834 | ^835../../deps/v8/include/v8-profiler.h:1142:25: note: declared here836 1142 | ObjectNameResolver* global_object_name_resolver = nullptr;837 | ^~~~~~~~~~~~~~~~~~~~~~~~~~~838../../src/node_file_utils.cc: In function 'int node::WriteFileSync(const char*, uv_buf_t*, size_t)':839../../src/node_file_utils.cc:62:32: warning: enumerated and non-enumerated type in conditional expression [-Wextra]840 62 | int err = req.result < 0 ? req.result : UV_EIO;841 | ~~~~~~~~~~~~~~~^~~~~~~~~~~~~~~~~~~~~842[176/1871] CXX obj/src/node_base.histogram.o843In file included from ../../src/memory_tracker.h:6,844 from ../../src/base_object.h:29,845 from ../../src/histogram.h:7,846 from ../../src/histogram.cc:1:847../../deps/v8/include/v8-profiler.h: In constructor 'v8::HeapProfiler::HeapSnapshotOptions::HeapSnapshotOptions()':848../../deps/v8/include/v8-profiler.h:1128:27: warning: 'v8::HeapProfiler::HeapSnapshotOptions::global_object_name_resolver' is deprecated: Use context_name_resolver callback instead. [-Wdeprecated-declarations]849 1128 | HeapSnapshotOptions() {}850 | ^851../../deps/v8/include/v8-profiler.h:1142:25: note: declared here852 1142 | ObjectNameResolver* global_object_name_resolver = nullptr;853 | ^~~~~~~~~~~~~~~~~~~~~~~~~~~854../../deps/v8/include/v8-profiler.h:1128:27: warning: 'v8::HeapProfiler::HeapSnapshotOptions::global_object_name_resolver' is deprecated: Use context_name_resolver callback instead. [-Wdeprecated-declarations]855 1128 | HeapSnapshotOptions() {}856 | ^857../../deps/v8/include/v8-profiler.h:1142:25: note: declared here858 1142 | ObjectNameResolver* global_object_name_resolver = nullptr;859 | ^~~~~~~~~~~~~~~~~~~~~~~~~~~860[177/1871] CXX obj/src/node_base.js_native_api_v8.o861In file included from ../../src/memory_tracker.h:6,862 from ../../src/aliased_buffer.h:7,863 from ../../src/aliased_buffer-inl.h:6,864 from ../../src/env-inl.h:27,865 from ../../src/js_native_api_v8.cc:7:866../../deps/v8/include/v8-profiler.h: In constructor 'v8::HeapProfiler::HeapSnapshotOptions::HeapSnapshotOptions()':867../../deps/v8/include/v8-profiler.h:1128:27: warning: 'v8::HeapProfiler::HeapSnapshotOptions::global_object_name_resolver' is deprecated: Use context_name_resolver callback instead. [-Wdeprecated-declarations]868 1128 | HeapSnapshotOptions() {}869 | ^870../../deps/v8/include/v8-profiler.h:1142:25: note: declared here871 1142 | ObjectNameResolver* global_object_name_resolver = nullptr;872 | ^~~~~~~~~~~~~~~~~~~~~~~~~~~873../../deps/v8/include/v8-profiler.h:1128:27: warning: 'v8::HeapProfiler::HeapSnapshotOptions::global_object_name_resolver' is deprecated: Use context_name_resolver callback instead. [-Wdeprecated-declarations]874 1128 | HeapSnapshotOptions() {}875 | ^876../../deps/v8/include/v8-profiler.h:1142:25: note: declared here877 1142 | ObjectNameResolver* global_object_name_resolver = nullptr;878 | ^~~~~~~~~~~~~~~~~~~~~~~~~~~879[178/1871] CXX obj/src/node_base.module_wrap.o880In file included from ../../src/memory_tracker.h:6,881 from ../../src/base_object.h:29,882 from ../../src/module_wrap.h:10,883 from ../../src/module_wrap.cc:1:884../../deps/v8/include/v8-profiler.h: In constructor 'v8::HeapProfiler::HeapSnapshotOptions::HeapSnapshotOptions()':885../../deps/v8/include/v8-profiler.h:1128:27: warning: 'v8::HeapProfiler::HeapSnapshotOptions::global_object_name_resolver' is deprecated: Use context_name_resolver callback instead. [-Wdeprecated-declarations]886 1128 | HeapSnapshotOptions() {}887 | ^888../../deps/v8/include/v8-profiler.h:1142:25: note: declared here889 1142 | ObjectNameResolver* global_object_name_resolver = nullptr;890 | ^~~~~~~~~~~~~~~~~~~~~~~~~~~891../../deps/v8/include/v8-profiler.h:1128:27: warning: 'v8::HeapProfiler::HeapSnapshotOptions::global_object_name_resolver' is deprecated: Use context_name_resolver callback instead. [-Wdeprecated-declarations]892 1128 | HeapSnapshotOptions() {}893 | ^894../../deps/v8/include/v8-profiler.h:1142:25: note: declared here895 1142 | ObjectNameResolver* global_object_name_resolver = nullptr;896 | ^~~~~~~~~~~~~~~~~~~~~~~~~~~897[179/1871] CXX obj/src/node_base.node_api.o898In file included from ../../src/memory_tracker.h:6,899 from ../../src/base_object.h:29,900 from ../../src/async_context_frame.h:6,901 from ../../src/node_api.cc:1:902../../deps/v8/include/v8-profiler.h: In constructor 'v8::HeapProfiler::HeapSnapshotOptions::HeapSnapshotOptions()':903../../deps/v8/include/v8-profiler.h:1128:27: warning: 'v8::HeapProfiler::HeapSnapshotOptions::global_object_name_resolver' is deprecated: Use context_name_resolver callback instead. [-Wdeprecated-declarations]904 1128 | HeapSnapshotOptions() {}905 | ^906../../deps/v8/include/v8-profiler.h:1142:25: note: declared here907 1142 | ObjectNameResolver* global_object_name_resolver = nullptr;908 | ^~~~~~~~~~~~~~~~~~~~~~~~~~~909../../deps/v8/include/v8-profiler.h:1128:27: warning: 'v8::HeapProfiler::HeapSnapshotOptions::global_object_name_resolver' is deprecated: Use context_name_resolver callback instead. [-Wdeprecated-declarations]910 1128 | HeapSnapshotOptions() {}911 | ^912../../deps/v8/include/v8-profiler.h:1142:25: note: declared here913 1142 | ObjectNameResolver* global_object_name_resolver = nullptr;914 | ^~~~~~~~~~~~~~~~~~~~~~~~~~~915[180/1871] CXX obj/src/node_base.node.o916In file included from ../../src/memory_tracker.h:6,917 from ../../src/aliased_buffer.h:7,918 from ../../src/env.h:27,919 from ../../src/node_internals.h:27,920 from ../../src/node_config_file.h:12,921 from ../../src/node.cc:23:922../../deps/v8/include/v8-profiler.h: In constructor 'v8::HeapProfiler::HeapSnapshotOptions::HeapSnapshotOptions()':923../../deps/v8/include/v8-profiler.h:1128:27: warning: 'v8::HeapProfiler::HeapSnapshotOptions::global_object_name_resolver' is deprecated: Use context_name_resolver callback instead. [-Wdeprecated-declarations]924 1128 | HeapSnapshotOptions() {}925 | ^926../../deps/v8/include/v8-profiler.h:1142:25: note: declared here927 1142 | ObjectNameResolver* global_object_name_resolver = nullptr;928 | ^~~~~~~~~~~~~~~~~~~~~~~~~~~929../../deps/v8/include/v8-profiler.h:1128:27: warning: 'v8::HeapProfiler::HeapSnapshotOptions::global_object_name_resolver' is deprecated: Use context_name_resolver callback instead. [-Wdeprecated-declarations]930 1128 | HeapSnapshotOptions() {}931 | ^932../../deps/v8/include/v8-profiler.h:1142:25: note: declared here933 1142 | ObjectNameResolver* global_object_name_resolver = nullptr;934 | ^~~~~~~~~~~~~~~~~~~~~~~~~~~935[181/1871] CXX obj/src/node_base.cares_wrap.o936In file included from ../../src/memory_tracker.h:6,937 from ../../src/base_object.h:29,938 from ../../src/async_wrap.h:27,939 from ../../src/cares_wrap.h:8,940 from ../../src/cares_wrap.cc:22:941../../deps/v8/include/v8-profiler.h: In constructor 'v8::HeapProfiler::HeapSnapshotOptions::HeapSnapshotOptions()':942../../deps/v8/include/v8-profiler.h:1128:27: warning: 'v8::HeapProfiler::HeapSnapshotOptions::global_object_name_resolver' is deprecated: Use context_name_resolver callback instead. [-Wdeprecated-declarations]943 1128 | HeapSnapshotOptions() {}944 | ^945../../deps/v8/include/v8-profiler.h:1142:25: note: declared here946 1142 | ObjectNameResolver* global_object_name_resolver = nullptr;947 | ^~~~~~~~~~~~~~~~~~~~~~~~~~~948../../deps/v8/include/v8-profiler.h:1128:27: warning: 'v8::HeapProfiler::HeapSnapshotOptions::global_object_name_resolver' is deprecated: Use context_name_resolver callback instead. [-Wdeprecated-declarations]949 1128 | HeapSnapshotOptions() {}950 | ^951../../deps/v8/include/v8-profiler.h:1142:25: note: declared here952 1142 | ObjectNameResolver* global_object_name_resolver = nullptr;953 | ^~~~~~~~~~~~~~~~~~~~~~~~~~~954../../src/cares_wrap.cc: In function 'v8::Maybe<int> node::cares_wrap::{anonymous}::ParseGeneralReply(node::Environment*, const unsigned char*, int, int*, v8::Local<v8::Array>, void*, int*)':955../../src/cares_wrap.cc:244:34: warning: 'int ares_parse_a_reply(const unsigned char*, int, hostent**, ares_addrttl*, int*)' is deprecated: Use ares_dns_parse instead [-Wdeprecated-declarations]956 244 | status = ares_parse_a_reply(buf,957 | ~~~~~~~~~~~~~~~~~~^~~~~958 245 | len,959 | ~~~~960 246 | &host,961 | ~~~~~~962 247 | static_cast<ares_addrttl*>(addrttls),963 | ~~~~~~~~~~~~~~~~~~~~~~~~~~~~~~~~~~~~~964 248 | naddrttls);965 | ~~~~~~~~~~966In file included from ../../src/cares_wrap.h:17:967/nix/store/j239p458yixap89j6wpfib9yjypd3ii5-c-ares-1.34.8-dev/include/ares.h:1106:55: note: declared here968 1106 | CARES_EXTERN CARES_DEPRECATED_FOR(ares_dns_parse) int ares_parse_a_reply(969 | ^~~~~~~~~~~~~~~~~~970../../src/cares_wrap.cc:251:37: warning: 'int ares_parse_aaaa_reply(const unsigned char*, int, hostent**, ares_addr6ttl*, int*)' is deprecated: Use ares_dns_parse instead [-Wdeprecated-declarations]971 251 | status = ares_parse_aaaa_reply(buf,972 | ~~~~~~~~~~~~~~~~~~~~~^~~~~973 252 | len,974 | ~~~~975 253 | &host,976 | ~~~~~~977 254 | static_cast<ares_addr6ttl*>(addrttls),978 | ~~~~~~~~~~~~~~~~~~~~~~~~~~~~~~~~~~~~~~979 255 | naddrttls);980 | ~~~~~~~~~~981/nix/store/j239p458yixap89j6wpfib9yjypd3ii5-c-ares-1.34.8-dev/include/ares.h:1110:55: note: declared here982 1110 | CARES_EXTERN CARES_DEPRECATED_FOR(ares_dns_parse) int ares_parse_aaaa_reply(983 | ^~~~~~~~~~~~~~~~~~~~~984../../src/cares_wrap.cc:258:35: warning: 'int ares_parse_ns_reply(const unsigned char*, int, hostent**)' is deprecated: Use ares_dns_parse instead [-Wdeprecated-declarations]985 258 | status = ares_parse_ns_reply(buf, len, &host);986 | ~~~~~~~~~~~~~~~~~~~^~~~~~~~~~~~~~~~~987/nix/store/j239p458yixap89j6wpfib9yjypd3ii5-c-ares-1.34.8-dev/include/ares.h:1121:55: note: declared here988 1121 | CARES_EXTERN CARES_DEPRECATED_FOR(ares_dns_parse) int ares_parse_ns_reply(989 | ^~~~~~~~~~~~~~~~~~~990../../src/cares_wrap.cc:261:36: warning: 'int ares_parse_ptr_reply(const unsigned char*, int, const void*, int, int, hostent**)' is deprecated: Use ares_dns_parse instead [-Wdeprecated-declarations]991 261 | status = ares_parse_ptr_reply(buf, len, nullptr, 0, AF_INET, &host);992 | ~~~~~~~~~~~~~~~~~~~~^~~~~~~~~~~~~~~~~~~~~~~~~~~~~~~~~~~~~~993/nix/store/j239p458yixap89j6wpfib9yjypd3ii5-c-ares-1.34.8-dev/include/ares.h:1117:55: note: declared here994 1117 | CARES_EXTERN CARES_DEPRECATED_FOR(ares_dns_parse) int ares_parse_ptr_reply(995 | ^~~~~~~~~~~~~~~~~~~~996../../src/cares_wrap.cc: In function 'v8::Maybe<int> node::cares_wrap::{anonymous}::ParseMxReply(node::Environment*, const unsigned char*, int, v8::Local<v8::Array>, bool)':997../../src/cares_wrap.cc:337:35: warning: 'int ares_parse_mx_reply(const unsigned char*, int, ares_mx_reply**)' is deprecated: Use ares_dns_parse instead [-Wdeprecated-declarations]998 337 | int status = ares_parse_mx_reply(buf, len, &mx_start);999 | ~~~~~~~~~~~~~~~~~~~^~~~~~~~~~~~~~~~~~~~~1000/nix/store/j239p458yixap89j6wpfib9yjypd3ii5-c-ares-1.34.8-dev/include/ares.h:1127:55: note: declared here1001 1127 | CARES_EXTERN CARES_DEPRECATED_FOR(ares_dns_parse) int ares_parse_mx_reply(1002 | ^~~~~~~~~~~~~~~~~~~1003../../src/cares_wrap.cc: In function 'v8::Maybe<int> node::cares_wrap::{anonymous}::ParseCaaReply(node::Environment*, const unsigned char*, int, v8::Local<v8::Array>, bool)':1004../../src/cares_wrap.cc:383:36: warning: 'int ares_parse_caa_reply(const unsigned char*, int, ares_caa_reply**)' is deprecated: Use ares_dns_parse instead [-Wdeprecated-declarations]1005 383 | int status = ares_parse_caa_reply(buf, len, &caa_start);1006 | ~~~~~~~~~~~~~~~~~~~~^~~~~~~~~~~~~~~~~~~~~~1007/nix/store/j239p458yixap89j6wpfib9yjypd3ii5-c-ares-1.34.8-dev/include/ares.h:1114:55: note: declared here1008 1114 | CARES_EXTERN CARES_DEPRECATED_FOR(ares_dns_parse) int ares_parse_caa_reply(1009 | ^~~~~~~~~~~~~~~~~~~~1010../../src/cares_wrap.cc: In function 'v8::Maybe<int> node::cares_wrap::{anonymous}::ParseTxtReply(node::Environment*, const unsigned char*, int, v8::Local<v8::Array>, bool)':1011../../src/cares_wrap.cc:511:40: warning: 'int ares_parse_txt_reply_ext(const unsigned char*, int, ares_txt_ext**)' is deprecated: Use ares_dns_parse instead [-Wdeprecated-declarations]1012 511 | int status = ares_parse_txt_reply_ext(buf, len, &txt_out);1013 | ~~~~~~~~~~~~~~~~~~~~~~~~^~~~~~~~~~~~~~~~~~~~1014/nix/store/j239p458yixap89j6wpfib9yjypd3ii5-c-ares-1.34.8-dev/include/ares.h:1133:55: note: declared here1015 1133 | CARES_EXTERN CARES_DEPRECATED_FOR(ares_dns_parse) int ares_parse_txt_reply_ext(1016 | ^~~~~~~~~~~~~~~~~~~~~~~~1017../../src/cares_wrap.cc: In function 'v8::Maybe<int> node::cares_wrap::{anonymous}::ParseSrvReply(node::Environment*, const unsigned char*, int, v8::Local<v8::Array>, bool)':1018../../src/cares_wrap.cc:598:36: warning: 'int ares_parse_srv_reply(const unsigned char*, int, ares_srv_reply**)' is deprecated: Use ares_dns_parse instead [-Wdeprecated-declarations]1019 598 | int status = ares_parse_srv_reply(buf, len, &srv_start);1020 | ~~~~~~~~~~~~~~~~~~~~^~~~~~~~~~~~~~~~~~~~~~1021/nix/store/j239p458yixap89j6wpfib9yjypd3ii5-c-ares-1.34.8-dev/include/ares.h:1124:55: note: declared here1022 1124 | CARES_EXTERN CARES_DEPRECATED_FOR(ares_dns_parse) int ares_parse_srv_reply(1023 | ^~~~~~~~~~~~~~~~~~~~1024../../src/cares_wrap.cc: In function 'v8::Maybe<int> node::cares_wrap::{anonymous}::ParseNaptrReply(node::Environment*, const unsigned char*, int, v8::Local<v8::Array>, bool)':1025../../src/cares_wrap.cc:653:38: warning: 'int ares_parse_naptr_reply(const unsigned char*, int, ares_naptr_reply**)' is deprecated: Use ares_dns_parse instead [-Wdeprecated-declarations]1026 653 | int status = ares_parse_naptr_reply(buf, len, &naptr_start);1027 | ~~~~~~~~~~~~~~~~~~~~~~^~~~~~~~~~~~~~~~~~~~~~~~1028/nix/store/j239p458yixap89j6wpfib9yjypd3ii5-c-ares-1.34.8-dev/include/ares.h:1136:55: note: declared here1029 1136 | CARES_EXTERN CARES_DEPRECATED_FOR(ares_dns_parse) int ares_parse_naptr_reply(1030 | ^~~~~~~~~~~~~~~~~~~~~~1031../../src/cares_wrap.cc: In member function 'void node::cares_wrap::ChannelWrap::EnsureServers()':1032../../src/cares_wrap.cc:1000:25: warning: 'int ares_get_servers_ports(const ares_channel_t*, ares_addr_port_node**)' is deprecated: Use ares_get_servers_csv instead [-Wdeprecated-declarations]1033 1000 | ares_get_servers_ports(channel_, &servers);1034 | ~~~~~~~~~~~~~~~~~~~~~~^~~~~~~~~~~~~~~~~~~~1035/nix/store/j239p458yixap89j6wpfib9yjypd3ii5-c-ares-1.34.8-dev/include/ares.h:1196:28: note: declared here1036 1196 | int ares_get_servers_ports(const ares_channel_t *channel,1037 | ^~~~~~~~~~~~~~~~~~~~~~1038../../src/cares_wrap.cc: In static member function 'static v8::Maybe<int> node::cares_wrap::SoaTraits::Parse(node::cares_wrap::QuerySoaWrap*, const std::unique_ptr<node::cares_wrap::ResponseData>&)':1039../../src/cares_wrap.cc:1711:36: warning: 'int ares_parse_soa_reply(const unsigned char*, int, ares_soa_reply**)' is deprecated: Use ares_dns_parse instead [-Wdeprecated-declarations]1040 1711 | int status = ares_parse_soa_reply(buf, len, &soa_out);1041 | ~~~~~~~~~~~~~~~~~~~~^~~~~~~~~~~~~~~~~~~~1042/nix/store/j239p458yixap89j6wpfib9yjypd3ii5-c-ares-1.34.8-dev/include/ares.h:1139:55: note: declared here1043 1139 | CARES_EXTERN CARES_DEPRECATED_FOR(ares_dns_parse) int ares_parse_soa_reply(1044 | ^~~~~~~~~~~~~~~~~~~~1045../../src/cares_wrap.cc: In function 'void node::cares_wrap::{anonymous}::GetServers(const v8::FunctionCallbackInfo<v8::Value>&)':1046../../src/cares_wrap.cc:2092:33: warning: 'int ares_get_servers_ports(const ares_channel_t*, ares_addr_port_node**)' is deprecated: Use ares_get_servers_csv instead [-Wdeprecated-declarations]1047 2092 | int r = ares_get_servers_ports(channel->cares_channel(), &servers);1048 | ~~~~~~~~~~~~~~~~~~~~~~^~~~~~~~~~~~~~~~~~~~~~~~~~~~~~~~~~~~1049/nix/store/j239p458yixap89j6wpfib9yjypd3ii5-c-ares-1.34.8-dev/include/ares.h:1196:28: note: declared here1050 1196 | int ares_get_servers_ports(const ares_channel_t *channel,1051 | ^~~~~~~~~~~~~~~~~~~~~~1052../../src/cares_wrap.cc: In function 'void node::cares_wrap::{anonymous}::SetServers(const v8::FunctionCallbackInfo<v8::Value>&)':1053../../src/cares_wrap.cc:2137:30: warning: 'int ares_set_servers(ares_channel_t*, const ares_addr_node*)' is deprecated: Use ares_set_servers_csv instead [-Wdeprecated-declarations]1054 2137 | int rv = ares_set_servers(channel->cares_channel(), nullptr);1055 | ~~~~~~~~~~~~~~~~^~~~~~~~~~~~~~~~~~~~~~~~~~~~~~~~~~~1056/nix/store/j239p458yixap89j6wpfib9yjypd3ii5-c-ares-1.34.8-dev/include/ares.h:1176:61: note: declared here1057 1176 | CARES_EXTERN CARES_DEPRECATED_FOR(ares_set_servers_csv) int ares_set_servers(1058 | ^~~~~~~~~~~~~~~~1059../../src/cares_wrap.cc:2197:33: warning: 'int ares_set_servers_ports(ares_channel_t*, const ares_addr_port_node*)' is deprecated: Use ares_set_servers_ports_csv instead [-Wdeprecated-declarations]1060 2197 | err = ares_set_servers_ports(channel->cares_channel(), servers.data());1061 | ~~~~~~~~~~~~~~~~~~~~~~^~~~~~~~~~~~~~~~~~~~~~~~~~~~~~~~~~~~~~~~~~1062/nix/store/j239p458yixap89j6wpfib9yjypd3ii5-c-ares-1.34.8-dev/include/ares.h:1181:20: note: declared here1063 1181 | int ares_set_servers_ports(ares_channel_t *channel,1064 | ^~~~~~~~~~~~~~~~~~~~~~1065[182/1871] CXX obj/gen/node_base.node_javascript.o1066In file included from ../../src/memory_tracker.h:6,1067 from ../../src/aliased_buffer.h:7,1068 from ../../src/aliased_buffer-inl.h:6,1069 from ../../src/env-inl.h:27,1070 from gen/node_javascript.cc:2:1071../../deps/v8/include/v8-profiler.h: In constructor 'v8::HeapProfiler::HeapSnapshotOptions::HeapSnapshotOptions()':1072../../deps/v8/include/v8-profiler.h:1128:27: warning: 'v8::HeapProfiler::HeapSnapshotOptions::global_object_name_resolver' is deprecated: Use context_name_resolver callback instead. [-Wdeprecated-declarations]1073 1128 | HeapSnapshotOptions() {}1074 | ^1075../../deps/v8/include/v8-profiler.h:1142:25: note: declared here1076 1142 | ObjectNameResolver* global_object_name_resolver = nullptr;1077 | ^~~~~~~~~~~~~~~~~~~~~~~~~~~1078../../deps/v8/include/v8-profiler.h:1128:27: warning: 'v8::HeapProfiler::HeapSnapshotOptions::global_object_name_resolver' is deprecated: Use context_name_resolver callback instead. [-Wdeprecated-declarations]1079 1128 | HeapSnapshotOptions() {}1080 | ^1081../../deps/v8/include/v8-profiler.h:1142:25: note: declared here1082 1142 | ObjectNameResolver* global_object_name_resolver = nullptr;1083 | ^~~~~~~~~~~~~~~~~~~~~~~~~~~1084[183/1871] CXX obj/src/node_base.node_credentials.o1085In file included from ../../src/memory_tracker.h:6,1086 from ../../src/aliased_buffer.h:7,1087 from ../../src/aliased_buffer-inl.h:6,1088 from ../../src/env-inl.h:27,1089 from ../../src/node_credentials.cc:1:1090../../deps/v8/include/v8-profiler.h: In constructor 'v8::HeapProfiler::HeapSnapshotOptions::HeapSnapshotOptions()':1091../../deps/v8/include/v8-profiler.h:1128:27: warning: 'v8::HeapProfiler::HeapSnapshotOptions::global_object_name_resolver' is deprecated: Use context_name_resolver callback instead. [-Wdeprecated-declarations]1092 1128 | HeapSnapshotOptions() {}1093 | ^1094../../deps/v8/include/v8-profiler.h:1142:25: note: declared here1095 1142 | ObjectNameResolver* global_object_name_resolver = nullptr;1096 | ^~~~~~~~~~~~~~~~~~~~~~~~~~~1097../../deps/v8/include/v8-profiler.h:1128:27: warning: 'v8::HeapProfiler::HeapSnapshotOptions::global_object_name_resolver' is deprecated: Use context_name_resolver callback instead. [-Wdeprecated-declarations]1098 1128 | HeapSnapshotOptions() {}1099 | ^1100../../deps/v8/include/v8-profiler.h:1142:25: note: declared here1101 1142 | ObjectNameResolver* global_object_name_resolver = nullptr;1102 | ^~~~~~~~~~~~~~~~~~~~~~~~~~~1103[184/1871] CXX obj/src/node_base.node_dir.o1104In file included from ../../src/memory_tracker.h:6,1105 from ../../src/aliased_buffer.h:7,1106 from ../../src/node_file.h:7,1107 from ../../src/node_dir.h:6,1108 from ../../src/node_dir.cc:1:1109../../deps/v8/include/v8-profiler.h: In constructor 'v8::HeapProfiler::HeapSnapshotOptions::HeapSnapshotOptions()':1110../../deps/v8/include/v8-profiler.h:1128:27: warning: 'v8::HeapProfiler::HeapSnapshotOptions::global_object_name_resolver' is deprecated: Use context_name_resolver callback instead. [-Wdeprecated-declarations]1111 1128 | HeapSnapshotOptions() {}1112 | ^1113../../deps/v8/include/v8-profiler.h:1142:25: note: declared here1114 1142 | ObjectNameResolver* global_object_name_resolver = nullptr;1115 | ^~~~~~~~~~~~~~~~~~~~~~~~~~~1116../../deps/v8/include/v8-profiler.h:1128:27: warning: 'v8::HeapProfiler::HeapSnapshotOptions::global_object_name_resolver' is deprecated: Use context_name_resolver callback instead. [-Wdeprecated-declarations]1117 1128 | HeapSnapshotOptions() {}1118 | ^1119../../deps/v8/include/v8-profiler.h:1142:25: note: declared here1120 1142 | ObjectNameResolver* global_object_name_resolver = nullptr;1121 | ^~~~~~~~~~~~~~~~~~~~~~~~~~~1122[185/1871] CXX obj/src/node_base.node_config_file.o1123In file included from ../../src/memory_tracker.h:6,1124 from ../../src/aliased_buffer.h:7,1125 from ../../src/env.h:27,1126 from ../../src/node_internals.h:27,1127 from ../../src/node_config_file.h:12,1128 from ../../src/node_config_file.cc:1:1129../../deps/v8/include/v8-profiler.h: In constructor 'v8::HeapProfiler::HeapSnapshotOptions::HeapSnapshotOptions()':1130../../deps/v8/include/v8-profiler.h:1128:27: warning: 'v8::HeapProfiler::HeapSnapshotOptions::global_object_name_resolver' is deprecated: Use context_name_resolver callback instead. [-Wdeprecated-declarations]1131 1128 | HeapSnapshotOptions() {}1132 | ^1133../../deps/v8/include/v8-profiler.h:1142:25: note: declared here1134 1142 | ObjectNameResolver* global_object_name_resolver = nullptr;1135 | ^~~~~~~~~~~~~~~~~~~~~~~~~~~1136../../deps/v8/include/v8-profiler.h:1128:27: warning: 'v8::HeapProfiler::HeapSnapshotOptions::global_object_name_resolver' is deprecated: Use context_name_resolver callback instead. [-Wdeprecated-declarations]1137 1128 | HeapSnapshotOptions() {}1138 | ^1139../../deps/v8/include/v8-profiler.h:1142:25: note: declared here1140 1142 | ObjectNameResolver* global_object_name_resolver = nullptr;1141 | ^~~~~~~~~~~~~~~~~~~~~~~~~~~1142[186/1871] CXX obj/deps/v8/src/torque/torque_base.implementation-visitor.o1143[187/1871] CXX obj/src/node_base.node_config.o1144In file included from ../../src/memory_tracker.h:6,1145 from ../../src/aliased_buffer.h:7,1146 from ../../src/aliased_buffer-inl.h:6,1147 from ../../src/env-inl.h:27,1148 from ../../src/node_config.cc:1:1149../../deps/v8/include/v8-profiler.h: In constructor 'v8::HeapProfiler::HeapSnapshotOptions::HeapSnapshotOptions()':1150../../deps/v8/include/v8-profiler.h:1128:27: warning: 'v8::HeapProfiler::HeapSnapshotOptions::global_object_name_resolver' is deprecated: Use context_name_resolver callback instead. [-Wdeprecated-declarations]1151 1128 | HeapSnapshotOptions() {}1152 | ^1153../../deps/v8/include/v8-profiler.h:1142:25: note: declared here1154 1142 | ObjectNameResolver* global_object_name_resolver = nullptr;1155 | ^~~~~~~~~~~~~~~~~~~~~~~~~~~1156../../deps/v8/include/v8-profiler.h:1128:27: warning: 'v8::HeapProfiler::HeapSnapshotOptions::global_object_name_resolver' is deprecated: Use context_name_resolver callback instead. [-Wdeprecated-declarations]1157 1128 | HeapSnapshotOptions() {}1158 | ^1159../../deps/v8/include/v8-profiler.h:1142:25: note: declared here1160 1142 | ObjectNameResolver* global_object_name_resolver = nullptr;1161 | ^~~~~~~~~~~~~~~~~~~~~~~~~~~1162[188/1871] CXX obj/src/node_base.node_dotenv.o1163In file included from ../../src/util.h:29,1164 from ../../src/util-inl.h:33,1165 from ../../src/node_dotenv.h:6,1166 from ../../src/node_dotenv.cc:1:1167../../deps/v8/include/v8-profiler.h: In constructor 'v8::HeapProfiler::HeapSnapshotOptions::HeapSnapshotOptions()':1168../../deps/v8/include/v8-profiler.h:1128:27: warning: 'v8::HeapProfiler::HeapSnapshotOptions::global_object_name_resolver' is deprecated: Use context_name_resolver callback instead. [-Wdeprecated-declarations]1169 1128 | HeapSnapshotOptions() {}1170 | ^1171../../deps/v8/include/v8-profiler.h:1142:25: note: declared here1172 1142 | ObjectNameResolver* global_object_name_resolver = nullptr;1173 | ^~~~~~~~~~~~~~~~~~~~~~~~~~~1174../../deps/v8/include/v8-profiler.h:1128:27: warning: 'v8::HeapProfiler::HeapSnapshotOptions::global_object_name_resolver' is deprecated: Use context_name_resolver callback instead. [-Wdeprecated-declarations]1175 1128 | HeapSnapshotOptions() {}1176 | ^1177../../deps/v8/include/v8-profiler.h:1142:25: note: declared here1178 1142 | ObjectNameResolver* global_object_name_resolver = nullptr;1179 | ^~~~~~~~~~~~~~~~~~~~~~~~~~~1180[189/1871] CXX obj/src/node_base.node_constants.o1181In file included from ../../src/memory_tracker.h:6,1182 from ../../src/aliased_buffer.h:7,1183 from ../../src/aliased_buffer-inl.h:6,1184 from ../../src/env-inl.h:27,1185 from ../../src/node_constants.cc:22:1186../../deps/v8/include/v8-profiler.h: In constructor 'v8::HeapProfiler::HeapSnapshotOptions::HeapSnapshotOptions()':1187../../deps/v8/include/v8-profiler.h:1128:27: warning: 'v8::HeapProfiler::HeapSnapshotOptions::global_object_name_resolver' is deprecated: Use context_name_resolver callback instead. [-Wdeprecated-declarations]1188 1128 | HeapSnapshotOptions() {}1189 | ^1190../../deps/v8/include/v8-profiler.h:1142:25: note: declared here1191 1142 | ObjectNameResolver* global_object_name_resolver = nullptr;1192 | ^~~~~~~~~~~~~~~~~~~~~~~~~~~1193../../deps/v8/include/v8-profiler.h:1128:27: warning: 'v8::HeapProfiler::HeapSnapshotOptions::global_object_name_resolver' is deprecated: Use context_name_resolver callback instead. [-Wdeprecated-declarations]1194 1128 | HeapSnapshotOptions() {}1195 | ^1196../../deps/v8/include/v8-profiler.h:1142:25: note: declared here1197 1142 | ObjectNameResolver* global_object_name_resolver = nullptr;1198 | ^~~~~~~~~~~~~~~~~~~~~~~~~~~1199[190/1871] CXX obj/src/node_base.node_binding.o1200In file included from ../../src/memory_tracker.h:6,1201 from ../../src/aliased_buffer.h:7,1202 from ../../src/aliased_buffer-inl.h:6,1203 from ../../src/env-inl.h:27,1204 from ../../src/node_binding.cc:3:1205../../deps/v8/include/v8-profiler.h: In constructor 'v8::HeapProfiler::HeapSnapshotOptions::HeapSnapshotOptions()':1206../../deps/v8/include/v8-profiler.h:1128:27: warning: 'v8::HeapProfiler::HeapSnapshotOptions::global_object_name_resolver' is deprecated: Use context_name_resolver callback instead. [-Wdeprecated-declarations]1207 1128 | HeapSnapshotOptions() {}1208 | ^1209../../deps/v8/include/v8-profiler.h:1142:25: note: declared here1210 1142 | ObjectNameResolver* global_object_name_resolver = nullptr;1211 | ^~~~~~~~~~~~~~~~~~~~~~~~~~~1212../../deps/v8/include/v8-profiler.h:1128:27: warning: 'v8::HeapProfiler::HeapSnapshotOptions::global_object_name_resolver' is deprecated: Use context_name_resolver callback instead. [-Wdeprecated-declarations]1213 1128 | HeapSnapshotOptions() {}1214 | ^1215../../deps/v8/include/v8-profiler.h:1142:25: note: declared here1216 1142 | ObjectNameResolver* global_object_name_resolver = nullptr;1217 | ^~~~~~~~~~~~~~~~~~~~~~~~~~~1218[191/1871] CXX obj/src/node_base.node_cjs_lexer.o1219In file included from ../../src/memory_tracker.h:6,1220 from ../../src/aliased_buffer.h:7,1221 from ../../src/aliased_buffer-inl.h:6,1222 from ../../src/env-inl.h:27,1223 from ../../src/node_cjs_lexer.cc:1:1224../../deps/v8/include/v8-profiler.h: In constructor 'v8::HeapProfiler::HeapSnapshotOptions::HeapSnapshotOptions()':1225../../deps/v8/include/v8-profiler.h:1128:27: warning: 'v8::HeapProfiler::HeapSnapshotOptions::global_object_name_resolver' is deprecated: Use context_name_resolver callback instead. [-Wdeprecated-declarations]1226 1128 | HeapSnapshotOptions() {}1227 | ^1228../../deps/v8/include/v8-profiler.h:1142:25: note: declared here1229 1142 | ObjectNameResolver* global_object_name_resolver = nullptr;1230 | ^~~~~~~~~~~~~~~~~~~~~~~~~~~1231../../deps/v8/include/v8-profiler.h:1128:27: warning: 'v8::HeapProfiler::HeapSnapshotOptions::global_object_name_resolver' is deprecated: Use context_name_resolver callback instead. [-Wdeprecated-declarations]1232 1128 | HeapSnapshotOptions() {}1233 | ^1234../../deps/v8/include/v8-profiler.h:1142:25: note: declared here1235 1142 | ObjectNameResolver* global_object_name_resolver = nullptr;1236 | ^~~~~~~~~~~~~~~~~~~~~~~~~~~1237[192/1871] CXX obj/src/node_base.node_env_var.o1238In file included from ../../src/memory_tracker.h:6,1239 from ../../src/base_object.h:29,1240 from ../../src/async_wrap.h:27,1241 from ../../src/debug_utils.h:6,1242 from ../../src/debug_utils-inl.h:6,1243 from ../../src/node_env_var.cc:1:1244../../deps/v8/include/v8-profiler.h: In constructor 'v8::HeapProfiler::HeapSnapshotOptions::HeapSnapshotOptions()':1245../../deps/v8/include/v8-profiler.h:1128:27: warning: 'v8::HeapProfiler::HeapSnapshotOptions::global_object_name_resolver' is deprecated: Use context_name_resolver callback instead. [-Wdeprecated-declarations]1246 1128 | HeapSnapshotOptions() {}1247 | ^1248../../deps/v8/include/v8-profiler.h:1142:25: note: declared here1249 1142 | ObjectNameResolver* global_object_name_resolver = nullptr;1250 | ^~~~~~~~~~~~~~~~~~~~~~~~~~~1251../../deps/v8/include/v8-profiler.h:1128:27: warning: 'v8::HeapProfiler::HeapSnapshotOptions::global_object_name_resolver' is deprecated: Use context_name_resolver callback instead. [-Wdeprecated-declarations]1252 1128 | HeapSnapshotOptions() {}1253 | ^1254../../deps/v8/include/v8-profiler.h:1142:25: note: declared here1255 1142 | ObjectNameResolver* global_object_name_resolver = nullptr;1256 | ^~~~~~~~~~~~~~~~~~~~~~~~~~~1257[193/1871] CXX obj/src/node_base.node_http_parser.o1258In file included from ../../src/util.h:29,1259 from ../../src/node_http_parser.cc:24:1260../../deps/v8/include/v8-profiler.h: In constructor 'v8::HeapProfiler::HeapSnapshotOptions::HeapSnapshotOptions()':1261../../deps/v8/include/v8-profiler.h:1128:27: warning: 'v8::HeapProfiler::HeapSnapshotOptions::global_object_name_resolver' is deprecated: Use context_name_resolver callback instead. [-Wdeprecated-declarations]1262 1128 | HeapSnapshotOptions() {}1263 | ^1264../../deps/v8/include/v8-profiler.h:1142:25: note: declared here1265 1142 | ObjectNameResolver* global_object_name_resolver = nullptr;1266 | ^~~~~~~~~~~~~~~~~~~~~~~~~~~1267../../deps/v8/include/v8-profiler.h:1128:27: warning: 'v8::HeapProfiler::HeapSnapshotOptions::global_object_name_resolver' is deprecated: Use context_name_resolver callback instead. [-Wdeprecated-declarations]1268 1128 | HeapSnapshotOptions() {}1269 | ^1270../../deps/v8/include/v8-profiler.h:1142:25: note: declared here1271 1142 | ObjectNameResolver* global_object_name_resolver = nullptr;1272 | ^~~~~~~~~~~~~~~~~~~~~~~~~~~1273[194/1871] CXX obj/src/node_base.node_external_reference.o1274In file included from ../../src/memory_tracker.h:6,1275 from ../../src/base_object.h:29,1276 from ../../src/base_object-inl.h:27,1277 from ../../src/node_external_reference.cc:4:1278../../deps/v8/include/v8-profiler.h: In constructor 'v8::HeapProfiler::HeapSnapshotOptions::HeapSnapshotOptions()':1279../../deps/v8/include/v8-profiler.h:1128:27: warning: 'v8::HeapProfiler::HeapSnapshotOptions::global_object_name_resolver' is deprecated: Use context_name_resolver callback instead. [-Wdeprecated-declarations]1280 1128 | HeapSnapshotOptions() {}1281 | ^1282../../deps/v8/include/v8-profiler.h:1142:25: note: declared here1283 1142 | ObjectNameResolver* global_object_name_resolver = nullptr;1284 | ^~~~~~~~~~~~~~~~~~~~~~~~~~~1285../../deps/v8/include/v8-profiler.h:1128:27: warning: 'v8::HeapProfiler::HeapSnapshotOptions::global_object_name_resolver' is deprecated: Use context_name_resolver callback instead. [-Wdeprecated-declarations]1286 1128 | HeapSnapshotOptions() {}1287 | ^1288../../deps/v8/include/v8-profiler.h:1142:25: note: declared here1289 1142 | ObjectNameResolver* global_object_name_resolver = nullptr;1290 | ^~~~~~~~~~~~~~~~~~~~~~~~~~~1291[195/1871] CXX obj/deps/v8/src/torque/torque_base.torque-parser.o1292[196/1871] CXX obj/src/node_base.node_blob.o1293In file included from ../../src/memory_tracker.h:6,1294 from ../../src/base_object.h:29,1295 from ../../src/async_wrap.h:27,1296 from ../../src/node_blob.h:8,1297 from ../../src/node_blob.cc:1:1298../../deps/v8/include/v8-profiler.h: In constructor 'v8::HeapProfiler::HeapSnapshotOptions::HeapSnapshotOptions()':1299../../deps/v8/include/v8-profiler.h:1128:27: warning: 'v8::HeapProfiler::HeapSnapshotOptions::global_object_name_resolver' is deprecated: Use context_name_resolver callback instead. [-Wdeprecated-declarations]1300 1128 | HeapSnapshotOptions() {}1301 | ^1302../../deps/v8/include/v8-profiler.h:1142:25: note: declared here1303 1142 | ObjectNameResolver* global_object_name_resolver = nullptr;1304 | ^~~~~~~~~~~~~~~~~~~~~~~~~~~1305../../deps/v8/include/v8-profiler.h:1128:27: warning: 'v8::HeapProfiler::HeapSnapshotOptions::global_object_name_resolver' is deprecated: Use context_name_resolver callback instead. [-Wdeprecated-declarations]1306 1128 | HeapSnapshotOptions() {}1307 | ^1308../../deps/v8/include/v8-profiler.h:1142:25: note: declared here1309 1142 | ObjectNameResolver* global_object_name_resolver = nullptr;1310 | ^~~~~~~~~~~~~~~~~~~~~~~~~~~1311[197/1871] CXX obj/src/node_base.node_buffer.o1312In file included from ../../src/memory_tracker.h:6,1313 from ../../src/base_object.h:29,1314 from ../../src/async_wrap.h:27,1315 from ../../src/node_blob.h:8,1316 from ../../src/node_buffer.cc:24:1317../../deps/v8/include/v8-profiler.h: In constructor 'v8::HeapProfiler::HeapSnapshotOptions::HeapSnapshotOptions()':1318../../deps/v8/include/v8-profiler.h:1128:27: warning: 'v8::HeapProfiler::HeapSnapshotOptions::global_object_name_resolver' is deprecated: Use context_name_resolver callback instead. [-Wdeprecated-declarations]1319 1128 | HeapSnapshotOptions() {}1320 | ^1321../../deps/v8/include/v8-profiler.h:1142:25: note: declared here1322 1142 | ObjectNameResolver* global_object_name_resolver = nullptr;1323 | ^~~~~~~~~~~~~~~~~~~~~~~~~~~1324../../deps/v8/include/v8-profiler.h:1128:27: warning: 'v8::HeapProfiler::HeapSnapshotOptions::global_object_name_resolver' is deprecated: Use context_name_resolver callback instead. [-Wdeprecated-declarations]1325 1128 | HeapSnapshotOptions() {}1326 | ^1327../../deps/v8/include/v8-profiler.h:1142:25: note: declared here1328 1142 | ObjectNameResolver* global_object_name_resolver = nullptr;1329 | ^~~~~~~~~~~~~~~~~~~~~~~~~~~1330[198/1871] AR obj/tools/v8_gypfiles/libtorque_base.a1331[199/1871] STAMP obj/tools/v8_gypfiles/torque.actions_depends.stamp1332[200/1871] CXX obj/src/node_base.node_builtins.o1333In file included from ../../src/util.h:29,1334 from ../../src/node_mutex.h:6,1335 from ../../src/node_builtins.h:16,1336 from ../../src/node_builtins.cc:1:1337../../deps/v8/include/v8-profiler.h: In constructor 'v8::HeapProfiler::HeapSnapshotOptions::HeapSnapshotOptions()':1338../../deps/v8/include/v8-profiler.h:1128:27: warning: 'v8::HeapProfiler::HeapSnapshotOptions::global_object_name_resolver' is deprecated: Use context_name_resolver callback instead. [-Wdeprecated-declarations]1339 1128 | HeapSnapshotOptions() {}1340 | ^1341../../deps/v8/include/v8-profiler.h:1142:25: note: declared here1342 1142 | ObjectNameResolver* global_object_name_resolver = nullptr;1343 | ^~~~~~~~~~~~~~~~~~~~~~~~~~~1344../../deps/v8/include/v8-profiler.h:1128:27: warning: 'v8::HeapProfiler::HeapSnapshotOptions::global_object_name_resolver' is deprecated: Use context_name_resolver callback instead. [-Wdeprecated-declarations]1345 1128 | HeapSnapshotOptions() {}1346 | ^1347../../deps/v8/include/v8-profiler.h:1142:25: note: declared here1348 1142 | ObjectNameResolver* global_object_name_resolver = nullptr;1349 | ^~~~~~~~~~~~~~~~~~~~~~~~~~~1350[201/1871] CXX obj/src/node_base.node_profiling.o1351In file included from ../../src/node_profiling.h:6,1352 from ../../src/node_profiling.cc:1:1353../../deps/v8/include/v8-profiler.h: In constructor 'v8::HeapProfiler::HeapSnapshotOptions::HeapSnapshotOptions()':1354../../deps/v8/include/v8-profiler.h:1128:27: warning: 'v8::HeapProfiler::HeapSnapshotOptions::global_object_name_resolver' is deprecated: Use context_name_resolver callback instead. [-Wdeprecated-declarations]1355 1128 | HeapSnapshotOptions() {}1356 | ^1357../../deps/v8/include/v8-profiler.h:1142:25: note: declared here1358 1142 | ObjectNameResolver* global_object_name_resolver = nullptr;1359 | ^~~~~~~~~~~~~~~~~~~~~~~~~~~1360../../deps/v8/include/v8-profiler.h:1128:27: warning: 'v8::HeapProfiler::HeapSnapshotOptions::global_object_name_resolver' is deprecated: Use context_name_resolver callback instead. [-Wdeprecated-declarations]1361 1128 | HeapSnapshotOptions() {}1362 | ^1363../../deps/v8/include/v8-profiler.h:1142:25: note: declared here1364 1142 | ObjectNameResolver* global_object_name_resolver = nullptr;1365 | ^~~~~~~~~~~~~~~~~~~~~~~~~~~1366[202/1871] CXX obj/src/node_base.node_errors.o1367In file included from ../../src/memory_tracker.h:6,1368 from ../../src/base_object.h:29,1369 from ../../src/async_wrap.h:27,1370 from ../../src/debug_utils.h:6,1371 from ../../src/debug_utils-inl.h:6,1372 from ../../src/node_errors.cc:6:1373../../deps/v8/include/v8-profiler.h: In constructor 'v8::HeapProfiler::HeapSnapshotOptions::HeapSnapshotOptions()':1374../../deps/v8/include/v8-profiler.h:1128:27: warning: 'v8::HeapProfiler::HeapSnapshotOptions::global_object_name_resolver' is deprecated: Use context_name_resolver callback instead. [-Wdeprecated-declarations]1375 1128 | HeapSnapshotOptions() {}1376 | ^1377../../deps/v8/include/v8-profiler.h:1142:25: note: declared here1378 1142 | ObjectNameResolver* global_object_name_resolver = nullptr;1379 | ^~~~~~~~~~~~~~~~~~~~~~~~~~~1380../../deps/v8/include/v8-profiler.h:1128:27: warning: 'v8::HeapProfiler::HeapSnapshotOptions::global_object_name_resolver' is deprecated: Use context_name_resolver callback instead. [-Wdeprecated-declarations]1381 1128 | HeapSnapshotOptions() {}1382 | ^1383../../deps/v8/include/v8-profiler.h:1142:25: note: declared here1384 1142 | ObjectNameResolver* global_object_name_resolver = nullptr;1385 | ^~~~~~~~~~~~~~~~~~~~~~~~~~~1386[203/1871] LINK torque1387[204/1871] CXX obj/src/node_base.node_i18n.o1388In file included from ../../src/memory_tracker.h:6,1389 from ../../src/base_object.h:29,1390 from ../../src/node_i18n.h:29,1391 from ../../src/node_i18n.cc:43:1392../../deps/v8/include/v8-profiler.h: In constructor 'v8::HeapProfiler::HeapSnapshotOptions::HeapSnapshotOptions()':1393../../deps/v8/include/v8-profiler.h:1128:27: warning: 'v8::HeapProfiler::HeapSnapshotOptions::global_object_name_resolver' is deprecated: Use context_name_resolver callback instead. [-Wdeprecated-declarations]1394 1128 | HeapSnapshotOptions() {}1395 | ^1396../../deps/v8/include/v8-profiler.h:1142:25: note: declared here1397 1142 | ObjectNameResolver* global_object_name_resolver = nullptr;1398 | ^~~~~~~~~~~~~~~~~~~~~~~~~~~1399../../deps/v8/include/v8-profiler.h:1128:27: warning: 'v8::HeapProfiler::HeapSnapshotOptions::global_object_name_resolver' is deprecated: Use context_name_resolver callback instead. [-Wdeprecated-declarations]1400 1128 | HeapSnapshotOptions() {}1401 | ^1402../../deps/v8/include/v8-profiler.h:1142:25: note: declared here1403 1142 | ObjectNameResolver* global_object_name_resolver = nullptr;1404 | ^~~~~~~~~~~~~~~~~~~~~~~~~~~1405[205/1871] CXX obj/deps/v8/third_party/simdutf/simdutf.simdutf.o1406[206/1871] AR obj/tools/v8_gypfiles/libsimdutf.a1407[207/1871] CXX obj/src/node_base.node_ipc_serdes.o1408In file included from ../../src/memory_tracker.h:6,1409 from ../../src/aliased_buffer.h:7,1410 from ../../src/aliased_buffer-inl.h:6,1411 from ../../src/env-inl.h:27,1412 from ../../src/node_ipc_serdes.cc:1:1413../../deps/v8/include/v8-profiler.h: In constructor 'v8::HeapProfiler::HeapSnapshotOptions::HeapSnapshotOptions()':1414../../deps/v8/include/v8-profiler.h:1128:27: warning: 'v8::HeapProfiler::HeapSnapshotOptions::global_object_name_resolver' is deprecated: Use context_name_resolver callback instead. [-Wdeprecated-declarations]1415 1128 | HeapSnapshotOptions() {}1416 | ^1417../../deps/v8/include/v8-profiler.h:1142:25: note: declared here1418 1142 | ObjectNameResolver* global_object_name_resolver = nullptr;1419 | ^~~~~~~~~~~~~~~~~~~~~~~~~~~1420../../deps/v8/include/v8-profiler.h:1128:27: warning: 'v8::HeapProfiler::HeapSnapshotOptions::global_object_name_resolver' is deprecated: Use context_name_resolver callback instead. [-Wdeprecated-declarations]1421 1128 | HeapSnapshotOptions() {}1422 | ^1423../../deps/v8/include/v8-profiler.h:1142:25: note: declared here1424 1142 | ObjectNameResolver* global_object_name_resolver = nullptr;1425 | ^~~~~~~~~~~~~~~~~~~~~~~~~~~1426[208/1871] CXX obj/src/node_base.node_contextify.o1427In file included from ../../src/memory_tracker.h:6,1428 from ../../src/base_object.h:29,1429 from ../../src/base_object-inl.h:27,1430 from ../../src/node_contextify.h:6,1431 from ../../src/node_contextify.cc:22:1432../../deps/v8/include/v8-profiler.h: In constructor 'v8::HeapProfiler::HeapSnapshotOptions::HeapSnapshotOptions()':1433../../deps/v8/include/v8-profiler.h:1128:27: warning: 'v8::HeapProfiler::HeapSnapshotOptions::global_object_name_resolver' is deprecated: Use context_name_resolver callback instead. [-Wdeprecated-declarations]1434 1128 | HeapSnapshotOptions() {}1435 | ^1436../../deps/v8/include/v8-profiler.h:1142:25: note: declared here1437 1142 | ObjectNameResolver* global_object_name_resolver = nullptr;1438 | ^~~~~~~~~~~~~~~~~~~~~~~~~~~1439../../deps/v8/include/v8-profiler.h:1128:27: warning: 'v8::HeapProfiler::HeapSnapshotOptions::global_object_name_resolver' is deprecated: Use context_name_resolver callback instead. [-Wdeprecated-declarations]1440 1128 | HeapSnapshotOptions() {}1441 | ^1442../../deps/v8/include/v8-profiler.h:1142:25: note: declared here1443 1142 | ObjectNameResolver* global_object_name_resolver = nullptr;1444 | ^~~~~~~~~~~~~~~~~~~~~~~~~~~1445[209/1871] CXX obj/src/node_base.node_locks.o1446In file included from ../../src/memory_tracker.h:6,1447 from ../../src/base_object.h:29,1448 from ../../src/node_locks.h:11,1449 from ../../src/node_locks.cc:1:1450../../deps/v8/include/v8-profiler.h: In constructor 'v8::HeapProfiler::HeapSnapshotOptions::HeapSnapshotOptions()':1451../../deps/v8/include/v8-profiler.h:1128:27: warning: 'v8::HeapProfiler::HeapSnapshotOptions::global_object_name_resolver' is deprecated: Use context_name_resolver callback instead. [-Wdeprecated-declarations]1452 1128 | HeapSnapshotOptions() {}1453 | ^1454../../deps/v8/include/v8-profiler.h:1142:25: note: declared here1455 1142 | ObjectNameResolver* global_object_name_resolver = nullptr;1456 | ^~~~~~~~~~~~~~~~~~~~~~~~~~~1457../../deps/v8/include/v8-profiler.h:1128:27: warning: 'v8::HeapProfiler::HeapSnapshotOptions::global_object_name_resolver' is deprecated: Use context_name_resolver callback instead. [-Wdeprecated-declarations]1458 1128 | HeapSnapshotOptions() {}1459 | ^1460../../deps/v8/include/v8-profiler.h:1142:25: note: declared here1461 1142 | ObjectNameResolver* global_object_name_resolver = nullptr;1462 | ^~~~~~~~~~~~~~~~~~~~~~~~~~~1463[210/1871] CXX obj/src/node_base.node_main_instance.o1464In file included from ../../src/util.h:29,1465 from ../../src/node_main_instance.h:11,1466 from ../../src/node_main_instance.cc:1:1467../../deps/v8/include/v8-profiler.h: In constructor 'v8::HeapProfiler::HeapSnapshotOptions::HeapSnapshotOptions()':1468../../deps/v8/include/v8-profiler.h:1128:27: warning: 'v8::HeapProfiler::HeapSnapshotOptions::global_object_name_resolver' is deprecated: Use context_name_resolver callback instead. [-Wdeprecated-declarations]1469 1128 | HeapSnapshotOptions() {}1470 | ^1471../../deps/v8/include/v8-profiler.h:1142:25: note: declared here1472 1142 | ObjectNameResolver* global_object_name_resolver = nullptr;1473 | ^~~~~~~~~~~~~~~~~~~~~~~~~~~1474../../deps/v8/include/v8-profiler.h:1128:27: warning: 'v8::HeapProfiler::HeapSnapshotOptions::global_object_name_resolver' is deprecated: Use context_name_resolver callback instead. [-Wdeprecated-declarations]1475 1128 | HeapSnapshotOptions() {}1476 | ^1477../../deps/v8/include/v8-profiler.h:1142:25: note: declared here1478 1142 | ObjectNameResolver* global_object_name_resolver = nullptr;1479 | ^~~~~~~~~~~~~~~~~~~~~~~~~~~1480[211/1871] CXX obj/src/node_base.node_metadata.o1481In file included from ../../src/util.h:29,1482 from ../../src/node_metadata.cc:22:1483../../deps/v8/include/v8-profiler.h: In constructor 'v8::HeapProfiler::HeapSnapshotOptions::HeapSnapshotOptions()':1484../../deps/v8/include/v8-profiler.h:1128:27: warning: 'v8::HeapProfiler::HeapSnapshotOptions::global_object_name_resolver' is deprecated: Use context_name_resolver callback instead. [-Wdeprecated-declarations]1485 1128 | HeapSnapshotOptions() {}1486 | ^1487../../deps/v8/include/v8-profiler.h:1142:25: note: declared here1488 1142 | ObjectNameResolver* global_object_name_resolver = nullptr;1489 | ^~~~~~~~~~~~~~~~~~~~~~~~~~~1490../../deps/v8/include/v8-profiler.h:1128:27: warning: 'v8::HeapProfiler::HeapSnapshotOptions::global_object_name_resolver' is deprecated: Use context_name_resolver callback instead. [-Wdeprecated-declarations]1491 1128 | HeapSnapshotOptions() {}1492 | ^1493../../deps/v8/include/v8-profiler.h:1142:25: note: declared here1494 1142 | ObjectNameResolver* global_object_name_resolver = nullptr;1495 | ^~~~~~~~~~~~~~~~~~~~~~~~~~~1496[212/1871] CXX obj/src/node_base.node_diagnostics_channel.o1497In file included from ../../src/memory_tracker.h:6,1498 from ../../src/aliased_buffer.h:7,1499 from ../../src/node_diagnostics_channel.h:11,1500 from ../../src/node_diagnostics_channel.cc:1:1501../../deps/v8/include/v8-profiler.h: In constructor 'v8::HeapProfiler::HeapSnapshotOptions::HeapSnapshotOptions()':1502../../deps/v8/include/v8-profiler.h:1128:27: warning: 'v8::HeapProfiler::HeapSnapshotOptions::global_object_name_resolver' is deprecated: Use context_name_resolver callback instead. [-Wdeprecated-declarations]1503 1128 | HeapSnapshotOptions() {}1504 | ^1505../../deps/v8/include/v8-profiler.h:1142:25: note: declared here1506 1142 | ObjectNameResolver* global_object_name_resolver = nullptr;1507 | ^~~~~~~~~~~~~~~~~~~~~~~~~~~1508../../deps/v8/include/v8-profiler.h:1128:27: warning: 'v8::HeapProfiler::HeapSnapshotOptions::global_object_name_resolver' is deprecated: Use context_name_resolver callback instead. [-Wdeprecated-declarations]1509 1128 | HeapSnapshotOptions() {}1510 | ^1511../../deps/v8/include/v8-profiler.h:1142:25: note: declared here1512 1142 | ObjectNameResolver* global_object_name_resolver = nullptr;1513 | ^~~~~~~~~~~~~~~~~~~~~~~~~~~1514[213/1871] CXX obj/src/node_base.node_os.o1515In file included from ../../src/memory_tracker.h:6,1516 from ../../src/aliased_buffer.h:7,1517 from ../../src/aliased_buffer-inl.h:6,1518 from ../../src/env-inl.h:27,1519 from ../../src/node_os.cc:22:1520../../deps/v8/include/v8-profiler.h: In constructor 'v8::HeapProfiler::HeapSnapshotOptions::HeapSnapshotOptions()':1521../../deps/v8/include/v8-profiler.h:1128:27: warning: 'v8::HeapProfiler::HeapSnapshotOptions::global_object_name_resolver' is deprecated: Use context_name_resolver callback instead. [-Wdeprecated-declarations]1522 1128 | HeapSnapshotOptions() {}1523 | ^1524../../deps/v8/include/v8-profiler.h:1142:25: note: declared here1525 1142 | ObjectNameResolver* global_object_name_resolver = nullptr;1526 | ^~~~~~~~~~~~~~~~~~~~~~~~~~~1527../../deps/v8/include/v8-profiler.h:1128:27: warning: 'v8::HeapProfiler::HeapSnapshotOptions::global_object_name_resolver' is deprecated: Use context_name_resolver callback instead. [-Wdeprecated-declarations]1528 1128 | HeapSnapshotOptions() {}1529 | ^1530../../deps/v8/include/v8-profiler.h:1142:25: note: declared here1531 1142 | ObjectNameResolver* global_object_name_resolver = nullptr;1532 | ^~~~~~~~~~~~~~~~~~~~~~~~~~~1533[214/1871] CXX obj/src/node_base.node_perf.o1534In file included from ../../src/memory_tracker.h:6,1535 from ../../src/base_object.h:29,1536 from ../../src/base_object-inl.h:27,1537 from ../../src/node_perf.h:6,1538 from ../../src/node_perf.cc:1:1539../../deps/v8/include/v8-profiler.h: In constructor 'v8::HeapProfiler::HeapSnapshotOptions::HeapSnapshotOptions()':1540../../deps/v8/include/v8-profiler.h:1128:27: warning: 'v8::HeapProfiler::HeapSnapshotOptions::global_object_name_resolver' is deprecated: Use context_name_resolver callback instead. [-Wdeprecated-declarations]1541 1128 | HeapSnapshotOptions() {}1542 | ^1543../../deps/v8/include/v8-profiler.h:1142:25: note: declared here1544 1142 | ObjectNameResolver* global_object_name_resolver = nullptr;1545 | ^~~~~~~~~~~~~~~~~~~~~~~~~~~1546../../deps/v8/include/v8-profiler.h:1128:27: warning: 'v8::HeapProfiler::HeapSnapshotOptions::global_object_name_resolver' is deprecated: Use context_name_resolver callback instead. [-Wdeprecated-declarations]1547 1128 | HeapSnapshotOptions() {}1548 | ^1549../../deps/v8/include/v8-profiler.h:1142:25: note: declared here1550 1142 | ObjectNameResolver* global_object_name_resolver = nullptr;1551 | ^~~~~~~~~~~~~~~~~~~~~~~~~~~1552[215/1871] CXX obj/src/node_base.node_messaging.o1553In file included from ../../src/memory_tracker.h:6,1554 from ../../src/aliased_buffer.h:7,1555 from ../../src/env.h:27,1556 from ../../src/node_messaging.h:6,1557 from ../../src/node_messaging.cc:1:1558../../deps/v8/include/v8-profiler.h: In constructor 'v8::HeapProfiler::HeapSnapshotOptions::HeapSnapshotOptions()':1559../../deps/v8/include/v8-profiler.h:1128:27: warning: 'v8::HeapProfiler::HeapSnapshotOptions::global_object_name_resolver' is deprecated: Use context_name_resolver callback instead. [-Wdeprecated-declarations]1560 1128 | HeapSnapshotOptions() {}1561 | ^1562../../deps/v8/include/v8-profiler.h:1142:25: note: declared here1563 1142 | ObjectNameResolver* global_object_name_resolver = nullptr;1564 | ^~~~~~~~~~~~~~~~~~~~~~~~~~~1565../../deps/v8/include/v8-profiler.h:1128:27: warning: 'v8::HeapProfiler::HeapSnapshotOptions::global_object_name_resolver' is deprecated: Use context_name_resolver callback instead. [-Wdeprecated-declarations]1566 1128 | HeapSnapshotOptions() {}1567 | ^1568../../deps/v8/include/v8-profiler.h:1142:25: note: declared here1569 1142 | ObjectNameResolver* global_object_name_resolver = nullptr;1570 | ^~~~~~~~~~~~~~~~~~~~~~~~~~~1571[216/1871] CXX obj/src/node_base.node_process_events.o1572In file included from ../../src/memory_tracker.h:6,1573 from ../../src/aliased_buffer.h:7,1574 from ../../src/aliased_buffer-inl.h:6,1575 from ../../src/env-inl.h:27,1576 from ../../src/node_process_events.cc:3:1577../../deps/v8/include/v8-profiler.h: In constructor 'v8::HeapProfiler::HeapSnapshotOptions::HeapSnapshotOptions()':1578../../deps/v8/include/v8-profiler.h:1128:27: warning: 'v8::HeapProfiler::HeapSnapshotOptions::global_object_name_resolver' is deprecated: Use context_name_resolver callback instead. [-Wdeprecated-declarations]1579 1128 | HeapSnapshotOptions() {}1580 | ^1581../../deps/v8/include/v8-profiler.h:1142:25: note: declared here1582 1142 | ObjectNameResolver* global_object_name_resolver = nullptr;1583 | ^~~~~~~~~~~~~~~~~~~~~~~~~~~1584../../deps/v8/include/v8-profiler.h:1128:27: warning: 'v8::HeapProfiler::HeapSnapshotOptions::global_object_name_resolver' is deprecated: Use context_name_resolver callback instead. [-Wdeprecated-declarations]1585 1128 | HeapSnapshotOptions() {}1586 | ^1587../../deps/v8/include/v8-profiler.h:1142:25: note: declared here1588 1142 | ObjectNameResolver* global_object_name_resolver = nullptr;1589 | ^~~~~~~~~~~~~~~~~~~~~~~~~~~1590[217/1871] CXX obj/src/node_base.node_postmortem_metadata.o1591In file included from ../../src/memory_tracker.h:6,1592 from ../../src/base_object.h:29,1593 from ../../src/base_object-inl.h:27,1594 from ../../src/node_postmortem_metadata.cc:1:1595../../deps/v8/include/v8-profiler.h: In constructor 'v8::HeapProfiler::HeapSnapshotOptions::HeapSnapshotOptions()':1596../../deps/v8/include/v8-profiler.h:1128:27: warning: 'v8::HeapProfiler::HeapSnapshotOptions::global_object_name_resolver' is deprecated: Use context_name_resolver callback instead. [-Wdeprecated-declarations]1597 1128 | HeapSnapshotOptions() {}1598 | ^1599../../deps/v8/include/v8-profiler.h:1142:25: note: declared here1600 1142 | ObjectNameResolver* global_object_name_resolver = nullptr;1601 | ^~~~~~~~~~~~~~~~~~~~~~~~~~~1602../../deps/v8/include/v8-profiler.h:1128:27: warning: 'v8::HeapProfiler::HeapSnapshotOptions::global_object_name_resolver' is deprecated: Use context_name_resolver callback instead. [-Wdeprecated-declarations]1603 1128 | HeapSnapshotOptions() {}1604 | ^1605../../deps/v8/include/v8-profiler.h:1142:25: note: declared here1606 1142 | ObjectNameResolver* global_object_name_resolver = nullptr;1607 | ^~~~~~~~~~~~~~~~~~~~~~~~~~~1608[218/1871] CXX obj/src/node_base.node_process_object.o1609In file included from ../../src/memory_tracker.h:6,1610 from ../../src/aliased_buffer.h:7,1611 from ../../src/aliased_buffer-inl.h:6,1612 from ../../src/env-inl.h:27,1613 from ../../src/node_process_object.cc:1:1614../../deps/v8/include/v8-profiler.h: In constructor 'v8::HeapProfiler::HeapSnapshotOptions::HeapSnapshotOptions()':1615../../deps/v8/include/v8-profiler.h:1128:27: warning: 'v8::HeapProfiler::HeapSnapshotOptions::global_object_name_resolver' is deprecated: Use context_name_resolver callback instead. [-Wdeprecated-declarations]1616 1128 | HeapSnapshotOptions() {}1617 | ^1618../../deps/v8/include/v8-profiler.h:1142:25: note: declared here1619 1142 | ObjectNameResolver* global_object_name_resolver = nullptr;1620 | ^~~~~~~~~~~~~~~~~~~~~~~~~~~1621../../deps/v8/include/v8-profiler.h:1128:27: warning: 'v8::HeapProfiler::HeapSnapshotOptions::global_object_name_resolver' is deprecated: Use context_name_resolver callback instead. [-Wdeprecated-declarations]1622 1128 | HeapSnapshotOptions() {}1623 | ^1624../../deps/v8/include/v8-profiler.h:1142:25: note: declared here1625 1142 | ObjectNameResolver* global_object_name_resolver = nullptr;1626 | ^~~~~~~~~~~~~~~~~~~~~~~~~~~1627[219/1871] CXX obj/src/node_base.node_report_module.o1628In file included from ../../src/memory_tracker.h:6,1629 from ../../src/aliased_buffer.h:7,1630 from ../../src/env.h:27,1631 from ../../src/node_report_module.cc:1:1632../../deps/v8/include/v8-profiler.h: In constructor 'v8::HeapProfiler::HeapSnapshotOptions::HeapSnapshotOptions()':1633../../deps/v8/include/v8-profiler.h:1128:27: warning: 'v8::HeapProfiler::HeapSnapshotOptions::global_object_name_resolver' is deprecated: Use context_name_resolver callback instead. [-Wdeprecated-declarations]1634 1128 | HeapSnapshotOptions() {}1635 | ^1636../../deps/v8/include/v8-profiler.h:1142:25: note: declared here1637 1142 | ObjectNameResolver* global_object_name_resolver = nullptr;1638 | ^~~~~~~~~~~~~~~~~~~~~~~~~~~1639../../deps/v8/include/v8-profiler.h:1128:27: warning: 'v8::HeapProfiler::HeapSnapshotOptions::global_object_name_resolver' is deprecated: Use context_name_resolver callback instead. [-Wdeprecated-declarations]1640 1128 | HeapSnapshotOptions() {}1641 | ^1642../../deps/v8/include/v8-profiler.h:1142:25: note: declared here1643 1142 | ObjectNameResolver* global_object_name_resolver = nullptr;1644 | ^~~~~~~~~~~~~~~~~~~~~~~~~~~1645[220/1871] CXX obj/src/node_base.node_report_utils.o1646In file included from ../../src/memory_tracker.h:6,1647 from ../../src/aliased_buffer.h:7,1648 from ../../src/env.h:27,1649 from ../../src/node_internals.h:27,1650 from ../../src/node_report_utils.cc:2:1651../../deps/v8/include/v8-profiler.h: In constructor 'v8::HeapProfiler::HeapSnapshotOptions::HeapSnapshotOptions()':1652../../deps/v8/include/v8-profiler.h:1128:27: warning: 'v8::HeapProfiler::HeapSnapshotOptions::global_object_name_resolver' is deprecated: Use context_name_resolver callback instead. [-Wdeprecated-declarations]1653 1128 | HeapSnapshotOptions() {}1654 | ^1655../../deps/v8/include/v8-profiler.h:1142:25: note: declared here1656 1142 | ObjectNameResolver* global_object_name_resolver = nullptr;1657 | ^~~~~~~~~~~~~~~~~~~~~~~~~~~1658../../deps/v8/include/v8-profiler.h:1128:27: warning: 'v8::HeapProfiler::HeapSnapshotOptions::global_object_name_resolver' is deprecated: Use context_name_resolver callback instead. [-Wdeprecated-declarations]1659 1128 | HeapSnapshotOptions() {}1660 | ^1661../../deps/v8/include/v8-profiler.h:1142:25: note: declared here1662 1142 | ObjectNameResolver* global_object_name_resolver = nullptr;1663 | ^~~~~~~~~~~~~~~~~~~~~~~~~~~1664[221/1871] CXX obj/src/node_base.node_platform.o1665In file included from ../../src/util.h:29,1666 from ../../src/node_mutex.h:6,1667 from ../../src/node_platform.h:15,1668 from ../../src/node_platform.cc:1:1669../../deps/v8/include/v8-profiler.h: In constructor 'v8::HeapProfiler::HeapSnapshotOptions::HeapSnapshotOptions()':1670../../deps/v8/include/v8-profiler.h:1128:27: warning: 'v8::HeapProfiler::HeapSnapshotOptions::global_object_name_resolver' is deprecated: Use context_name_resolver callback instead. [-Wdeprecated-declarations]1671 1128 | HeapSnapshotOptions() {}1672 | ^1673../../deps/v8/include/v8-profiler.h:1142:25: note: declared here1674 1142 | ObjectNameResolver* global_object_name_resolver = nullptr;1675 | ^~~~~~~~~~~~~~~~~~~~~~~~~~~1676../../deps/v8/include/v8-profiler.h:1128:27: warning: 'v8::HeapProfiler::HeapSnapshotOptions::global_object_name_resolver' is deprecated: Use context_name_resolver callback instead. [-Wdeprecated-declarations]1677 1128 | HeapSnapshotOptions() {}1678 | ^1679../../deps/v8/include/v8-profiler.h:1142:25: note: declared here1680 1142 | ObjectNameResolver* global_object_name_resolver = nullptr;1681 | ^~~~~~~~~~~~~~~~~~~~~~~~~~~1682[222/1871] CXX obj/src/node_base.node_process_methods.o1683In file included from ../../src/memory_tracker.h:6,1684 from ../../src/base_object.h:29,1685 from ../../src/async_wrap.h:27,1686 from ../../src/async_wrap-inl.h:27,1687 from ../../src/node_process_methods.cc:1:1688../../deps/v8/include/v8-profiler.h: In constructor 'v8::HeapProfiler::HeapSnapshotOptions::HeapSnapshotOptions()':1689../../deps/v8/include/v8-profiler.h:1128:27: warning: 'v8::HeapProfiler::HeapSnapshotOptions::global_object_name_resolver' is deprecated: Use context_name_resolver callback instead. [-Wdeprecated-declarations]1690 1128 | HeapSnapshotOptions() {}1691 | ^1692../../deps/v8/include/v8-profiler.h:1142:25: note: declared here1693 1142 | ObjectNameResolver* global_object_name_resolver = nullptr;1694 | ^~~~~~~~~~~~~~~~~~~~~~~~~~~1695../../deps/v8/include/v8-profiler.h:1128:27: warning: 'v8::HeapProfiler::HeapSnapshotOptions::global_object_name_resolver' is deprecated: Use context_name_resolver callback instead. [-Wdeprecated-declarations]1696 1128 | HeapSnapshotOptions() {}1697 | ^1698../../deps/v8/include/v8-profiler.h:1142:25: note: declared here1699 1142 | ObjectNameResolver* global_object_name_resolver = nullptr;1700 | ^~~~~~~~~~~~~~~~~~~~~~~~~~~1701[223/1871] CXX obj/src/node_base.node_modules.o1702In file included from ../../src/memory_tracker.h:6,1703 from ../../src/aliased_buffer.h:7,1704 from ../../src/node_snapshotable.h:7,1705 from ../../src/node_modules.h:7,1706 from ../../src/node_modules.cc:1:1707../../deps/v8/include/v8-profiler.h: In constructor 'v8::HeapProfiler::HeapSnapshotOptions::HeapSnapshotOptions()':1708../../deps/v8/include/v8-profiler.h:1128:27: warning: 'v8::HeapProfiler::HeapSnapshotOptions::global_object_name_resolver' is deprecated: Use context_name_resolver callback instead. [-Wdeprecated-declarations]1709 1128 | HeapSnapshotOptions() {}1710 | ^1711../../deps/v8/include/v8-profiler.h:1142:25: note: declared here1712 1142 | ObjectNameResolver* global_object_name_resolver = nullptr;1713 | ^~~~~~~~~~~~~~~~~~~~~~~~~~~1714../../deps/v8/include/v8-profiler.h:1128:27: warning: 'v8::HeapProfiler::HeapSnapshotOptions::global_object_name_resolver' is deprecated: Use context_name_resolver callback instead. [-Wdeprecated-declarations]1715 1128 | HeapSnapshotOptions() {}1716 | ^1717../../deps/v8/include/v8-profiler.h:1142:25: note: declared here1718 1142 | ObjectNameResolver* global_object_name_resolver = nullptr;1719 | ^~~~~~~~~~~~~~~~~~~~~~~~~~~1720[224/1871] CXX obj/src/node_base.node_realm.o1721In file included from ../../src/memory_tracker.h:6,1722 from ../../src/cleanup_queue.h:11,1723 from ../../src/node_realm.h:8,1724 from ../../src/node_realm.cc:1:1725../../deps/v8/include/v8-profiler.h: In constructor 'v8::HeapProfiler::HeapSnapshotOptions::HeapSnapshotOptions()':1726../../deps/v8/include/v8-profiler.h:1128:27: warning: 'v8::HeapProfiler::HeapSnapshotOptions::global_object_name_resolver' is deprecated: Use context_name_resolver callback instead. [-Wdeprecated-declarations]1727 1128 | HeapSnapshotOptions() {}1728 | ^1729../../deps/v8/include/v8-profiler.h:1142:25: note: declared here1730 1142 | ObjectNameResolver* global_object_name_resolver = nullptr;1731 | ^~~~~~~~~~~~~~~~~~~~~~~~~~~1732../../deps/v8/include/v8-profiler.h:1128:27: warning: 'v8::HeapProfiler::HeapSnapshotOptions::global_object_name_resolver' is deprecated: Use context_name_resolver callback instead. [-Wdeprecated-declarations]1733 1128 | HeapSnapshotOptions() {}1734 | ^1735../../deps/v8/include/v8-profiler.h:1142:25: note: declared here1736 1142 | ObjectNameResolver* global_object_name_resolver = nullptr;1737 | ^~~~~~~~~~~~~~~~~~~~~~~~~~~1738[225/1871] CXX obj/src/node_base.node_serdes.o1739In file included from ../../src/memory_tracker.h:6,1740 from ../../src/base_object.h:29,1741 from ../../src/base_object-inl.h:27,1742 from ../../src/node_serdes.cc:1:1743../../deps/v8/include/v8-profiler.h: In constructor 'v8::HeapProfiler::HeapSnapshotOptions::HeapSnapshotOptions()':1744../../deps/v8/include/v8-profiler.h:1128:27: warning: 'v8::HeapProfiler::HeapSnapshotOptions::global_object_name_resolver' is deprecated: Use context_name_resolver callback instead. [-Wdeprecated-declarations]1745 1128 | HeapSnapshotOptions() {}1746 | ^1747../../deps/v8/include/v8-profiler.h:1142:25: note: declared here1748 1142 | ObjectNameResolver* global_object_name_resolver = nullptr;1749 | ^~~~~~~~~~~~~~~~~~~~~~~~~~~1750../../deps/v8/include/v8-profiler.h:1128:27: warning: 'v8::HeapProfiler::HeapSnapshotOptions::global_object_name_resolver' is deprecated: Use context_name_resolver callback instead. [-Wdeprecated-declarations]1751 1128 | HeapSnapshotOptions() {}1752 | ^1753../../deps/v8/include/v8-profiler.h:1142:25: note: declared here1754 1142 | ObjectNameResolver* global_object_name_resolver = nullptr;1755 | ^~~~~~~~~~~~~~~~~~~~~~~~~~~1756[226/1871] CXX obj/src/node_base.node_report.o1757In file included from ../../src/util.h:29,1758 from ../../src/node_report.h:9,1759 from ../../src/node_report.cc:1:1760../../deps/v8/include/v8-profiler.h: In constructor 'v8::HeapProfiler::HeapSnapshotOptions::HeapSnapshotOptions()':1761../../deps/v8/include/v8-profiler.h:1128:27: warning: 'v8::HeapProfiler::HeapSnapshotOptions::global_object_name_resolver' is deprecated: Use context_name_resolver callback instead. [-Wdeprecated-declarations]1762 1128 | HeapSnapshotOptions() {}1763 | ^1764../../deps/v8/include/v8-profiler.h:1142:25: note: declared here1765 1142 | ObjectNameResolver* global_object_name_resolver = nullptr;1766 | ^~~~~~~~~~~~~~~~~~~~~~~~~~~1767../../deps/v8/include/v8-profiler.h:1128:27: warning: 'v8::HeapProfiler::HeapSnapshotOptions::global_object_name_resolver' is deprecated: Use context_name_resolver callback instead. [-Wdeprecated-declarations]1768 1128 | HeapSnapshotOptions() {}1769 | ^1770../../deps/v8/include/v8-profiler.h:1142:25: note: declared here1771 1142 | ObjectNameResolver* global_object_name_resolver = nullptr;1772 | ^~~~~~~~~~~~~~~~~~~~~~~~~~~1773[227/1871] CXX obj/src/node_base.node_symbols.o1774In file included from ../../src/memory_tracker.h:6,1775 from ../../src/aliased_buffer.h:7,1776 from ../../src/aliased_buffer-inl.h:6,1777 from ../../src/env-inl.h:27,1778 from ../../src/node_symbols.cc:1:1779../../deps/v8/include/v8-profiler.h: In constructor 'v8::HeapProfiler::HeapSnapshotOptions::HeapSnapshotOptions()':1780../../deps/v8/include/v8-profiler.h:1128:27: warning: 'v8::HeapProfiler::HeapSnapshotOptions::global_object_name_resolver' is deprecated: Use context_name_resolver callback instead. [-Wdeprecated-declarations]1781 1128 | HeapSnapshotOptions() {}1782 | ^1783../../deps/v8/include/v8-profiler.h:1142:25: note: declared here1784 1142 | ObjectNameResolver* global_object_name_resolver = nullptr;1785 | ^~~~~~~~~~~~~~~~~~~~~~~~~~~1786../../deps/v8/include/v8-profiler.h:1128:27: warning: 'v8::HeapProfiler::HeapSnapshotOptions::global_object_name_resolver' is deprecated: Use context_name_resolver callback instead. [-Wdeprecated-declarations]1787 1128 | HeapSnapshotOptions() {}1788 | ^1789../../deps/v8/include/v8-profiler.h:1142:25: note: declared here1790 1142 | ObjectNameResolver* global_object_name_resolver = nullptr;1791 | ^~~~~~~~~~~~~~~~~~~~~~~~~~~1792[228/1871] CXX obj/src/node_base.node_shadow_realm.o1793In file included from ../../src/memory_tracker.h:6,1794 from ../../src/cleanup_queue.h:11,1795 from ../../src/node_realm.h:8,1796 from ../../src/node_shadow_realm.h:6,1797 from ../../src/node_shadow_realm.cc:1:1798../../deps/v8/include/v8-profiler.h: In constructor 'v8::HeapProfiler::HeapSnapshotOptions::HeapSnapshotOptions()':1799../../deps/v8/include/v8-profiler.h:1128:27: warning: 'v8::HeapProfiler::HeapSnapshotOptions::global_object_name_resolver' is deprecated: Use context_name_resolver callback instead. [-Wdeprecated-declarations]1800 1128 | HeapSnapshotOptions() {}1801 | ^1802../../deps/v8/include/v8-profiler.h:1142:25: note: declared here1803 1142 | ObjectNameResolver* global_object_name_resolver = nullptr;1804 | ^~~~~~~~~~~~~~~~~~~~~~~~~~~1805../../deps/v8/include/v8-profiler.h:1128:27: warning: 'v8::HeapProfiler::HeapSnapshotOptions::global_object_name_resolver' is deprecated: Use context_name_resolver callback instead. [-Wdeprecated-declarations]1806 1128 | HeapSnapshotOptions() {}1807 | ^1808../../deps/v8/include/v8-profiler.h:1142:25: note: declared here1809 1142 | ObjectNameResolver* global_object_name_resolver = nullptr;1810 | ^~~~~~~~~~~~~~~~~~~~~~~~~~~1811[229/1871] CXX obj/src/node_base.node_task_queue.o1812In file included from ../../src/memory_tracker.h:6,1813 from ../../src/base_object.h:29,1814 from ../../src/async_wrap.h:27,1815 from ../../src/node_task_queue.cc:1:1816../../deps/v8/include/v8-profiler.h: In constructor 'v8::HeapProfiler::HeapSnapshotOptions::HeapSnapshotOptions()':1817../../deps/v8/include/v8-profiler.h:1128:27: warning: 'v8::HeapProfiler::HeapSnapshotOptions::global_object_name_resolver' is deprecated: Use context_name_resolver callback instead. [-Wdeprecated-declarations]1818 1128 | HeapSnapshotOptions() {}1819 | ^1820../../deps/v8/include/v8-profiler.h:1142:25: note: declared here1821 1142 | ObjectNameResolver* global_object_name_resolver = nullptr;1822 | ^~~~~~~~~~~~~~~~~~~~~~~~~~~1823../../deps/v8/include/v8-profiler.h:1128:27: warning: 'v8::HeapProfiler::HeapSnapshotOptions::global_object_name_resolver' is deprecated: Use context_name_resolver callback instead. [-Wdeprecated-declarations]1824 1128 | HeapSnapshotOptions() {}1825 | ^1826../../deps/v8/include/v8-profiler.h:1142:25: note: declared here1827 1142 | ObjectNameResolver* global_object_name_resolver = nullptr;1828 | ^~~~~~~~~~~~~~~~~~~~~~~~~~~1829[230/1871] CXX obj/src/node_base.env.o1830In file included from ../../src/memory_tracker.h:6,1831 from ../../src/aliased_buffer.h:7,1832 from ../../src/env.h:27,1833 from ../../src/env.cc:1:1834../../deps/v8/include/v8-profiler.h: In constructor 'v8::HeapProfiler::HeapSnapshotOptions::HeapSnapshotOptions()':1835../../deps/v8/include/v8-profiler.h:1128:27: warning: 'v8::HeapProfiler::HeapSnapshotOptions::global_object_name_resolver' is deprecated: Use context_name_resolver callback instead. [-Wdeprecated-declarations]1836 1128 | HeapSnapshotOptions() {}1837 | ^1838../../deps/v8/include/v8-profiler.h:1142:25: note: declared here1839 1142 | ObjectNameResolver* global_object_name_resolver = nullptr;1840 | ^~~~~~~~~~~~~~~~~~~~~~~~~~~1841../../deps/v8/include/v8-profiler.h:1128:27: warning: 'v8::HeapProfiler::HeapSnapshotOptions::global_object_name_resolver' is deprecated: Use context_name_resolver callback instead. [-Wdeprecated-declarations]1842 1128 | HeapSnapshotOptions() {}1843 | ^1844../../deps/v8/include/v8-profiler.h:1142:25: note: declared here1845 1142 | ObjectNameResolver* global_object_name_resolver = nullptr;1846 | ^~~~~~~~~~~~~~~~~~~~~~~~~~~1847[231/1871] CXX obj/src/node_base.node_stat_watcher.o1848In file included from ../../src/memory_tracker.h:6,1849 from ../../src/base_object.h:29,1850 from ../../src/async_wrap.h:27,1851 from ../../src/handle_wrap.h:27,1852 from ../../src/node_stat_watcher.h:28,1853 from ../../src/node_stat_watcher.cc:22:1854../../deps/v8/include/v8-profiler.h: In constructor 'v8::HeapProfiler::HeapSnapshotOptions::HeapSnapshotOptions()':1855../../deps/v8/include/v8-profiler.h:1128:27: warning: 'v8::HeapProfiler::HeapSnapshotOptions::global_object_name_resolver' is deprecated: Use context_name_resolver callback instead. [-Wdeprecated-declarations]1856 1128 | HeapSnapshotOptions() {}1857 | ^1858../../deps/v8/include/v8-profiler.h:1142:25: note: declared here1859 1142 | ObjectNameResolver* global_object_name_resolver = nullptr;1860 | ^~~~~~~~~~~~~~~~~~~~~~~~~~~1861../../deps/v8/include/v8-profiler.h:1128:27: warning: 'v8::HeapProfiler::HeapSnapshotOptions::global_object_name_resolver' is deprecated: Use context_name_resolver callback instead. [-Wdeprecated-declarations]1862 1128 | HeapSnapshotOptions() {}1863 | ^1864../../deps/v8/include/v8-profiler.h:1142:25: note: declared here1865 1142 | ObjectNameResolver* global_object_name_resolver = nullptr;1866 | ^~~~~~~~~~~~~~~~~~~~~~~~~~~1867[232/1871] CXX obj/src/node_base.node_file.o1868In file included from ../../src/memory_tracker.h:6,1869 from ../../src/aliased_buffer.h:7,1870 from ../../src/node_file.h:7,1871 from ../../src/node_file.cc:21:1872../../deps/v8/include/v8-profiler.h: In constructor 'v8::HeapProfiler::HeapSnapshotOptions::HeapSnapshotOptions()':1873../../deps/v8/include/v8-profiler.h:1128:27: warning: 'v8::HeapProfiler::HeapSnapshotOptions::global_object_name_resolver' is deprecated: Use context_name_resolver callback instead. [-Wdeprecated-declarations]1874 1128 | HeapSnapshotOptions() {}1875 | ^1876../../deps/v8/include/v8-profiler.h:1142:25: note: declared here1877 1142 | ObjectNameResolver* global_object_name_resolver = nullptr;1878 | ^~~~~~~~~~~~~~~~~~~~~~~~~~~1879../../deps/v8/include/v8-profiler.h:1128:27: warning: 'v8::HeapProfiler::HeapSnapshotOptions::global_object_name_resolver' is deprecated: Use context_name_resolver callback instead. [-Wdeprecated-declarations]1880 1128 | HeapSnapshotOptions() {}1881 | ^1882../../deps/v8/include/v8-profiler.h:1142:25: note: declared here1883 1142 | ObjectNameResolver* global_object_name_resolver = nullptr;1884 | ^~~~~~~~~~~~~~~~~~~~~~~~~~~1885[233/1871] ACTION run_torque: run_torque_action_cea83c9e621e0e182fdfeec0429b2fb789657831bb31bd721b9a7d823e9ef3a81886[234/1871] STAMP obj/tools/v8_gypfiles/run_torque.actions_rules_copies.stamp1887[235/1871] STAMP obj/tools/v8_gypfiles/v8_internal_headers.compile_depends.stamp1888[236/1871] ACTION postmortem-metadata: gen-postmortem-metadata_63ceec4fe112e619d2413cab4d13e9ecf973439b0b10d648a5f58422165276881889[237/1871] STAMP obj/tools/v8_gypfiles/v8_internal_headers.actions_depends.stamp1890[238/1871] STAMP obj/tools/v8_gypfiles/torque_generated_definitions.compile_depends.stamp1891[239/1871] STAMP obj/tools/v8_gypfiles/torque_generated_definitions.actions_depends.stamp1892[240/1871] STAMP obj/tools/v8_gypfiles/v8_base_without_compiler.compile_depends.stamp1893[241/1871] STAMP obj/tools/v8_gypfiles/v8_base_without_compiler.actions_depends.stamp1894[242/1871] CXX obj/src/node_base.node_http2.o1895In file included from ../../src/memory_tracker.h:6,1896 from ../../src/aliased_buffer.h:7,1897 from ../../src/env.h:27,1898 from ../../src/node_http2.h:11,1899 from ../../src/node_http2.cc:1:1900../../deps/v8/include/v8-profiler.h: In constructor 'v8::HeapProfiler::HeapSnapshotOptions::HeapSnapshotOptions()':1901../../deps/v8/include/v8-profiler.h:1128:27: warning: 'v8::HeapProfiler::HeapSnapshotOptions::global_object_name_resolver' is deprecated: Use context_name_resolver callback instead. [-Wdeprecated-declarations]1902 1128 | HeapSnapshotOptions() {}1903 | ^1904../../deps/v8/include/v8-profiler.h:1142:25: note: declared here1905 1142 | ObjectNameResolver* global_object_name_resolver = nullptr;1906 | ^~~~~~~~~~~~~~~~~~~~~~~~~~~1907../../deps/v8/include/v8-profiler.h:1128:27: warning: 'v8::HeapProfiler::HeapSnapshotOptions::global_object_name_resolver' is deprecated: Use context_name_resolver callback instead. [-Wdeprecated-declarations]1908 1128 | HeapSnapshotOptions() {}1909 | ^1910../../deps/v8/include/v8-profiler.h:1142:25: note: declared here1911 1142 | ObjectNameResolver* global_object_name_resolver = nullptr;1912 | ^~~~~~~~~~~~~~~~~~~~~~~~~~~1913[243/1871] CXX obj/src/node_base.node_trace_events.o1914In file included from ../../src/memory_tracker.h:6,1915 from ../../src/base_object.h:29,1916 from ../../src/base_object-inl.h:27,1917 from ../../src/node_trace_events.cc:1:1918../../deps/v8/include/v8-profiler.h: In constructor 'v8::HeapProfiler::HeapSnapshotOptions::HeapSnapshotOptions()':1919../../deps/v8/include/v8-profiler.h:1128:27: warning: 'v8::HeapProfiler::HeapSnapshotOptions::global_object_name_resolver' is deprecated: Use context_name_resolver callback instead. [-Wdeprecated-declarations]1920 1128 | HeapSnapshotOptions() {}1921 | ^1922../../deps/v8/include/v8-profiler.h:1142:25: note: declared here1923 1142 | ObjectNameResolver* global_object_name_resolver = nullptr;1924 | ^~~~~~~~~~~~~~~~~~~~~~~~~~~1925../../deps/v8/include/v8-profiler.h:1128:27: warning: 'v8::HeapProfiler::HeapSnapshotOptions::global_object_name_resolver' is deprecated: Use context_name_resolver callback instead. [-Wdeprecated-declarations]1926 1128 | HeapSnapshotOptions() {}1927 | ^1928../../deps/v8/include/v8-profiler.h:1142:25: note: declared here1929 1142 | ObjectNameResolver* global_object_name_resolver = nullptr;1930 | ^~~~~~~~~~~~~~~~~~~~~~~~~~~1931[244/1871] CXX obj/src/node_base.node_sockaddr.o1932In file included from ../../src/memory_tracker.h:6,1933 from ../../src/base_object.h:29,1934 from ../../src/node_sockaddr.h:6,1935 from ../../src/node_sockaddr.cc:1:1936../../deps/v8/include/v8-profiler.h: In constructor 'v8::HeapProfiler::HeapSnapshotOptions::HeapSnapshotOptions()':1937../../deps/v8/include/v8-profiler.h:1128:27: warning: 'v8::HeapProfiler::HeapSnapshotOptions::global_object_name_resolver' is deprecated: Use context_name_resolver callback instead. [-Wdeprecated-declarations]1938 1128 | HeapSnapshotOptions() {}1939 | ^1940../../deps/v8/include/v8-profiler.h:1142:25: note: declared here1941 1142 | ObjectNameResolver* global_object_name_resolver = nullptr;1942 | ^~~~~~~~~~~~~~~~~~~~~~~~~~~1943../../deps/v8/include/v8-profiler.h:1128:27: warning: 'v8::HeapProfiler::HeapSnapshotOptions::global_object_name_resolver' is deprecated: Use context_name_resolver callback instead. [-Wdeprecated-declarations]1944 1128 | HeapSnapshotOptions() {}1945 | ^1946../../deps/v8/include/v8-profiler.h:1142:25: note: declared here1947 1142 | ObjectNameResolver* global_object_name_resolver = nullptr;1948 | ^~~~~~~~~~~~~~~~~~~~~~~~~~~1949[245/1871] CXX obj/src/node_base.node_sea.o1950In file included from ../../src/memory_tracker.h:6,1951 from ../../src/base_object.h:29,1952 from ../../src/async_wrap.h:27,1953 from ../../src/debug_utils.h:6,1954 from ../../src/debug_utils-inl.h:6,1955 from ../../src/blob_serializer_deserializer-inl.h:14,1956 from ../../src/node_sea.cc:3:1957../../deps/v8/include/v8-profiler.h: In constructor 'v8::HeapProfiler::HeapSnapshotOptions::HeapSnapshotOptions()':1958../../deps/v8/include/v8-profiler.h:1128:27: warning: 'v8::HeapProfiler::HeapSnapshotOptions::global_object_name_resolver' is deprecated: Use context_name_resolver callback instead. [-Wdeprecated-declarations]1959 1128 | HeapSnapshotOptions() {}1960 | ^1961../../deps/v8/include/v8-profiler.h:1142:25: note: declared here1962 1142 | ObjectNameResolver* global_object_name_resolver = nullptr;1963 | ^~~~~~~~~~~~~~~~~~~~~~~~~~~1964../../deps/v8/include/v8-profiler.h:1128:27: warning: 'v8::HeapProfiler::HeapSnapshotOptions::global_object_name_resolver' is deprecated: Use context_name_resolver callback instead. [-Wdeprecated-declarations]1965 1128 | HeapSnapshotOptions() {}1966 | ^1967../../deps/v8/include/v8-profiler.h:1142:25: note: declared here1968 1142 | ObjectNameResolver* global_object_name_resolver = nullptr;1969 | ^~~~~~~~~~~~~~~~~~~~~~~~~~~1970[246/1871] CXX obj/src/node_base.node_options.o1971In file included from ../../src/util.h:29,1972 from ../../src/node_mutex.h:6,1973 from ../../src/node_options.h:11,1974 from ../../src/node_options.cc:1:1975../../deps/v8/include/v8-profiler.h: In constructor 'v8::HeapProfiler::HeapSnapshotOptions::HeapSnapshotOptions()':1976../../deps/v8/include/v8-profiler.h:1128:27: warning: 'v8::HeapProfiler::HeapSnapshotOptions::global_object_name_resolver' is deprecated: Use context_name_resolver callback instead. [-Wdeprecated-declarations]1977 1128 | HeapSnapshotOptions() {}1978 | ^1979../../deps/v8/include/v8-profiler.h:1142:25: note: declared here1980 1142 | ObjectNameResolver* global_object_name_resolver = nullptr;1981 | ^~~~~~~~~~~~~~~~~~~~~~~~~~~1982../../deps/v8/include/v8-profiler.h:1128:27: warning: 'v8::HeapProfiler::HeapSnapshotOptions::global_object_name_resolver' is deprecated: Use context_name_resolver callback instead. [-Wdeprecated-declarations]1983 1128 | HeapSnapshotOptions() {}1984 | ^1985../../deps/v8/include/v8-profiler.h:1142:25: note: declared here1986 1142 | ObjectNameResolver* global_object_name_resolver = nullptr;1987 | ^~~~~~~~~~~~~~~~~~~~~~~~~~~1988[247/1871] CXX obj/src/node_base.node_types.o1989In file included from ../../src/memory_tracker.h:6,1990 from ../../src/aliased_buffer.h:7,1991 from ../../src/aliased_buffer-inl.h:6,1992 from ../../src/env-inl.h:27,1993 from ../../src/node_types.cc:1:1994../../deps/v8/include/v8-profiler.h: In constructor 'v8::HeapProfiler::HeapSnapshotOptions::HeapSnapshotOptions()':1995../../deps/v8/include/v8-profiler.h:1128:27: warning: 'v8::HeapProfiler::HeapSnapshotOptions::global_object_name_resolver' is deprecated: Use context_name_resolver callback instead. [-Wdeprecated-declarations]1996 1128 | HeapSnapshotOptions() {}1997 | ^1998../../deps/v8/include/v8-profiler.h:1142:25: note: declared here1999 1142 | ObjectNameResolver* global_object_name_resolver = nullptr;2000 | ^~~~~~~~~~~~~~~~~~~~~~~~~~~26278ok 5022 parallel/test-webcrypto-random26279 ---26280 duration_ms: 86.3430026281 ...26282ok 5023 parallel/test-webcrypto-raw-format-aliases26283 ---26284 duration_ms: 86.6310026285 ...26286ok 5024 parallel/test-webcrypto-keygen26287 ---26288 duration_ms: 108.1110026289 ...26290ok 5025 parallel/test-weakref26291 ---26292 duration_ms: 408.5400026293 ...26294ok 5026 parallel/test-vm-module-basic26295 ---26296 duration_ms: 709.6480026297 ...26298ok 5027 parallel/test-webcrypto-sign-verify-eddsa26299 ---26300 duration_ms: 110.6740026301 ...26302ok 5028 parallel/test-webcrypto-sign-verify-kmac26303 ---26304 duration_ms: 109.8680026305 ...26306ok 5029 parallel/test-webcrypto-sign-verify-hmac26307 ---26308 duration_ms: 137.3080026309 ...26310ok 5030 parallel/test-webcrypto-util26311 ---26312 duration_ms: 109.0240026313 ...26314ok 5031 parallel/test-websocket-disabled26315 ---26316 duration_ms: 96.4220026317 ...26318ok 5032 parallel/test-webstorage-without-sqlite26319 ---26320 duration_ms: 90.1060026321 ...26322ok 5033 parallel/test-websocket26323 ---26324 duration_ms: 110.3920026325 ...26326ok 5034 parallel/test-webcrypto-webidl26327 ---26328 duration_ms: 117.6850026329 ...26330ok 5035 parallel/test-webcrypto-export-import-rsa26331 ---26332 duration_ms: 263.6510026333 ...26334ok 5036 parallel/test-webstream-encoding-inspect26335 ---26336 duration_ms: 111.1280026337 ...26338ok 5037 parallel/test-webstream-readable-from26339 ---26340 duration_ms: 111.8320026341 ...26342ok 5038 parallel/test-webcrypto-sign-verify-ml-dsa26343 ---26344 duration_ms: 173.1120026345 ...26346ok 5039 parallel/test-webcrypto-supports26347 ---26348 duration_ms: 172.0700026349 ...26350ok 5040 parallel/test-webstream-readablestream-pipeto26351 ---26352 duration_ms: 108.4790026353 ...26354ok 5041 parallel/test-webcrypto-promise-prototype-pollution26355 ---26356 duration_ms: 265.4190026357 ...26358ok 5042 parallel/test-webstreams-abort-controller26359 ---26360 duration_ms: 87.7770026361 ...26362ok 5043 parallel/test-webstream-string-tag26363 ---26364 duration_ms: 107.8300026365 ...26366ok 5044 parallel/test-webcrypto-get-public-key26367 ---26368 duration_ms: 325.4180026369 ...26370ok 5045 parallel/test-webstreams-adapters-sync-write-error26371 ---26372 duration_ms: 108.9720026373 ...26374ok 5046 parallel/test-webstreams-clone-unref26375 ---26376 duration_ms: 107.9850026377 ...26378ok 5047 parallel/test-webstreams-compose26379 ---26380 duration_ms: 108.6030026381 ...26382ok 5048 parallel/test-webcrypto-sign-verify-ecdsa26383 ---26384 duration_ms: 266.7700026385 ...26386ok 5049 parallel/test-webstream-structured-clone-no-leftovers26387 ---26388 duration_ms: 135.3500026389 ...26390ok 5050 parallel/test-webstreams-adapters-writable-buffer-sources26391 ---26392 duration_ms: 134.9780026393 ...26394ok 5051 parallel/test-webstreams-compression-buffer-source26395 ---26396 duration_ms: 107.5310026397 ...26398ok 5052 parallel/test-webstreams-duplex-fromweb-writev-unhandled-rejection26399 ---26400 duration_ms: 86.3540026401 ...26402ok 5053 parallel/test-webcrypto-prototype-pollution26403 ---26404 duration_ms: 326.3800026405 ...26406ok 5054 parallel/test-webstreams-decompression-reject-trailing26407 ---26408 duration_ms: 107.8150026409 ...26410ok 5055 parallel/test-webstreams-finished26411 ---26412 duration_ms: 87.0490026413 ...26414ok 5056 parallel/test-webcrypto-sign-verify-rsa26415 ---26416 duration_ms: 262.8910026417 ...26418ok 5057 parallel/test-webstreams-compression-bad-chunks26419 ---26420 duration_ms: 134.2910026421 ...26422ok 5058 parallel/test-webstreams-pipeto-write-request26423 ---26424 duration_ms: 86.4160026425 ...26426ok 5059 parallel/test-webcrypto-digest-turboshake-rfc26427 ---26428 duration_ms: 507.2200026429 ...26430ok 5060 parallel/test-whatwg-encoding-custom-api-basics26431 ---26432 duration_ms: 86.4310026433 ...26434ok 5061 parallel/test-webstreams-queue-wraparound26435 ---26436 duration_ms: 107.5810026437 ...26438ok 5062 parallel/test-whatwg-encoding-custom-fatal-streaming26439 ---26440 duration_ms: 86.5240026441 ...26442ok 5063 parallel/test-whatwg-encoding-custom-internals26443 ---26444 duration_ms: 88.5000026445 ...26446ok 5064 parallel/test-whatwg-encoding-custom-interop26447 ---26448 duration_ms: 86.4790026449 ...26450ok 5065 parallel/test-whatwg-encoding-custom-textdecoder26451 ---26452 duration_ms: 86.2420026453 ...26454ok 5066 parallel/test-webstreams-pipeline26455 ---26456 duration_ms: 134.2750026457 ...26458ok 5067 parallel/test-whatwg-encoding-custom-textdecoder-fatal26459 ---26460 duration_ms: 86.6080026461 ...26462ok 5068 parallel/test-whatwg-encoding-custom-textdecoder-invalid-arg26463 ---26464 duration_ms: 87.2450026465 ...26466ok 5069 parallel/test-whatwg-encoding-custom-textdecoder-streaming26467 ---26468 duration_ms: 86.6430026469 ...26470ok 5070 parallel/test-whatwg-events-add-event-listener-options-passive26471 ---26472 duration_ms: 86.4300026473 ...26474ok 5071 parallel/test-whatwg-encoding-custom-textdecoder-api-invalid-label26475 ---26476 duration_ms: 107.9820026477 ...26478ok 5072 parallel/test-whatwg-encoding-custom-textdecoder-ignorebom26479 ---26480 duration_ms: 107.8150026481 ...26482ok 5073 parallel/test-whatwg-encoding-custom-textdecoder-utf16-surrogates26483 ---26484 duration_ms: 107.9790026485 ...26486ok 5074 parallel/test-whatwg-events-event-constructors26487 ---26488 duration_ms: 86.7290026489 ...26490ok 5075 parallel/test-webworker-ref-unref26491 ---26492 duration_ms: 167.3900026493 ...26494ok 5076 parallel/test-whatwg-events-add-event-listener-options-signal26495 ---26496 duration_ms: 108.0160026497 ...26498ok 5077 parallel/test-whatwg-events-customevent26499 ---26500 duration_ms: 107.6890026501 ...26502ok 5078 parallel/test-whatwg-events-eventtarget-this-of-listener26503 ---26504 duration_ms: 87.0360026505 ...26506ok 5079 parallel/test-whatwg-readablebytestream-bad-buffers-and-views26507 ---26508 duration_ms: 86.9250026509 ...26510ok 5080 parallel/test-whatwg-readablebytestreambyob26511 ---26512 duration_ms: 86.5080026513 ...26514ok 5081 parallel/test-whatwg-readablestream26515 ---26516 duration_ms: 86.5250026517 ...26518ok 5082 parallel/test-whatwg-headers26519 ---26520 duration_ms: 108.1930026521 ...26522ok 5083 parallel/test-whatwg-readablebytestream26523 ---26524 duration_ms: 108.0070026525 ...26526ok 5084 parallel/test-whatwg-readablestream-byob-read-min26527 ---26528 duration_ms: 86.4310026529 ...26530ok 5085 parallel/test-whatwg-readablestream26531 ---26532 duration_ms: 108.1730026533 ...26534ok 5086 parallel/test-whatwg-encoding-singlebyte26535 ---26536 duration_ms: 167.9180026537 ...26538ok 5087 parallel/test-whatwg-url-custom-deepequal26539 ---26540 duration_ms: 86.6920026541 ...26542ok 5088 parallel/test-whatwg-url-custom-global26543 ---26544 duration_ms: 86.8720026545 ...26546ok 5089 parallel/test-whatwg-transformstream26547 ---26548 duration_ms: 108.0550026549 ...26550ok 5090 parallel/test-whatwg-transformstream-cancel-write-race26551 ---26552 duration_ms: 107.6310026553 ...26554ok 5091 parallel/test-whatwg-url-custom-href-side-effect26555 ---26556 duration_ms: 86.6470026557 ...26558ok 5092 parallel/test-whatwg-url-canparse26559 ---26560 duration_ms: 107.5750026561 ...26562ok 5093 parallel/test-whatwg-url-custom-inspect26563 ---26564 duration_ms: 87.0850026565 ...26566ok 5094 parallel/test-whatwg-url-custom-searchparams-append26567 ---26568 duration_ms: 69.6510026569 ...26570ok 5095 parallel/test-whatwg-url-custom-properties26571 ---26572 duration_ms: 86.5850026573 ...26574ok 5096 parallel/test-whatwg-url-custom-searchparams26575 ---26576 duration_ms: 86.5580026577 ...26578ok 5097 parallel/test-whatwg-url-custom-parsing26579 ---26580 duration_ms: 107.7700026581 ...26582ok 5098 parallel/test-whatwg-url-custom-searchparams-constructor26583 ---26584 duration_ms: 87.3260026585 ...26586ok 5099 parallel/test-whatwg-url-custom-searchparams-delete26587 ---26588 duration_ms: 87.2470026589 ...26590ok 5100 parallel/test-whatwg-url-custom-searchparams-entries26591 ---26592 duration_ms: 86.3840026593 ...26594ok 5101 parallel/test-whatwg-url-custom-searchparams-foreach26595 ---26596 duration_ms: 86.8590026597 ...26598ok 5102 parallel/test-whatwg-url-custom-searchparams-get26599 ---26600 duration_ms: 86.5630026601 ...26602ok 5103 parallel/test-whatwg-url-custom-searchparams-getall26603 ---26604 duration_ms: 86.5160026605 ...26606ok 5104 parallel/test-whatwg-url-custom-searchparams-has26607 ---26608 duration_ms: 86.3860026609 ...26610ok 5105 parallel/test-whatwg-url-custom-searchparams-inspect26611 ---26612 duration_ms: 86.9130026613 ...26614ok 5106 parallel/test-webcrypto-wrap-unwrap26615 ---26616 duration_ms: 509.8410026617 ...26618ok 5107 parallel/test-whatwg-url-custom-searchparams-set26619 ---26620 duration_ms: 69.6190026621 ...26622ok 5108 parallel/test-whatwg-url-custom-searchparams-keys26623 ---26624 duration_ms: 86.6170026625 ...26626ok 5109 parallel/test-whatwg-url-invalidthis26627 ---26628 duration_ms: 69.6770026629 ...26630ok 5110 parallel/test-whatwg-url-custom-searchparams-sort26631 ---26632 duration_ms: 86.8380026633 ...26634ok 5111 parallel/test-whatwg-url-custom-searchparams-stringifier26635 ---26636 duration_ms: 86.5920026637 ...26638ok 5112 parallel/test-whatwg-url-custom-searchparams-values26639 ---26640 duration_ms: 86.2810026641 ...26642ok 5113 parallel/test-whatwg-url-custom-setters26643 ---26644 duration_ms: 86.6660026645 ...26646ok 5114 parallel/test-whatwg-url-custom-tostringtag26647 ---26648 duration_ms: 86.9300026649 ...26650ok 5115 parallel/test-whatwg-url-override-hostname26651 ---26652 duration_ms: 86.9320026653 ...26654ok 5116 parallel/test-webcrypto-sign-verify26655 ---26656 duration_ms: 608.9450026657 ...26658ok 5117 parallel/test-whatwg-url-parse-fast-path26659 ---26660 duration_ms: 86.6860026661 ...26662ok 5118 parallel/test-whatwg-url-properties26663 ---26664 duration_ms: 86.3900026665 ...26666ok 5119 parallel/test-whatwg-url-searchparams-fast-path26667 ---26668 duration_ms: 87.1000026669 ...26670ok 5120 parallel/test-whatwg-webstreams-adapters-streambase26671 ---26672 duration_ms: 87.0640026673 ...26674ok 5121 parallel/test-whatwg-webstreams-adapters-to-readablewritablepair26675 ---26676 duration_ms: 86.8890026677 ...26678ok 5122 parallel/test-whatwg-webstreams-adapters-to-streamduplex26679 ---26680 duration_ms: 86.9610026681 ...26682ok 5123 parallel/test-whatwg-webstreams-adapters-to-streamwritable26683 ---26684 duration_ms: 87.0650026685 ...26686ok 5124 parallel/test-whatwg-webstreams-adapters-to-readablestream26687 ---26688 duration_ms: 107.9410026689 ...26690ok 5125 parallel/test-whatwg-webstreams-adapters-to-writablestream26691 ---26692 duration_ms: 87.0000026693 ...26694ok 5126 parallel/test-whatwg-webstreams-compression26695 ---26696 duration_ms: 87.3720026697 ...26698ok 5127 parallel/test-whatwg-webstreams-coverage26699 ---26700 duration_ms: 86.4420026701 ...26702ok 5128 parallel/test-whatwg-webstreams-encoding26703 ---26704 duration_ms: 86.7090026705 ...26706ok 5129 parallel/test-whatwg-webstreams-adapters-to-streamreadable26707 ---26708 duration_ms: 107.9400026709 ...26710ok 5130 parallel/test-whatwg-webstreams-transform-stream-members26711 ---26712 duration_ms: 87.1880026713 ...26714ok 5131 parallel/test-whatwg-writablestream26715 ---26716 duration_ms: 87.5500026717 ...26718ok 5132 parallel/test-windows-abort-exitcode # skip test is windows specific26719 ---26720 duration_ms: 86.7940026721 ...26722ok 5133 parallel/test-windows-failed-heap-allocation # skip Windows-only26723 ---26724 duration_ms: 86.6570026725 ...26726ok 5134 parallel/test-v8-stop-coverage26727 ---26728 duration_ms: 2309.4670026729 ...26730ok 5135 parallel/test-whatwg-writablestream-close26731 ---26732 duration_ms: 107.7770026733 ...26734ok 5136 parallel/test-worker26735 ---26736 duration_ms: 134.7270026737 ...26738ok 5137 parallel/test-worker26739 ---26740 duration_ms: 134.8460026741 ...26742ok 5138 parallel/test-whatwg-webstreams-transfer26743 ---26744 duration_ms: 168.8680026745 ...26746ok 5139 parallel/test-worker-abort-on-uncaught-exception26747 ---26748 duration_ms: 136.9530026749 ...26750ok 5140 parallel/test-worker-abort-on-uncaught-exception-terminate26751 ---26752 duration_ms: 136.6470026753 ...26754ok 5141 parallel/test-worker-beforeexit-throw-exit26755 ---26756 duration_ms: 137.0740026757 ...26758ok 5142 parallel/test-worker-broadcastchannel-wpt26759 ---26760 duration_ms: 137.2940026761 ...26762ok 5143 parallel/test-worker-cjs-workerdata26763 ---26764 duration_ms: 136.4580026765 ...26766ok 5144 parallel/test-worker-cleanup-handles26767 ---26768 duration_ms: 137.7190026769 ...26770ok 5145 parallel/test-worker-cpu-usage26771 ---26772 duration_ms: 134.8120026773 ...26774ok 5146 parallel/test-worker-broadcastchannel26775 ---26776 duration_ms: 170.4680026777 ...26778ok 5147 parallel/test-worker-crypto-sign-transfer-result26779 ---26780 duration_ms: 137.7960026781 ...26782ok 5148 parallel/test-worker-cwd-race-condition26783 ---26784 duration_ms: 136.1850026785 ...26786ok 5149 parallel/test-worker-cleanexit-with-js26787 ---26788 duration_ms: 171.0840026789 ...26790ok 5150 parallel/test-worker-dispose26791 ---26792 duration_ms: 138.4430026793 ...26794ok 5151 parallel/test-worker-data-url26795 ---26796 duration_ms: 174.1030026797 ...26798ok 5152 parallel/test-worker-error-primitive26799 ---26800 duration_ms: 120.4350026801 ...26802ok 5153 parallel/test-worker-console-listeners26803 ---26804 duration_ms: 212.6060026805 ...26806ok 5154 parallel/test-worker-cpu-profile26807 ---26808 duration_ms: 209.9360026809 ...26810ok 5155 parallel/test-worker-esm-exit26811 ---26812 duration_ms: 119.0160026813 ...26814ok 5156 parallel/test-worker-dns-terminate-during-query26815 ---26816 duration_ms: 138.8070026817 ...26818ok 5157 parallel/test-worker-dns-terminate26819 ---26820 duration_ms: 145.3300026821 ...26822ok 5158 parallel/test-worker-arraybuffer-zerofill26823 ---26824 duration_ms: 263.9240026825 ...26826ok 5159 parallel/test-worker-esm-missing-main26827 ---26828 duration_ms: 117.0930026829 ...26830ok 5160 parallel/test-worker-execargv-invalid26831 ---26832 duration_ms: 86.8860026833 ...26834ok 5161 parallel/test-worker-error-stack-getter-throws26835 ---26836 duration_ms: 144.2110026837 ...26838ok 5162 parallel/test-worker-esmodule26839 ---26840 duration_ms: 115.7940026841 ...26842ok 5163 parallel/test-worker-cli-options26843 ---26844 duration_ms: 262.1090026845 ...26846ok 5164 parallel/test-worker-event26847 ---26848 duration_ms: 108.3000026849 ...26850ok 5165 parallel/test-worker-execargv26851 ---26852 duration_ms: 107.7540026853 ...26854ok 5166 parallel/test-worker-exit-from-uncaught-exception26855 ---26856 duration_ms: 109.6250026857 ...26858ok 5167 parallel/test-worker-exit-event-error26859 ---26860 duration_ms: 134.7010026861 ...26862ok 5168 parallel/test-worker-environmentdata26863 ---26864 duration_ms: 220.0660026865 ...26866ok 5169 parallel/test-worker-exit-code26867 ---26868 duration_ms: 168.8120026869 ...26870ok 5170 parallel/test-worker-heap-statistics26871 ---26872 duration_ms: 109.8470026873 ...26874ok 5171 parallel/test-worker-fs-stat-watcher26875 ---26876 duration_ms: 135.7780026877 ...26878ok 5172 parallel/test-worker-hasref26879 ---26880 duration_ms: 136.2930026881 ...26882ok 5173 parallel/test-worker-invalid-workerdata26883 ---26884 duration_ms: 108.2150026885 ...26886ok 5174 parallel/test-worker-debug26887 ---26888 duration_ms: 332.3730026889 ...26890ok 5175 parallel/test-worker-heap-profile26891 ---26892 duration_ms: 136.5720026893 ...26894ok 5176 parallel/test-worker-heapdump-failure26895 ---26896 duration_ms: 136.8960026897 ...26898ok 5177 parallel/test-worker-message-channel26899 ---26900 duration_ms: 134.3290026901 ...26902ok 5178 parallel/test-worker-cleanexit-with-moduleload26903 ---26904 duration_ms: 411.5440026905 ...26906ok 5179 parallel/test-worker-http2-generic-streams-terminate26907 ---26908 duration_ms: 176.4140026909 ...26910ok 5180 parallel/test-worker-internal-modules26911 ---26912 duration_ms: 170.2750026913 ...26914ok 5181 parallel/test-worker-load-file-with-extension-other-than-js26915 ---26916 duration_ms: 170.3680026917 ...26918ok 5182 parallel/test-worker-message-event26919 ---26920 duration_ms: 149.5590026921 ...26922ok 5183 parallel/test-worker-message-channel-sharedarraybuffer26923 ---26924 duration_ms: 173.8870026925 ...26926ok 5184 parallel/test-worker-message-port-arraybuffer26927 ---26928 duration_ms: 117.0100026929 ...26930ok 5185 parallel/test-worker-message-not-serializable26931 ---26932 duration_ms: 142.1990026933 ...26934ok 5186 parallel/test-worker-message-port-constructor26935 ---26936 duration_ms: 115.9010026937 ...26938ok 5187 parallel/test-worker-message-port-close-while-receiving26939 ---26940 duration_ms: 121.9410026941 ...26942ok 5188 parallel/test-worker-message-mark-as-uncloneable26943 ---26944 duration_ms: 169.7740026945 ...26946ok 5189 parallel/test-worker-message-port-close26947 ---26948 duration_ms: 129.8210026949 ...26950ok 5190 parallel/test-worker-message-port-infinite-message-loop26951 ---26952 duration_ms: 124.7300026953 ...26954ok 5191 parallel/test-watch-mode-kill-signal-default26955 ---26956 duration_ms: 1510.6740026957 ...26958ok 5192 parallel/test-watch-mode-kill-signal-override26959 ---26960 duration_ms: 1512.1180026961 ...26962ok 5193 parallel/test-worker-message-port26963 ---26964 duration_ms: 175.3330026965 ...26966ok 5194 parallel/test-worker-message-port-jstransferable-nested-untransferable26967 ---26968 duration_ms: 124.5080026969 ...26970ok 5195 parallel/test-webstorage26971 ---26972 duration_ms: 1116.2820026973 ...26974ok 5196 parallel/test-worker-message-port-drain26975 ---26976 duration_ms: 175.2590026977 ...26978ok 5197 parallel/test-worker-message-port-message-port-transferring26979 ---26980 duration_ms: 120.0880026981 ...26982ok 5198 parallel/test-worker-message-port-inspect-during-init-hook26983 ---26984 duration_ms: 146.3390026985 ...26986ok 5199 parallel/test-worker-message-port-move26987 ---26988 duration_ms: 115.8350026989 ...26990ok 5200 parallel/test-worker-message-port-multiple-sharedarraybuffers26991 ---26992 duration_ms: 119.5070026993 ...26994ok 5201 parallel/test-worker-message-port-transfer-fake-js-transferable-internal26995 ---26996 duration_ms: 99.9500026997 ...26998ok 5202 parallel/test-worker-message-port-receive-message26999 ---27000 duration_ms: 120.2420027001 ...27002ok 5203 parallel/test-worker-message-port-transfer-filehandle27003 ---27004 duration_ms: 99.7490027005 ...27006ok 5204 parallel/test-worker-message-port-transfer-closed27007 ---27008 duration_ms: 119.5520027009 ...27010ok 5205 parallel/test-worker-message-port-transfer-fake-js-transferable27011 ---27012 duration_ms: 114.2400027013 ...27014ok 5206 parallel/test-worker-message-port-transfer-duplicate27015 ---27016 duration_ms: 119.1240027017 ...27018ok 5207 parallel/test-worker-message-port-transfer-native27019 ---27020 duration_ms: 113.9880027021 ...27022ok 5208 parallel/test-worker-exit-heapsnapshot27023 ---27024 duration_ms: 420.2020027025 ...27026ok 5209 parallel/test-worker-heap-snapshot27027 ---27028 duration_ms: 689.0320027029 ...27030ok 5210 parallel/test-worker-message-port-transfer-self27031 ---27032 duration_ms: 416.1710027033 ...27034ok 5211 parallel/test-worker-memory27035 ---27036 duration_ms: 656.1780027037 ...27038ok 5212 parallel/test-worker-eval-typescript27039 ---27040 duration_ms: 783.2330027041 ...27042ok 5213 parallel/test-worker-nested-uncaught27043 ---27044 duration_ms: 308.5440027045 ...27046ok 5214 parallel/test-worker-message-port-transfer-target27047 ---27048 duration_ms: 404.7680027049 ...27050ok 5215 parallel/test-worker-http2-stream-terminate27051 ---27052 duration_ms: 677.3430027053 ...27054ok 5216 parallel/test-worker-nested-on-process-exit27055 ---27056 duration_ms: 327.8250027057 ...27058ok 5217 parallel/test-worker-name27059 ---27060 duration_ms: 329.7750027061 ...27062ok 5218 parallel/test-worker-nearheaplimit-deadlock27063 ---27064 duration_ms: 329.3380027065 ...27066ok 5219 parallel/test-worker-messaging-errors-invalid27067 ---27068 duration_ms: 342.3640027069 ...27070ok 5220 parallel/test-worker-mjs-workerdata27071 ---27072 duration_ms: 340.9110027073 ...27074ok 5221 parallel/test-worker-messaging-errors-handler27075 ---27076 duration_ms: 355.9220027077 ...27078ok 5222 parallel/test-worker-messageport-hasref27079 ---27080 duration_ms: 389.8720027081 ...27082ok 5223 parallel/test-worker-messaging27083 ---27084 duration_ms: 387.5140027085 ...27086ok 5224 parallel/test-worker-message-port-wasm-module27087 ---27088 duration_ms: 405.1240027089 ...27090ok 5225 parallel/test-worker-message-type-unknown27091 ---27092 duration_ms: 398.6550027093 ...27094ok 5226 parallel/test-worker-message-port-wasm-threads27095 ---27096 duration_ms: 405.9370027097 ...27098ok 5227 parallel/test-worker-message-transfer-port-mark-as-untransferable27099 ---27100 duration_ms: 404.5620027101 ...27102ok 5228 parallel/test-worker-message-port-transfer-terminate27103 ---27104 duration_ms: 428.0080027105 ...27106ok 5229 parallel/test-worker-message-port-terminate-transfer-list27107 ---27108 duration_ms: 490.6330027109 ...27110ok 5230 parallel/test-worker-message-port-message-before-close27111 ---27112 duration_ms: 556.4520027113 ...27114ok 5231 parallel/test-worker-init-failure27115 ---27116 duration_ms: 772.1330027117 ...27118ok 5232 parallel/test-worker-non-fatal-uncaught-exception27119 ---27120 duration_ms: 109.4290027121 ...27122ok 5233 parallel/test-worker-onmessage-not-a-function27123 ---27124 duration_ms: 111.4430027125 ...27126ok 5234 parallel/test-worker-ref-onexit27127 ---27128 duration_ms: 108.9880027129 ...27130ok 5235 parallel/test-worker-nexttick-terminate27131 ---27132 duration_ms: 138.2250027133 ...27134ok 5236 parallel/test-worker-onmessage27135 ---27136 duration_ms: 136.2280027137 ...27138ok 5237 parallel/test-worker-no-stdin-stdout-interaction27139 ---27140 duration_ms: 137.7180027141 ...27142ok 5238 parallel/test-worker-parent-port-ref27143 ---27144 duration_ms: 135.1810027145 ...27146ok 5239 parallel/test-worker-process-argv27147 ---27148 duration_ms: 135.4350027149 ...27150ok 5240 parallel/test-worker-process-cwd27151 ---27152 duration_ms: 135.5080027153 ...27154ok 5241 parallel/test-worker-process-env-shared27155 ---27156 duration_ms: 134.8840027157 ...27158ok 5242 parallel/test-worker-process-exit-async-module27159 ---27160 duration_ms: 135.4240027161 ...27162ok 5243 parallel/test-worker-ref27163 ---27164 duration_ms: 135.9330027165 ...27166ok 5244 parallel/test-worker-relative-path27167 ---27168 duration_ms: 134.8910027169 ...27170ok 5245 parallel/test-worker-relative-path-double-dot27171 ---27172 duration_ms: 135.5540027173 ...27174ok 5246 parallel/test-worker-safe-getters27175 ---27176 duration_ms: 134.7640027177 ...27178ok 5247 parallel/test-worker-sharedarraybuffer-from-worker-thread27179 ---27180 duration_ms: 134.1740027181 ...27182ok 5248 parallel/test-worker-no-sab27183 ---27184 duration_ms: 170.4670027185 ...27186ok 5249 parallel/test-worker-spec-differences27187 ---27188 duration_ms: 136.3310027189 ...27190ok 5250 parallel/test-worker-stack-overflow27191 ---27192 duration_ms: 137.9030027193 ...27194ok 5251 parallel/test-worker-on-process-exit27195 ---27196 duration_ms: 213.2690027197 ...27198ok 5252 parallel/test-worker-process-env27199 ---27200 duration_ms: 209.1430027201 ...27202ok 5253 parallel/test-worker-stdio27203 ---27204 duration_ms: 134.5110027205 ...27206ok 5254 parallel/test-worker-syntax-error-file27207 ---27208 duration_ms: 108.6130027209 ...27210ok 5255 parallel/test-worker-terminate-microtask-loop27211 ---27212 duration_ms: 109.1370027213 ...27214ok 5256 parallel/test-worker-stdio-flush27215 ---27216 duration_ms: 137.3560027217 ...27218ok 5257 parallel/test-worker-type-check27219 ---27220 duration_ms: 87.8820027221 ...27222ok 5258 parallel/test-worker-stdio-flush-inflight27223 ---27224 duration_ms: 134.6370027225 ...27226ok 5259 parallel/test-worker-node-options27227 ---27228 duration_ms: 262.1690027229 ...27230ok 5260 parallel/test-worker-terminate-http2-respond-with-file27231 ---27232 duration_ms: 135.2830027233 ...27234ok 5261 parallel/test-worker-terminate-null-handler27235 ---27236 duration_ms: 134.2890027237 ...27238ok 5262 parallel/test-worker-terminate-ref-public-port27239 ---27240 duration_ms: 135.0200027241 ...27242ok 5263 parallel/test-worker-resource-limits27243 ---27244 duration_ms: 262.5950027245 ...27246ok 5264 parallel/test-worker-terminate-timers27247 ---27248 duration_ms: 134.5940027249 ...27250ok 5265 parallel/test-worker-terminate-unrefed27251 ---27252 duration_ms: 134.7110027253 ...27254ok 5266 parallel/test-worker-thread-name27255 ---27256 duration_ms: 136.9390027257 ...27258ok 5267 parallel/test-worker-unsupported-eval-on-url27259 ---27260 duration_ms: 86.6010027261 ...27262ok 5268 parallel/test-worker-stdio-from-preload-module27263 ---27264 duration_ms: 168.2660027265 ...27266ok 5269 parallel/test-worker-syntax-error27267 ---27268 duration_ms: 168.7140027269 ...27270ok 5270 parallel/test-worker-terminate-nested27271 ---27272 duration_ms: 167.9530027273 ...27274ok 5271 parallel/test-worker-uncaught-exception27275 ---27276 duration_ms: 137.3080027277 ...27278ok 5272 parallel/test-worker-terminate-source-map27279 ---27280 duration_ms: 167.9390027281 ...27282ok 5273 parallel/test-worker-uncaught-exception-async27283 ---27284 duration_ms: 139.4390027285 ...27286ok 5274 parallel/test-worker-track-unmanaged-fds27287 ---27288 duration_ms: 169.3500027289 ...27290ok 5275 parallel/test-worker-unsupported-path27291 ---27292 duration_ms: 87.1760027293 ...27294ok 5276 parallel/test-worker-unsupported-things27295 ---27296 duration_ms: 108.2400027297 ...27298ok 5277 parallel/test-worker-voluntarily-exit-followed-by-addition27299 ---27300 duration_ms: 108.0800027301 ...27302ok 5278 parallel/test-worker-stack-overflow-stack-size27303 ---27304 duration_ms: 260.8950027305 ...27306ok 5279 parallel/test-wrap-js-stream-duplex27307 ---27308 duration_ms: 86.8670027309 ...27310ok 5280 parallel/test-worker-messaging-errors-timeout27311 ---27312 duration_ms: 702.8190027313 ...27314ok 5281 parallel/test-worker-workerdata-messageport27315 ---27316 duration_ms: 108.4550027317 ...27318ok 5282 parallel/test-wrap-js-stream-read-stop27319 ---27320 duration_ms: 86.5790027321 ...27322ok 5283 parallel/test-wrap-js-stream-destroy27323 ---27324 duration_ms: 108.4010027325 ...27326ok 5284 parallel/test-wrap-js-stream-exceptions27327 ---27328 duration_ms: 107.7380027329 ...27330ok 5285 parallel/test-worker-voluntarily-exit-followed-by-throw27331 ---27332 duration_ms: 134.2390027333 ...27334ok 5286 parallel/test-zlib-brotli-flush27335 ---27336 duration_ms: 86.6200027337 ...27338ok 5287 parallel/test-trace-events-http27339 ---27340 duration_ms: 4256.7330027341 ...27342ok 5288 parallel/test-worker-workerdata-sharedarraybuffer27343 ---27344 duration_ms: 135.0870027345 ...27346ok 5289 parallel/test-zlib-brotli-dictionary27347 ---27348 duration_ms: 107.6480027349 ...27350ok 5290 parallel/test-zlib-brotli-kmaxlength-rangeerror27351 ---27352 duration_ms: 86.6610027353 ...27354ok 5291 parallel/test-zlib-close-after-error27355 ---27356 duration_ms: 86.6550027357 ...27358ok 5292 parallel/test-zlib-brotli-flush-invalid-kind27359 ---27360 duration_ms: 108.1150027361 ...27362ok 5293 parallel/test-worker-vm-context-terminate27363 ---27364 duration_ms: 168.1200027365 ...27366ok 5294 parallel/test-zlib-close-after-write27367 ---27368 duration_ms: 86.5540027369 ...27370ok 5295 parallel/test-zlib-brotli-from-brotli27371 ---27372 duration_ms: 108.3180027373 ...27374ok 5296 parallel/test-zlib-brotli-from-string27375 ---27376 duration_ms: 107.9950027377 ...27378ok 5297 parallel/test-zlib-const27379 ---27380 duration_ms: 87.0050027381 ...27382ok 5298 parallel/test-zlib-deflate-constructors27383 ---27384 duration_ms: 87.3540027385 ...27386ok 5299 parallel/test-zlib-create-raw27387 ---27388 duration_ms: 88.1590027389 ...27390ok 5300 parallel/test-zlib-deflate-raw-inherits27391 ---27392 duration_ms: 86.8470027393 ...27394ok 5301 parallel/test-zlib-brotli27395 ---27396 duration_ms: 167.5250027397 ...27398ok 5302 parallel/test-zlib-destroy27399 ---27400 duration_ms: 87.1350027401 ...27402ok 5303 parallel/test-zlib-crc3227403 ---27404 duration_ms: 108.7900027405 ...27406ok 5304 parallel/test-worker-unref-from-message-during-exit27407 ---27408 duration_ms: 262.7610027409 ...27410ok 5305 parallel/test-zlib-dictionary-fail27411 ---27412 duration_ms: 86.5950027413 ...27414ok 5306 parallel/test-zlib-failed-init27415 ---27416 duration_ms: 86.7680027417 ...27418ok 5307 parallel/test-zlib-flush-drain27419 ---27420 duration_ms: 87.2470027421 ...27422ok 5308 parallel/test-zlib-dictionary27423 ---27424 duration_ms: 108.9720027425 ...27426ok 5309 parallel/test-zlib-flush-drain-longblock27427 ---27428 duration_ms: 87.4800027429 ...27430ok 5310 parallel/test-zlib-empty-buffer27431 ---27432 duration_ms: 107.8820027433 ...27434ok 5311 parallel/test-zlib-flush27435 ---27436 duration_ms: 108.4700027437 ...27438ok 5312 parallel/test-zlib-close-in-ondata27439 ---27440 duration_ms: 167.5820027441 ...27442ok 5313 parallel/test-zlib-flush-flags27443 ---27444 duration_ms: 108.2900027445 ...27446ok 5314 parallel/test-zlib-flush-write-sync-interleaved27447 ---27448 duration_ms: 108.2310027449 ...27450ok 5315 parallel/test-zlib-from-concatenated-gzip27451 ---27452 duration_ms: 108.2310027453 ...27454ok 5316 parallel/test-zlib-from-gzip27455 ---27456 duration_ms: 108.2520027457 ...27458ok 5317 parallel/test-zlib-no-stream27459 ---27460 duration_ms: 56.2990027461 ...27462ok 5318 parallel/test-zlib-from-gzip-with-trailing-garbage27463 ---27464 duration_ms: 108.3210027465 ...27466ok 5319 parallel/test-zlib-invalid-input27467 ---27468 duration_ms: 87.6220027469 ...27470ok 5320 parallel/test-zlib-invalid-arg-value-brotli-compress27471 ---27472 duration_ms: 88.5180027473 ...27474ok 5321 parallel/test-zlib-from-string27475 ---27476 duration_ms: 107.8010027477 ...27478ok 5322 parallel/test-zlib-destroy-pipe27479 ---27480 duration_ms: 167.6500027481 ...27482ok 5323 parallel/test-zlib-negative-zero27483 ---27484 duration_ms: 87.4810027485 ...27486ok 5324 parallel/test-zlib-kmaxlength-rangeerror27487 ---27488 duration_ms: 107.6930027489 ...27490ok 5325 parallel/test-zlib-convenience-methods27491 ---27492 duration_ms: 210.0430027493 ...27494ok 5326 parallel/test-zlib-object-write27495 ---27496 duration_ms: 86.4420027497 ...27498ok 5327 parallel/test-zlib-maxOutputLength27499 ---27500 duration_ms: 108.0880027501 ...27502ok 5328 parallel/test-zlib-not-string-or-buffer27503 ---27504 duration_ms: 107.8420027505 ...27506ok 5329 parallel/test-zlib-invalid-input-memory27507 ---27508 duration_ms: 134.5070027509 ...27510ok 5330 parallel/test-zlib-reset-before-write27511 ---27512 duration_ms: 87.3340027513 ...27514ok 5331 parallel/test-zlib-params27515 ---27516 duration_ms: 108.7580027517 ...27518ok 5332 parallel/test-zlib-premature-end27519 ---27520 duration_ms: 108.5830027521 ...27522ok 5333 parallel/test-zlib-reset-during-write27523 ---27524 duration_ms: 89.1760027525 ...27526ok 5334 parallel/test-zlib-sync-no-event27527 ---27528 duration_ms: 87.5720027529 ...27530ok 5335 parallel/test-zlib-random-byte-pipes27531 ---27532 duration_ms: 109.5460027533 ...27534ok 5336 parallel/test-zlib-reject-garbage-after-end27535 ---27536 duration_ms: 109.3200027537 ...27538ok 5337 parallel/test-zlib-write-after-close27539 ---27540 duration_ms: 86.3180027541 ...27542ok 5338 parallel/test-zlib-truncated27543 ---27544 duration_ms: 108.8140027545 ...27546ok 5339 parallel/test-zlib-type-error27547 ---27548 duration_ms: 108.0160027549 ...27550ok 5340 parallel/test-zlib-unused-weak27551 ---27552 duration_ms: 107.8370027553 ...27554ok 5341 parallel/test-zlib-zero-byte27555 ---27556 duration_ms: 87.3930027557 ...27558ok 5342 parallel/test-zlib-unzip-one-byte-chunks27559 ---27560 duration_ms: 107.9390027561 ...27562ok 5343 parallel/test-zlib-write-after-flush27563 ---27564 duration_ms: 108.1270027565 ...27566ok 5344 parallel/test-zlib-write-after-end27567 ---27568 duration_ms: 108.9820027569 ...27570ok 5345 parallel/test-zlib-zero-windowBits27571 ---27572 duration_ms: 135.0040027573 ...27574ok 5346 parallel/test-zlib-zip27575 ---27576 duration_ms: 135.0690027577 ...27578ok 5347 parallel/test-zlib27579 ---27580 duration_ms: 407.4850027581 ...27582ok 5348 parallel/test-zlib-zip-edgecases27583 ---27584 duration_ms: 134.9990027585 ...27586ok 5349 parallel/test-zlib-zip-encoding27587 ---27588 duration_ms: 134.3570027589 ...27590ok 5350 parallel/test-zlib-zip-internals27591 ---27592 duration_ms: 109.8070027593 ...27594ok 5351 parallel/test-zlib-zip-metadata27595 ---27596 duration_ms: 109.1530027597 ...27598ok 5352 parallel/test-zlib-zip-file-lifecycle27599 ---27600 duration_ms: 169.8210027601 ...27602ok 5353 parallel/test-zlib-zstd-dictionary27603 ---27604 duration_ms: 108.3390027605 ...27606ok 5354 parallel/test-zlib-zstd-flush27607 ---27608 duration_ms: 108.8750027609 ...27610ok 5355 parallel/test-zlib-zip-sync27611 ---27612 duration_ms: 137.4670027613 ...27614ok 5356 parallel/test-zlib-zstd27615 ---27616 duration_ms: 134.5110027617 ...27618ok 5357 parallel/test-zlib-zip-interop27619 ---27620 duration_ms: 169.8170027621 ...27622ok 5358 parallel/test-zlib-zstd-from-string27623 ---27624 duration_ms: 113.9970027625 ...27626ok 5359 parallel/test-zlib-zip-files27627 ---27628 duration_ms: 234.7710027629 ...27630ok 5360 parallel/test-x509-escaping27631 ---27632 duration_ms: 540.9080027633 ...27634ok 5361 parallel/test-zlib-zstd-kmaxlength-rangeerror27635 ---27636 duration_ms: 131.7660027637 ...27638ok 5362 parallel/test-zlib-zip-vfs27639 ---27640 duration_ms: 193.0470027641 ...27642ok 5363 sea/test-build-sea # skip Running the resultant binary fails with `/home/iojs/node-tmp/.tmp.2379/sea: error while loading shared libraries: libicui18n.so.71: cannot open shared object file: No such file or directory`.27643 ---27644 duration_ms: 122.8490027645 ...27646ok 5364 parallel/test-zlib-zstd-from-zstd27647 ---27648 duration_ms: 133.5800027649 ...27650ok 5365 parallel/test-zlib-zip-property27651 ---27652 duration_ms: 214.8900027653 ...27654ok 5366 parallel/test-zlib-zip-security-hardening27655 ---27656 duration_ms: 212.9680027657 ...27658ok 5367 parallel/test-zlib-zstd-pledged-src-size27659 ---27660 duration_ms: 142.4660027661 ...27662ok 5368 sea/test-build-sea-already-exists # skip Running the resultant binary fails with `/home/iojs/node-tmp/.tmp.2379/sea: error while loading shared libraries: libicui18n.so.71: cannot open shared object file: No such file or directory`.27663 ---27664 duration_ms: 127.4300027665 ...27666ok 5369 sea/test-build-sea-custom-argv0 # skip Running the resultant binary fails with `/home/iojs/node-tmp/.tmp.2379/sea: error while loading shared libraries: libicui18n.so.71: cannot open shared object file: No such file or directory`.27667 ---27668 duration_ms: 110.5680027669 ...27670ok 5370 parallel/test-zlib-zip-writable27671 ---27672 duration_ms: 231.5010027673 ...27674ok 5371 sea/test-build-sea-config-not-found # skip Running the resultant binary fails with `/home/iojs/node-tmp/.tmp.2379/sea: error while loading shared libraries: libicui18n.so.71: cannot open shared object file: No such file or directory`.27675 ---27676 duration_ms: 152.3640027677 ...27678ok 5372 parallel/test-zlib-zip-hardening27679 ---27680 duration_ms: 268.1860027681 ...27682ok 5373 sea/test-build-sea-invalid-assets # skip Running the resultant binary fails with `/home/iojs/node-tmp/.tmp.2379/sea: error while loading shared libraries: libicui18n.so.71: cannot open shared object file: No such file or directory`.27683 ---27684 duration_ms: 112.5710027685 ...27686ok 5374 sea/test-build-sea-elf-segments # skip Running the resultant binary fails with `/home/iojs/node-tmp/.tmp.2379/sea: error while loading shared libraries: libicui18n.so.71: cannot open shared object file: No such file or directory`.27687 ---27688 duration_ms: 128.7530027689 ...27690ok 5375 sea/test-build-sea-invalid-exec-argv # skip Running the resultant binary fails with `/home/iojs/node-tmp/.tmp.2379/sea: error while loading shared libraries: libicui18n.so.71: cannot open shared object file: No such file or directory`.27691 ---27692 duration_ms: 111.1050027693 ...27694ok 5376 sea/test-build-sea-executable-field # skip Running the resultant binary fails with `/home/iojs/node-tmp/.tmp.2379/sea: error while loading shared libraries: libicui18n.so.71: cannot open shared object file: No such file or directory`.27695 ---27696 duration_ms: 137.0150027697 ...27698ok 5377 sea/test-build-sea-invalid-boolean-fields # skip Running the resultant binary fails with `/home/iojs/node-tmp/.tmp.2379/sea: error while loading shared libraries: libicui18n.so.71: cannot open shared object file: No such file or directory`.27699 ---27700 duration_ms: 138.7460027701 ...27702ok 5378 sea/test-single-executable-application-asset-keys # skip Running the resultant binary fails with `/home/iojs/node-tmp/.tmp.2379/sea: error while loading shared libraries: libicui18n.so.71: cannot open shared object file: No such file or directory`.27703 ---27704 duration_ms: 91.5350027705 ...27706ok 5379 sea/test-single-executable-application # skip Running the resultant binary fails with `/home/iojs/node-tmp/.tmp.2379/sea: error while loading shared libraries: libicui18n.so.71: cannot open shared object file: No such file or directory`.27707 ---27708 duration_ms: 93.3950027709 ...27710ok 5380 sea/test-build-sea-missing-output # skip Running the resultant binary fails with `/home/iojs/node-tmp/.tmp.2379/sea: error while loading shared libraries: libicui18n.so.71: cannot open shared object file: No such file or directory`.27711 ---27712 duration_ms: 93.6730027713 ...27714ok 5381 sea/test-build-sea-invalid-executable # skip Running the resultant binary fails with `/home/iojs/node-tmp/.tmp.2379/sea: error while loading shared libraries: libicui18n.so.71: cannot open shared object file: No such file or directory`.27715 ---27716 duration_ms: 131.8560027717 ...27718ok 5382 sea/test-build-sea-invalid-json # skip Running the resultant binary fails with `/home/iojs/node-tmp/.tmp.2379/sea: error while loading shared libraries: libicui18n.so.71: cannot open shared object file: No such file or directory`.27719 ---27720 duration_ms: 109.8130027721 ...27722ok 5383 sea/test-build-sea-vfs-incompatible-options # skip Running the resultant binary fails with `/home/iojs/node-tmp/.tmp.2379/sea: error while loading shared libraries: libicui18n.so.71: cannot open shared object file: No such file or directory`.27723 ---27724 duration_ms: 110.9100027725 ...27726ok 5384 sea/test-build-sea-missing-main # skip Running the resultant binary fails with `/home/iojs/node-tmp/.tmp.2379/sea: error while loading shared libraries: libicui18n.so.71: cannot open shared object file: No such file or directory`.27727 ---27728 duration_ms: 113.6010027729 ...27730ok 5385 sea/test-single-executable-application-assets # skip Running the resultant binary fails with `/home/iojs/node-tmp/.tmp.2379/sea: error while loading shared libraries: libicui18n.so.71: cannot open shared object file: No such file or directory`.27731 ---27732 duration_ms: 110.5540027733 ...27734ok 5386 sea/test-single-executable-application-asset-keys-empty # skip Running the resultant binary fails with `/home/iojs/node-tmp/.tmp.2379/sea: error while loading shared libraries: libicui18n.so.71: cannot open shared object file: No such file or directory`.27735 ---27736 duration_ms: 113.8940027737 ...27738ok 5387 sea/test-single-executable-application-esm # skip Running the resultant binary fails with `/home/iojs/node-tmp/.tmp.2379/sea: error while loading shared libraries: libicui18n.so.71: cannot open shared object file: No such file or directory`.27739 ---27740 duration_ms: 90.4440027741 ...27742ok 5388 sea/test-single-executable-application-esm-code-cache # skip Running the resultant binary fails with `/home/iojs/node-tmp/.tmp.2379/sea: error while loading shared libraries: libicui18n.so.71: cannot open shared object file: No such file or directory`.27743 ---27744 duration_ms: 92.2160027745 ...27746ok 5389 sea/test-single-executable-application-assets-raw # skip Running the resultant binary fails with `/home/iojs/node-tmp/.tmp.2379/sea: error while loading shared libraries: libicui18n.so.71: cannot open shared object file: No such file or directory`.27747 ---27748 duration_ms: 110.2990027749 ...27750ok 5390 sea/test-single-executable-application-disable-experimental-sea-warning # skip Running the resultant binary fails with `/home/iojs/node-tmp/.tmp.2379/sea: error while loading shared libraries: libicui18n.so.71: cannot open shared object file: No such file or directory`.27751 ---27752 duration_ms: 110.9280027753 ...27754ok 5391 sea/test-single-executable-application-empty # skip Running the resultant binary fails with `/home/iojs/node-tmp/.tmp.2379/sea: error while loading shared libraries: libicui18n.so.71: cannot open shared object file: No such file or directory`.27755 ---27756 duration_ms: 110.3030027757 ...27758ok 5392 sea/test-single-executable-application-assets-nonexistent-file27759 ---27760 duration_ms: 138.2770027761 ...27762ok 5393 sea/test-single-executable-application-exec-argv-empty # skip Running the resultant binary fails with `/home/iojs/node-tmp/.tmp.2379/sea: error while loading shared libraries: libicui18n.so.71: cannot open shared object file: No such file or directory`.27763 ---27764 duration_ms: 109.7770027765 ...27766ok 5394 sea/test-single-executable-application-exec-argv # skip Running the resultant binary fails with `/home/iojs/node-tmp/.tmp.2379/sea: error while loading shared libraries: libicui18n.so.71: cannot open shared object file: No such file or directory`.27767 ---27768 duration_ms: 110.1610027769 ...27770ok 5395 sea/test-single-executable-application-exec-argv-extension-cli # skip Running the resultant binary fails with `/home/iojs/node-tmp/.tmp.2379/sea: error while loading shared libraries: libicui18n.so.71: cannot open shared object file: No such file or directory`.27771 ---27772 duration_ms: 108.4250027773 ...27774ok 5396 sea/test-single-executable-application-assets-invalid-type27775 ---27776 duration_ms: 168.4110027777 ...27778ok 5397 parallel/test-zlib-zip-fuzz27779 ---27780 duration_ms: 415.0890027781 ...27782ok 5398 sea/test-single-executable-application-exec-argv-extension-env # skip Running the resultant binary fails with `/home/iojs/node-tmp/.tmp.2379/sea: error while loading shared libraries: libicui18n.so.71: cannot open shared object file: No such file or directory`.27783 ---27784 duration_ms: 108.9030027785 ...27786ok 5399 parallel/test-zlib-brotli-16GB27787 ---27788 duration_ms: 724.5790027789 ...27790ok 5400 sea/test-single-executable-application-snapshot-worker # skip Running the resultant binary fails with `/home/iojs/node-tmp/.tmp.2379/sea: error while loading shared libraries: libicui18n.so.71: cannot open shared object file: No such file or directory`.27791 ---27792 duration_ms: 87.1940027793 ...27794ok 5401 sea/test-single-executable-application-use-code-cache # skip Running the resultant binary fails with `/home/iojs/node-tmp/.tmp.2379/sea: error while loading shared libraries: libicui18n.so.71: cannot open shared object file: No such file or directory`.27795 ---27796 duration_ms: 87.2420027797 ...27798ok 5402 sea/test-single-executable-application-exec-argv-extension-none # skip Running the resultant binary fails with `/home/iojs/node-tmp/.tmp.2379/sea: error while loading shared libraries: libicui18n.so.71: cannot open shared object file: No such file or directory`.27799 ---27800 duration_ms: 109.9300027801 ...27802ok 5403 sea/test-single-executable-application-vfs-esm # skip Running the resultant binary fails with `/home/iojs/node-tmp/.tmp.2379/sea: error while loading shared libraries: libicui18n.so.71: cannot open shared object file: No such file or directory`.27803 ---27804 duration_ms: 87.5620027805 ...27806ok 5404 sea/test-single-executable-application-inspect # skip Running the resultant binary fails with `/home/iojs/node-tmp/.tmp.2379/sea: error while loading shared libraries: libicui18n.so.71: cannot open shared object file: No such file or directory`.27807 ---27808 duration_ms: 109.4860027809 ...27810ok 5405 sea/test-single-executable-application-vfs # skip Running the resultant binary fails with `/home/iojs/node-tmp/.tmp.2379/sea: error while loading shared libraries: libicui18n.so.71: cannot open shared object file: No such file or directory`.27811 ---27812 duration_ms: 88.1550027813 ...27814ok 5406 sea/test-single-executable-application-inspect-in-sea-flags # skip Running the resultant binary fails with `/home/iojs/node-tmp/.tmp.2379/sea: error while loading shared libraries: libicui18n.so.71: cannot open shared object file: No such file or directory`.27815 ---27816 duration_ms: 110.3160027817 ...27818ok 5407 sea/test-single-executable-application-snapshot # skip Running the resultant binary fails with `/home/iojs/node-tmp/.tmp.2379/sea: error while loading shared libraries: libicui18n.so.71: cannot open shared object file: No such file or directory`.27819 ---27820 duration_ms: 108.2490027821 ...27822ok 5408 sea/test-single-executable-application-snapshot-and-code-cache # skip Running the resultant binary fails with `/home/iojs/node-tmp/.tmp.2379/sea: error while loading shared libraries: libicui18n.so.71: cannot open shared object file: No such file or directory`.27823 ---27824 duration_ms: 110.9630027825 ...27826ok 5409 parallel/test-zlib-zip-experimental-warning27827 ---27828 duration_ms: 506.6200027829 ...27830ok 5410 parallel/test-v8-take-coverage-noop27831 ---27832 duration_ms: 4271.6160027833 ...27834ok 5411 parallel/test-v8-take-coverage27835 ---27836 duration_ms: 4298.8630027837 ...27838ok 5412 module-hooks/test-async-loader-hooks-called-with-register27839 ---27840 duration_ms: 212.5120027841 ...27842ok 5413 module-hooks/test-async-loader-hooks-called-with-expected-args27843 ---27844 duration_ms: 215.1870027845 ...27846ok 5414 module-hooks/test-async-loader-hooks-globalpreload-no-warning-with-initialize27847 ---27848 duration_ms: 211.8120027849 ...27850ok 5415 module-hooks/test-async-loader-hooks-initialize-invoke27851 ---27852 duration_ms: 210.1210027853 ...27854ok 5416 module-hooks/test-async-loader-hooks-initialize-in-sequence27855 ---27856 duration_ms: 211.8320027857 ...27858ok 5417 module-hooks/test-async-loader-hooks-initialize-never-settling27859 ---27860 duration_ms: 209.7360027861 ...27862ok 5418 parallel/test-zlib-zip-security27863 ---27864 duration_ms: 610.1790027865 ...27866ok 5419 module-hooks/test-async-loader-hooks-initialize-process-exit27867 ---27868 duration_ms: 212.7250027869 ...27870ok 5420 module-hooks/test-async-loader-hooks-initialize-rejecting27871 ---27872 duration_ms: 212.0740027873 ...27874ok 5421 module-hooks/test-async-loader-hooks-initialize-throw-null27875 ---27876 duration_ms: 211.7580027877 ...27878ok 5422 module-hooks/test-async-loader-hooks-mixed-opt-in27879 ---27880 duration_ms: 210.8400027881 ...27882ok 5423 module-hooks/test-async-loader-hooks-never-settling-import-meta-resolve27883 ---27884 duration_ms: 212.1130027885 ...27886ok 5424 module-hooks/test-async-loader-hooks-never-settling-load-cjs27887 ---27888 duration_ms: 212.4210027889 ...27890ok 5425 module-hooks/test-async-loader-hooks-never-settling-resolve-cjs27891 ---27892 duration_ms: 211.3050027893 ...27894ok 5426 module-hooks/test-async-loader-hooks-never-settling-race-cjs27895 ---27896 duration_ms: 212.6510027897 ...27898ok 5427 module-hooks/test-async-loader-hooks-globalpreload-warning27899 ---27900 duration_ms: 262.7800027901 ...27902ok 5428 module-hooks/test-async-loader-hooks-never-settling-load-esm-with-warning27903 ---27904 duration_ms: 216.0150027905 ...27906ok 5429 module-hooks/test-async-loader-hooks-never-settling-race-esm27907 ---27908 duration_ms: 215.2190027909 ...27910ok 5430 module-hooks/test-async-loader-hooks-never-settling-load-esm-no-warning27911 ---27912 duration_ms: 220.3710027913 ...27914ok 5431 module-hooks/test-async-loader-hooks-never-settling-resolve-esm-no-warning27915 ---27916 duration_ms: 209.9910027917 ...27918ok 5432 module-hooks/test-async-loader-hooks-never-settling-resolve-esm-with-warning27919 ---27920 duration_ms: 210.1690027921 ...27922ok 5433 parallel/test-zlib-zip-coverage27923 ---27924 duration_ms: 710.2210027925 ...27926ok 5434 module-hooks/test-async-loader-hooks-process-exit-sync27927 ---27928 duration_ms: 176.7010027929 ...27930ok 5435 module-hooks/test-async-loader-hooks-no-leak-internals27931 ---27932 duration_ms: 212.4850027933 ...27934ok 5436 sea/test-single-executable-blob-config27935 ---27936 duration_ms: 333.6900027937 ...27938ok 5437 module-hooks/test-async-loader-hooks-process-exit-async27939 ---27940 duration_ms: 212.0280027941 ...27942ok 5438 module-hooks/test-async-loader-hooks-process-exit-top-level27943 ---27944 duration_ms: 215.7470027945 ...27946ok 5439 module-hooks/test-async-loader-hooks-register-with-import27947 ---27948 duration_ms: 214.8630027949 ...27950ok 5440 module-hooks/test-async-loader-hooks-register-with-cjs27951 ---27952 duration_ms: 217.8780027953 ...27954ok 5441 module-hooks/test-async-loader-hooks-register-with-ports27955 ---27956 duration_ms: 219.1840027957 ...27958ok 5442 module-hooks/test-async-loader-hooks-source-maps-cjs27959 ---27960 duration_ms: 213.2060027961 ...27962ok 5443 module-hooks/test-module-hooks-builtin-require27963 ---27964 duration_ms: 135.8590027965 ...27966ok 5444 module-hooks/test-async-loader-hooks-throw-boolean27967 ---27968 duration_ms: 219.7280027969 ...27970ok 5445 module-hooks/test-async-loader-hooks-throw-empty-object27971 ---27972 duration_ms: 219.9190027973 ...27974ok 5446 module-hooks/test-async-loader-hooks-throw-error27975 ---27976 duration_ms: 218.2040027977 ...27978ok 5447 module-hooks/test-async-loader-hooks-throw-null27979 ---27980 duration_ms: 217.3150027981 ...27982ok 5448 module-hooks/test-async-loader-hooks-throw-object27983 ---27984 duration_ms: 220.0690027985 ...27986ok 5449 module-hooks/test-async-loader-hooks-throw-undefined27987 ---27988 duration_ms: 216.2240027989 ...27990ok 5450 module-hooks/test-async-loader-hooks-register-with-url-parenturl27991 ---27992 duration_ms: 263.9160027993 ...27994ok 5451 module-hooks/test-async-loader-hooks-register-with-require27995 ---27996 duration_ms: 271.1490027997 ...27998ok 5452 module-hooks/test-async-loader-hooks-require-resolve-default27999 ---28000 duration_ms: 271.2440028001 ...28002ok 5453 module-hooks/test-async-loader-hooks-require-resolve-opt-in28003 ---28004 duration_ms: 265.6140028005 ...28006ok 5454 module-hooks/test-async-loader-hooks-throw-bigint28007 ---28008 duration_ms: 263.8030028009 ...28010ok 5455 module-hooks/test-module-hooks-create-require-with-url28011 ---28012 duration_ms: 95.5450028013 ...28014ok 5456 module-hooks/test-async-loader-hooks-with-worker-permission-restricted28015 ---28016 duration_ms: 208.9660028017 ...28018ok 5457 module-hooks/test-module-hooks-custom-conditions-cjs28019 ---28020 duration_ms: 94.0980028021 ...28022ok 5458 module-hooks/test-async-loader-hooks-use-hooks-require-esm28023 ---28024 duration_ms: 228.9940028025 ...28026ok 5459 module-hooks/test-module-hooks-custom-conditions28027 ---28028 duration_ms: 96.1500028029 ...28030ok 5460 module-hooks/test-async-loader-hooks-without-worker-permission28031 ---28032 duration_ms: 207.3890028033 ...28034ok 5461 module-hooks/test-async-loader-hooks-throw-function28035 ---28036 duration_ms: 265.2740028037 ...28038ok 5462 module-hooks/test-async-loader-hooks-throw-number28039 ---28040 duration_ms: 264.7790028041 ...28042ok 5463 module-hooks/test-module-hooks-custom-conditions-special-values28043 ---28044 duration_ms: 86.6710028045 ...28046ok 5464 module-hooks/test-async-loader-hooks-throw-string28047 ---28048 duration_ms: 268.1210028049 ...28050ok 5465 module-hooks/test-async-loader-hooks-throw-symbol28051 ---28052 duration_ms: 273.7030028053 ...28054ok 5466 module-hooks/test-module-hooks-dispose28055 ---28056 duration_ms: 87.1670028057 ...28058ok 5467 module-hooks/test-module-hooks-import-wasm28059 ---28060 duration_ms: 86.7530028061 ...28062ok 5468 module-hooks/test-module-hooks-load-buffers28063 ---28064 duration_ms: 87.0300028065 ...28066ok 5469 module-hooks/test-module-hooks-load-builtin-override-commonjs28067 ---28068 duration_ms: 86.6270028069 ...28070ok 5470 module-hooks/test-module-hooks-load-builtin-override-json28071 ---28072 duration_ms: 87.5870028073 ...28074ok 5471 module-hooks/test-module-hooks-load-builtin-override-module28075 ---28076 duration_ms: 87.5330028077 ...28078ok 5472 module-hooks/test-async-loader-hooks-with-worker-permission-allowed28079 ---28080 duration_ms: 286.9810028081 ...28082ok 5473 module-hooks/test-module-hooks-load-builtin-import28083 ---28084 duration_ms: 108.2570028085 ...28086ok 5474 module-hooks/test-module-hooks-load-chained28087 ---28088 duration_ms: 87.5220028089 ...28090ok 5475 sea/test-single-executable-blob-config-errors28091 ---28092 duration_ms: 610.9540028093 ...28094ok 5476 module-hooks/test-module-hooks-load-context-optional-esm28095 ---28096 duration_ms: 89.5670028097 ...28098ok 5477 module-hooks/test-module-hooks-load-builtin-require28099 ---28100 duration_ms: 111.7500028101 ...28102ok 5478 module-hooks/test-module-hooks-load-context-merged28103 ---28104 duration_ms: 94.8730028105 ...28106ok 5479 module-hooks/test-module-hooks-load-detection28107 ---28108 duration_ms: 92.5710028109 ...28110ok 5480 module-hooks/test-module-hooks-load-context-optional28111 ---28112 duration_ms: 109.7060028113 ...28114ok 5481 module-hooks/test-module-hooks-load-short-circuit-required-middle28115 ---28116 duration_ms: 96.6920028117 ...28118ok 5482 module-hooks/test-module-hooks-load-esm28119 ---28120 duration_ms: 112.3870028121 ...28122ok 5483 module-hooks/test-module-hooks-load-import-cjs-custom-source28123 ---28124 duration_ms: 110.5330028125 ...28126ok 5484 module-hooks/test-module-hooks-load-esm-mock28127 ---28128 duration_ms: 112.6480028129 ...28130ok 5485 module-hooks/test-module-hooks-load-import-cjs28131 ---28132 duration_ms: 111.9380028133 ...28134ok 5486 module-hooks/test-module-hooks-load-context-merged-esm28135 ---28136 duration_ms: 122.1970028137 ...28138ok 5487 module-hooks/test-module-hooks-load-invalid28139 ---28140 duration_ms: 112.8210028141 ...28142ok 5488 module-hooks/test-module-hooks-load-mock28143 ---28144 duration_ms: 110.9930028145 ...28146ok 5489 module-hooks/test-module-hooks-load-short-circuit28147 ---28148 duration_ms: 110.2950028149 ...28150ok 5490 module-hooks/test-module-hooks-load-url-change-require28151 ---28152 duration_ms: 96.8050028153 ...28154ok 5491 module-hooks/test-async-loader-hooks-remove-beforeexit-listener28155 ---28156 duration_ms: 412.8620028157 ...28158ok 5492 module-hooks/test-module-hooks-load-short-circuit-required-start28159 ---28160 duration_ms: 110.8060028161 ...28162ok 5493 module-hooks/test-module-hooks-require-wasm28163 ---28164 duration_ms: 98.6280028165 ...28166ok 5494 module-hooks/test-module-hooks-load-url-change-import28167 ---28168 duration_ms: 121.0560028169 ...28170ok 5495 module-hooks/test-module-hooks-resolve-builtin-builtin-require28171 ---28172 duration_ms: 91.8440028173 ...28174ok 5496 module-hooks/test-module-hooks-resolve-builtin-builtin-import28175 ---28176 duration_ms: 98.9950028177 ...28178ok 5497 module-hooks/test-module-hooks-resolve-builtin-on-disk-require28179 ---28180 duration_ms: 89.8490028181 ...28182ok 5498 module-hooks/test-module-hooks-resolve-context-merged28183 ---28184 duration_ms: 89.5640028185 ...28186ok 5499 module-hooks/test-module-hooks-resolve-builtin-on-disk-import28187 ---28188 duration_ms: 111.5960028189 ...28190ok 5500 module-hooks/test-module-hooks-resolve-builtin-on-disk-require-with-prefix28191 ---28192 duration_ms: 109.2560028193 ...28194ok 5501 module-hooks/test-module-hooks-resolve-context-optional28195 ---28196 duration_ms: 108.3100028197 ...28198ok 5502 module-hooks/test-module-hooks-resolve-context-merged-esm28199 ---28200 duration_ms: 109.2120028201 ...28202ok 5503 module-hooks/test-module-hooks-resolve-context-optional-esm28203 ---28204 duration_ms: 109.6120028205 ...28206ok 5504 module-hooks/test-module-hooks-resolve-invalid28207 ---28208 duration_ms: 91.6340028209 ...28210ok 5505 module-hooks/test-module-hooks-resolve-import-cjs28211 ---28212 duration_ms: 109.7420028213 ...28214ok 5506 module-hooks/test-module-hooks-resolve-load-builtin-override-both28215 ---28216 duration_ms: 109.4340028217 ...28218ok 5507 module-hooks/test-module-hooks-resolve-load-builtin-redirect28219 ---28220 duration_ms: 109.8530028221 ...28222ok 5508 module-hooks/test-module-hooks-resolve-load-builtin-redirect-prefix28223 ---28224 duration_ms: 111.0040028225 ...28226ok 5509 module-hooks/test-module-hooks-resolve-load-builtin-override-both-prefix28227 ---28228 duration_ms: 113.7400028229 ...28230ok 5510 module-hooks/test-module-hooks-resolve-require-resolve-create-require28231 ---28232 duration_ms: 102.2220028233 ...28234ok 5511 module-hooks/test-module-hooks-resolve-require-resolve-builtin28235 ---28236 duration_ms: 111.9470028237 ...28238ok 5512 module-hooks/test-module-hooks-resolve-require-resolve-consistency28239 ---28240 duration_ms: 114.1050028241 ...28242ok 5513 module-hooks/test-module-hooks-resolve-require-resolve-redirect28243 ---28244 duration_ms: 94.6970028245 ...28246ok 5514 module-hooks/test-module-hooks-resolve-require-resolve-fallthrough28247 ---28248 duration_ms: 112.9560028249 ...28250ok 5515 module-hooks/test-module-hooks-resolve-require-resolve-imported-cjs28251 ---28252 duration_ms: 113.5740028253 ...28254ok 5516 module-hooks/test-module-hooks-resolve-short-circuit28255 ---28256 duration_ms: 90.7550028257 ...28258ok 5517 module-hooks/test-module-hooks-resolve-require-resolve-paths28259 ---28260 duration_ms: 113.0020028261 ...28262ok 5518 module-hooks/test-module-hooks-resolve-short-circuit-required-middle28263 ---28264 duration_ms: 109.0910028265 ...28266ok 5519 module-hooks/test-module-hooks-resolve-require-resolve-loaded-with-source28267 ---28268 duration_ms: 138.8330028269 ...28270ok 5520 module-hooks/test-module-hooks-resolve-short-circuit-required-start28271 ---28272 duration_ms: 110.4950028273 ...28274ok 5521 module-hooks/test-module-hooks-require-esm28275 ---28276 duration_ms: 273.1410028277 ...28278ok 5522 parallel/test-v8-collect-gc-profile28279 ---28280 duration_ms: 5208.3270028281 ...28282ok 5523 module-hooks/test-module-hooks-resolve-load-import-inline-typescript28283 ---28284 duration_ms: 327.3550028285 ...28286ok 5524 module-hooks/test-module-hooks-resolve-load-require-inline-typescript28287 ---28288 duration_ms: 328.3040028289 ...28290ok 5525 module-hooks/test-module-hooks-resolve-load-import-inline-typescript-override28291 ---28292 duration_ms: 329.4950028293 ...28294ok 5526 module-hooks/test-module-hooks-resolve-load-require-inline-typescript-override28295 ---28296 duration_ms: 326.7320028297 ...28298ok 5527 parallel/test-v8-collect-gc-profile-in-worker28299 ---28300 duration_ms: 5298.5570028301 ...28302ok 5528 module-hooks/test-module-hooks-load-async-and-sync28303 ---28304 duration_ms: 610.3540028305 ...28306ok 5529 pummel/test-array-hash-collision28307 ---28308 duration_ms: 407.2240028309 ...28310ok 5530 module-hooks/test-module-hooks-preload28311 ---28312 duration_ms: 1123.6510028313 ...28314ok 5531 parallel/test-zlib-zip-zip6428315 ---28316 duration_ms: 2529.0870028317 ...28318ok 5532 parallel/test-stream-iter-broadcast-from28319 ---28320 duration_ms: 10256.9560028321 ...28322ok 5533 pummel/test-blob-slice-with-large-size28323 ---28324 duration_ms: 1607.2160028325 ...28326ok 5534 pummel/test-buffer-large-size-buffer-alloc28327 ---28328 duration_ms: 1507.3290028329 ...28330ok 5535 pummel/test-buffer-large-size-buffer-alloc-unsafe28331 ---28332 duration_ms: 1507.5080028333 ...28334ok 5536 pummel/test-buffer-large-size-buffer-alloc-unsafe-slow28335 ---28336 duration_ms: 1507.1630028337 ...28338ok 5537 pummel/test-buffer-large-size-buffer-write28339 ---28340 duration_ms: 69.4570028341 ...28342ok 5538 pummel/test-buffer-large-size-copy28343 ---28344 duration_ms: 2507.5590028345 ...28346ok 5539 pummel/test-buffer-large-size-slowbuffer28347 ---28348 duration_ms: 1507.4040028349 ...28350ok 5540 pummel/test-child-process-spawn-loop28351 ---28352 duration_ms: 806.9300028353 ...28354ok 5541 pummel/test-crypto-argon2-nonblocking-constructor28355 ---28356 duration_ms: 1307.2800028357 ...28358ok 5542 pummel/test-crypto-dh-hash28359 ---28360 duration_ms: 134.1700028361 ...28362ok 5543 pummel/test-crypto-dh-keys28363 ---28364 duration_ms: 208.5400028365 ...28366ok 5544 parallel/test-runner-execution-ordered-bypass28367 ---28368 duration_ms: 30396.3790028369 ...28370ok 5545 pummel/test-crypto-pqc-sign-verify-slh-dsa28371 ---28372 duration_ms: 7110.5180028373 ...28374ok 5546 pummel/test-dh-regr28375 ---28376 duration_ms: 15715.7670028377 ...28378ok 5547 pummel/test-fs-largefile28379 ---28380 duration_ms: 69.3040028381 ...28382ok 5548 pummel/test-fs-read-file-sync-utf8-memory28383 ---28384 duration_ms: 606.2290028385 ...28386ok 5549 pummel/test-fs-readfile-tostring-fail28387 ---28388 duration_ms: 807.0610028389 ...28390ok 5550 pummel/test-heap-profile-and-snapshot-near-heap-limit28391 ---28392 duration_ms: 706.6640028393 ...28394ok 5551 pummel/test-heap-profile-near-heap-limit28395 ---28396 duration_ms: 606.8850028397 ...28398ok 5552 pummel/test-heapdump-dns28399 ---28400 duration_ms: 1207.4880028401 ...28402ok 5553 pummel/test-heapdump-env28403 ---28404 duration_ms: 506.9590028405 ...28406ok 5554 pummel/test-heapdump-fs-promise28407 ---28408 duration_ms: 907.4850028409 ...28410ok 5555 pummel/test-heapdump-http228411 ---28412 duration_ms: 1607.7600028413 ...28414ok 5556 pummel/test-heapdump-inspector28415 ---28416 duration_ms: 906.9590028417 ...28418ok 5557 pummel/test-heapdump-shadow-realm28419 ---28420 duration_ms: 1907.9320028421 ...28422ok 5558 pummel/test-heapdump-tls28423 ---28424 duration_ms: 907.6330028425 ...28426ok 5559 pummel/test-heapdump-urlpattern28427 ---28428 duration_ms: 907.2990028429 ...28430ok 5560 pummel/test-heapdump-vm-script28431 ---28432 duration_ms: 506.8910028433 ...28434ok 5561 pummel/test-heapdump-worker28435 ---28436 duration_ms: 907.2570028437 ...28438ok 5562 pummel/test-heapdump-zlib28439 ---28440 duration_ms: 7913.2950028441 ...28442ok 5563 pummel/test-heapdump-zstd28443 ---28444 duration_ms: 1307.8400028445 ...28446ok 5564 pummel/test-heapsnapshot-near-heap-limit28447 ---28448 duration_ms: 1807.8270028449 ...28450ok 5565 pummel/test-heapsnapshot-near-heap-limit-big28451 ---28452 duration_ms: 1707.6530028453 ...28454ok 5566 pummel/test-heapsnapshot-near-heap-limit-bounded28455 ---28456 duration_ms: 1607.7280028457 ...28458ok 5567 pummel/test-heapsnapshot-near-heap-limit-by-api28459 ---28460 duration_ms: 2608.4220028461 ...28462ok 5568 pummel/test-http-many-keep-alive-connections28463 ---28464 duration_ms: 707.0520028465 ...28466ok 5569 pummel/test-http-upload-timeout28467 ---28468 duration_ms: 3415.6590028469 ...28470ok 5570 pummel/test-https-large-response28471 ---28472 duration_ms: 167.5350028473 ...28474ok 5571 pummel/test-https-no-reader28475 ---28476 duration_ms: 2309.6660028477 ...28478ok 5572 pummel/test-keep-alive # skip test requires `wrk` to be installed first28479 ---28480 duration_ms: 69.3950028481 ...28482ok 5573 pummel/test-net-many-clients28483 ---28484 duration_ms: 167.1220028485 ...28486ok 5574 pummel/test-net-pause28487 ---28488 duration_ms: 2309.4240028489 ...28490ok 5575 pummel/test-net-pingpong28491 ---28492 duration_ms: 209.2750028493 ...28494ok 5576 pummel/test-net-pingpong-delay28495 ---28496 duration_ms: 406.0950028497 ...28498ok 5577 pummel/test-net-timeout28499 ---28500 duration_ms: 3713.9210028501 ...28502ok 5578 pummel/test-net-timeout228503 ---28504 duration_ms: 5217.2640028505 ...28506ok 5579 pummel/test-net-write-callbacks28507 ---28508 duration_ms: 707.0380028509 ...28510ok 5580 pummel/test-next-tick-infinite-calls28511 ---28512 duration_ms: 4009.3120028513 ...28514ok 5581 pummel/test-process-cpuUsage28515 ---28516 duration_ms: 706.5880028517 ...28518ok 5582 pummel/test-process-hrtime28519 ---28520 duration_ms: 2208.6340028521 ...28522ok 5583 pummel/test-regress-GH-89228523 ---28524 duration_ms: 260.8610028525 ...28526ok 5584 pummel/test-repl-paste-big-data28527 ---28528 duration_ms: 506.7610028529 ...28530ok 5585 pummel/test-stream-pipe-multi28531 ---28532 duration_ms: 821.6360028533 ...28534ok 5586 pummel/test-string-decoder-large-buffer28535 ---28536 duration_ms: 69.2920028537 ...28538ok 5587 pummel/test-structuredclone-jstransferable28539 ---28540 duration_ms: 806.7340028541 ...28542ok 5588 pummel/test-timers28543 ---28544 duration_ms: 3212.5240028545 ...28546ok 5589 pummel/test-tls-server-large-request28547 ---28548 duration_ms: 208.9490028549 ...28550ok 5590 pummel/test-tls-throttle28551 ---28552 duration_ms: 134.2050028553 ...28554ok 5591 pummel/test-vm-memleak28555 ---28556 duration_ms: 5409.2880028557 ...28558ok 5592 pummel/test-vm-race28559 ---28560 duration_ms: 5208.6850028561 ...28562ok 5593 pummel/test-watch-file28563 ---28564 duration_ms: 5218.3610028565 ...28566ok 5594 pummel/test-webcrypto-derivebits-pbkdf228567 ---28568 duration_ms: 2708.4160028569 ...28570ok 5595 pummel/test-webcrypto-kangarootwelve-32bit-overflow # skip only relevant when kMaxLength < 2^3228571 ---28572 duration_ms: 69.5950028573 ...28574ok 5596 pummel/test-worker-take-heapsnapshot28575 ---28576 duration_ms: 406.7240028577 ...28578ok 5597 pummel/test-zlib-zip-slow28579 ---28580 duration_ms: 10919.7840028581 ...28582ok 5598 wpt/test-abort28583 ---28584 duration_ms: 2310.1520028585 ...28586ok 5599 wpt/test-atob28587 ---28588 duration_ms: 167.5430028589 ...28590ok 5600 wpt/test-blob28591 ---28592 duration_ms: 209.0010028593 ...28594ok 5601 wpt/test-broadcastchannel28595 ---28596 duration_ms: 167.3210028597 ...28598ok 5602 wpt/test-compression28599 ---28600 duration_ms: 708.4670028601 ...28602ok 5603 wpt/test-console28603 ---28604 duration_ms: 209.0040028605 ...28606ok 5604 wpt/test-encoding28607 ---28608 duration_ms: 509.9280028609 ...28610ok 5605 wpt/test-events28611 ---28612 duration_ms: 208.9750028613 ...28614ok 5606 wpt/test-file28615 ---28616 duration_ms: 167.4140028617 ...28618ok 5607 wpt/test-hr-time28619 ---28620 duration_ms: 2212.8030028621 ...28622ok 5608 wpt/test-microtask-queuing28623 ---28624 duration_ms: 167.2600028625 ...28626ok 5609 wpt/test-performance-timeline28627 ---28628 duration_ms: 2412.8390028629 ...28630ok 5610 wpt/test-resource-timing28631 ---28632 duration_ms: 261.2560028633 ...28634ok 5611 wpt/test-streams28635 ---28636 duration_ms: 2611.1330028637 ...28638ok 5612 wpt/test-structured-clone28639 ---28640 duration_ms: 167.7130028641 ...28642ok 5613 wpt/test-timers28643 ---28644 duration_ms: 808.0420028645 ...28646ok 5614 wpt/test-url # skip Different versions of Ada affect the WPT tests28647 ---28648 duration_ms: 86.4570028649 ...28650ok 5615 wpt/test-urlpattern28651 ---28652 duration_ms: 209.0700028653 ...28654ok 5616 wpt/test-wasm-jsapi28655 ---28656 duration_ms: 907.8300028657 ...28658ok 5617 wpt/test-wasm-webapi28659 ---28660 duration_ms: 209.0060028661 ...28662ok 5618 wpt/test-web-locks28663 ---28664 duration_ms: 1508.2230028665 ...28666ok 5619 wpt/test-webcrypto28667 ---28668 duration_ms: 5050.7030028669 ...28670ok 5620 wpt/test-webidl28671 ---28672 duration_ms: 327.1710028673 ...28674ok 5621 wpt/test-webstorage28675 ---28676 duration_ms: 1507.6590028677 ...28678ok 5622 wpt/test-workers28679 ---28680 duration_ms: 607.1140028681 ...28682ok 5623 known_issues/test-cli-print-var-crypto28683 ---28684 duration_ms: 134.4450028685 ...28686ok 5624 known_issues/test-cwd-enoent-file28687 ---28688 duration_ms: 133.9870028689 ...28690ok 5625 known_issues/test-dgram-bind-shared-ports-after-port-028691 ---28692 duration_ms: 208.5540028693 ...28694ok 5626 known_issues/test-fs-cp-async-buffer28695 ---28696 duration_ms: 69.3260028697 ...28698ok 5627 known_issues/test-fs-cp-filter28699 ---28700 duration_ms: 69.1450028701 ...28702ok 5628 known_issues/test-fs-cp-non-utf828703 ---28704 duration_ms: 69.1590028705 ...28706ok 5629 known_issues/test-fs-writeFileSync-invalid-windows28707 ---28708 duration_ms: 69.1950028709 ...28710ok 5630 known_issues/test-http-clientrequest-end-contentlength28711 ---28712 duration_ms: 86.2560028713 ...28714ok 5631 known_issues/test-http-clientrequest-end-empty-response-body28715 ---28716 duration_ms: 86.1130028717 ...28718ok 5632 known_issues/test-http-clientrequest-write-chunked28719 ---28720 duration_ms: 86.1680028721 ...28722ok 5633 known_issues/test-http-path-contains-unicode28723 ---28724 duration_ms: 69.0880028725 ...28726ok 5634 known_issues/test-inspector-cluster-port-clash28727 ---28728 duration_ms: 167.2680028729 ...28730ok 5635 known_issues/test-inspector-instrumentation-breakpoint28731 ---28732 duration_ms: 15324.8950028733 ...28734ok 5636 known_issues/test-repl-require-context28735 ---28736 duration_ms: 107.7810028737 ...28738ok 5637 known_issues/test-stdin-is-always-net.socket28739 ---28740 duration_ms: 134.2020028741 ...28742ok 5638 known_issues/test-stream-writable-sync-error28743 ---28744 duration_ms: 69.3540028745 ...28746ok 5639 known_issues/test-url-parse-conformance28747 ---28748 duration_ms: 86.3520028749 ...28750ok 5640 known_issues/test-vm-function-declaration-uses-define28751 ---28752 duration_ms: 69.3800028753 ...28754ok 5641 known_issues/test-vm-timeout-escape-nexttick28755 ---28756 duration_ms: 806.3190028757 ...28758ok 5642 wasm-allocation/test-wasm-allocation28759 ---28760 duration_ms: 90.3200028761 ...28762ok 5643 wasm-allocation/test-wasm-allocation-auto-adapt28763 ---28764 duration_ms: 74.5490028765 ...28766ok 5644 wasm-allocation/test-wasm-allocation-disable-trap-handler28767 ---28768 duration_ms: 73.3440028769 ...28770ok 5645 wasm-allocation/test-wasm-allocation-memory6428771 ---28772 duration_ms: 90.2100028773 ...28774ok 5646 abort/test-abort-backtrace28775 ---28776 duration_ms: 267.5640028777 ...28778ok 5647 abort/test-abort-fatal-error28779 ---28780 duration_ms: 264.3610028781 ...28782ok 5648 abort/test-abort-uncaught-exception28783 ---28784 duration_ms: 264.7900028785 ...28786ok 5649 abort/test-addon-register-signal-handler # skip binding not built yet28787 ---28788 duration_ms: 73.0520028789 ...28790ok 5650 abort/test-addon-uv-handle-leak # skip binding not built yet28791 ---28792 duration_ms: 73.0070028793 ...28794ok 5651 abort/test-http-parser-consume28795 ---28796 duration_ms: 264.3290028797 ...28798ok 5652 abort/test-process-abort-exitcode28799 ---28800 duration_ms: 212.8700028801 ...28802ok 5653 abort/test-signal-handler28803 ---28804 duration_ms: 212.8780028805 ...28806ok 5654 abort/test-worker-abort-uncaught-exception28807 ---28808 duration_ms: 264.0900028809 ...28810ok 5655 abort/test-zlib-invalid-internals-usage28811 ---28812 duration_ms: 212.4470028813 ...28814ok 5656 sequential/test-async-wrap-getasyncid28815 ---28816 duration_ms: 209.0370028817 ...28818ok 5657 sequential/test-buffer-creation-regression28819 ---28820 duration_ms: 69.4160028821 ...28822ok 5658 sequential/test-child-process-emfile28823 ---28824 duration_ms: 167.1090028825 ...28826ok 5659 sequential/test-child-process-execsync28827 ---28828 duration_ms: 606.9680028829 ...28830ok 5660 sequential/test-child-process-exit28831 ---28832 duration_ms: 406.1660028833 ...28834ok 5661 sequential/test-child-process-pass-fd28835 ---28836 duration_ms: 508.3060028837 ...28838ok 5662 sequential/test-cli-syntax-bad28839 ---28840 duration_ms: 506.3980028841 ...28842ok 5663 sequential/test-cli-syntax-file-not-found28843 ---28844 duration_ms: 134.2370028845 ...28846ok 5664 sequential/test-cli-syntax-good28847 ---28848 duration_ms: 167.2740028849 ...28850ok 5665 sequential/test-cli-syntax-require28851 ---28852 duration_ms: 260.5410028853 ...28854ok 5666 sequential/test-cluster-inspect-brk28855 ---28856 duration_ms: 134.0350028857 ...28858ok 5667 sequential/test-cluster-net-listen-ipv6only-none28859 ---28860 duration_ms: 167.2730028861 ...28862ok 5668 sequential/test-cluster-net-listen-ipv6only-rr28863 ---28864 duration_ms: 167.2580028865 ...28866ok 5669 sequential/test-cluster-port-reuse-between-workers28867 ---28868 duration_ms: 260.5450028869 ...28870ok 5670 sequential/test-cluster-send-handle-large-payload28871 ---28872 duration_ms: 167.4530028873 ...28874ok 5671 sequential/test-cpu-prof-default28875 ---28876 duration_ms: 908.2810028877 ...28878ok 5672 sequential/test-cpu-prof-dir-absolute28879 ---28880 duration_ms: 906.9550028881 ...28882ok 5673 sequential/test-cpu-prof-dir-and-name28883 ---28884 duration_ms: 906.5370028885 ...28886ok 5674 sequential/test-cpu-prof-dir-relative28887 ---28888 duration_ms: 906.5540028889 ...28890ok 5675 sequential/test-cpu-prof-drained28891 ---28892 duration_ms: 906.7170028893 ...28894ok 5676 sequential/test-cpu-prof-exit28895 ---28896 duration_ms: 208.8500028897 ...28898ok 5677 sequential/test-cpu-prof-invalid-options28899 ---28900 duration_ms: 167.2720028901 ...28902ok 5678 sequential/test-cpu-prof-kill28903 ---28904 duration_ms: 208.6980028905 ...28906ok 5679 sequential/test-cpu-prof-name28907 ---28908 duration_ms: 1606.8950028909 ...28910ok 5680 sequential/test-cpu-prof-worker-argv28911 ---28912 duration_ms: 906.6230028913 ...28914ok 5681 sequential/test-crypto-timing-safe-equal28915 ---28916 duration_ms: 69.4700028917 ...28918ok 5682 sequential/test-crypto-timing-safe-equal-fast28919 ---28920 duration_ms: 86.1850028921 ...28922ok 5683 sequential/test-debug-prompt28923 ---28924 duration_ms: 607.0710028925 ...28926ok 5684 sequential/test-debugger-custom-port28927 ---28928 duration_ms: 607.4570028929 ...28930ok 5685 sequential/test-debugger-debug-brk28931 ---28932 duration_ms: 134.2130028933 ...28934ok 5686 sequential/test-debugger-invalid-args28935 ---28936 duration_ms: 5315.5000028937 ...28938ok 5687 sequential/test-debugger-launch28939 ---28940 duration_ms: 707.5140028941 ...28942ok 5688 sequential/test-debugger-pid28943 ---28944 duration_ms: 406.6860028945 ...28946ok 5689 sequential/test-deprecation-flags28947 ---28948 duration_ms: 134.3680028949 ...28950ok 5690 sequential/test-dgram-bind-shared-ports28951 ---28952 duration_ms: 208.6890028953 ...28954ok 5691 sequential/test-dgram-implicit-bind-failure28955 ---28956 duration_ms: 69.2660028957 ...28958ok 5692 sequential/test-dgram-pingpong28959 ---28960 duration_ms: 86.1170028961 ...28962ok 5693 sequential/test-diagnostic-dir-cpu-prof28963 ---28964 duration_ms: 1606.7870028965 ...28966ok 5694 sequential/test-diagnostic-dir-heap-prof28967 ---28968 duration_ms: 1206.8850028969 ...28970ok 5695 sequential/test-dtls-interop-openssl-client # skip DTLS is not enabled28971 ---28972 duration_ms: 69.5370028973 ...28974ok 5696 sequential/test-dtls-interop-openssl-server # skip DTLS is not enabled28975 ---28976 duration_ms: 69.0650028977 ...28978ok 5697 sequential/test-error-serdes28979 ---28980 duration_ms: 69.2360028981 ...28982ok 5698 sequential/test-fs-opendir-recursive28983 ---28984 duration_ms: 133.9460028985 ...28986ok 5699 sequential/test-fs-readdir-recursive28987 ---28988 duration_ms: 107.5530028989 ...28990ok 5700 sequential/test-fs-stat-sync-overflow28991 ---28992 duration_ms: 167.2730028993 ...28994ok 5701 sequential/test-gc-http-client28995 ---28996 duration_ms: 506.1690028997 ...28998ok 5702 sequential/test-gc-http-client-onerror28999 ---29000 duration_ms: 506.5790029001 ...29002ok 5703 sequential/test-gc-http-client-timeout29003 ---29004 duration_ms: 406.5760029005 ...29006ok 5704 sequential/test-get-heapsnapshot-options29007 ---29008 duration_ms: 1006.9860029009 ...29010ok 5705 sequential/test-heapdump29011 ---29012 duration_ms: 506.4050029013 ...29014ok 5706 sequential/test-heapdump-flag29015 ---29016 duration_ms: 406.6750029017 ...29018ok 5707 sequential/test-heapdump-flag-custom-dir29019 ---29020 duration_ms: 406.3170029021 ...29022ok 5708 sequential/test-http-econnrefused29023 ---29024 duration_ms: 107.8390029025 ...29026ok 5709 sequential/test-http-keep-alive-large-write29027 ---29028 duration_ms: 86.2760029029 ...29030ok 5710 sequential/test-http-keepalive-maxsockets29031 ---29032 duration_ms: 406.7780029033 ...29034ok 5711 sequential/test-http-regr-gh-292829035 ---29036 duration_ms: 86.5030029037 ...29038ok 5712 sequential/test-http-server-keep-alive-timeout-slow-client-headers29039 ---29040 duration_ms: 1910.1450029041 ...29042ok 5713 sequential/test-http-server-keep-alive-timeout-slow-server29043 ---29044 duration_ms: 707.9480029045 ...29046ok 5714 sequential/test-http2-max-session-memory29047 ---29048 duration_ms: 107.7740029049 ...29050ok 5715 sequential/test-http2-ping-flood29051 ---29052 duration_ms: 107.4320029053 ...29054ok 5716 sequential/test-http2-settings-flood29055 ---29056 duration_ms: 107.4090029057 ...29058ok 5717 sequential/test-http2-timeout-large-write29059 ---29060 duration_ms: 2810.9170029061 ...29062ok 5718 sequential/test-http2-timeout-large-write-file29063 ---29064 duration_ms: 2812.5530029065 ...29066ok 5719 sequential/test-https-connect-localport29067 ---29068 duration_ms: 6214.1750029069 ...29070ok 5720 sequential/test-https-server-keep-alive-timeout29071 ---29072 duration_ms: 1808.9490029073 ...29074ok 5721 sequential/test-init29075 ---29076 duration_ms: 167.4710029077 ...29078ok 5722 sequential/test-inspector-network-resource29079 ---29080 duration_ms: 1507.9740029081 ...29082ok 5723 sequential/test-inspector-open-dispose29083 ---29084 duration_ms: 167.2000029085 ...29086ok 5724 sequential/test-inspector-port-cluster29087 ---29088 duration_ms: 406.1990029089 ...29090ok 5725 sequential/test-module-loading29091 ---29092 duration_ms: 86.4620029093 ...29094ok 5726 sequential/test-net-GH-550429095 ---29096 duration_ms: 260.6060029097 ...29098ok 5727 sequential/test-net-better-error-messages-port29099 ---29100 duration_ms: 86.4400029101 ...29102ok 5728 sequential/test-net-connect-econnrefused29103 ---29104 duration_ms: 134.2680029105 ...29106ok 5729 sequential/test-net-connect-handle-econnrefused29107 ---29108 duration_ms: 86.3150029109 ...29110ok 5730 sequential/test-net-connect-local-error29111 ---29112 duration_ms: 86.4230029113 ...29114ok 5731 sequential/test-net-listen-ipv6only29115 ---29116 duration_ms: 86.3520029117 ...29118ok 5732 sequential/test-net-listen-shared-ports29119 ---29120 duration_ms: 260.6530029121 ...29122ok 5733 sequential/test-net-localport29123 ---29124 duration_ms: 86.2540029125 ...29126ok 5734 sequential/test-net-reconnect-error29127 ---29128 duration_ms: 86.2890029129 ...29130ok 5735 sequential/test-net-response-size29131 ---29132 duration_ms: 1306.8400029133 ...29134ok 5736 sequential/test-net-server-address29135 ---29136 duration_ms: 86.3730029137 ...29138ok 5737 sequential/test-net-server-bind29139 ---29140 duration_ms: 208.6630029141 ...29142ok 5738 sequential/test-net-server-listen-ipv6-link-local29143 ---29144 duration_ms: 86.4060029145 ...29146ok 5739 sequential/test-next-tick-error-spin29147 ---29148 duration_ms: 167.3300029149 ...29150ok 5740 sequential/test-perf-hooks29151 ---29152 duration_ms: 1206.7100029153 ...29154ok 5741 sequential/test-performance-eventloopdelay29155 ---29156 duration_ms: 7219.6190029157 ...29158ok 5742 sequential/test-pipe29159 ---29160 duration_ms: 4315.9860029161 ...29162ok 5743 sequential/test-process-title29163 ---29164 duration_ms: 134.2400029165 ...29166ok 5744 sequential/test-process-warnings29167 ---29168 duration_ms: 134.0030029169 ...29170ok 5745 sequential/test-repl-timeout-throw29171 ---29172 duration_ms: 260.7380029173 ...29174ok 5746 sequential/test-require-cache-without-stat29175 ---29176 duration_ms: 86.2740029177 ...29178ok 5747 sequential/test-resolution-inspect-brk29179 ---29180 duration_ms: 134.0540029181 ...29182ok 5748 sequential/test-stream2-fs29183 ---29184 duration_ms: 86.2570029185 ...29186ok 5749 sequential/test-stream2-stderr-sync29187 ---29188 duration_ms: 167.2230029189 ...29190ok 5750 sequential/test-timers-block-eventloop29191 ---29192 duration_ms: 134.1040029193 ...29194ok 5751 sequential/test-timers-set-interval-excludes-callback-duration29195 ---29196 duration_ms: 508.1030029197 ...29198ok 5752 sequential/test-tls-connect29199 ---29200 duration_ms: 86.5310029201 ...29202ok 5753 sequential/test-tls-lookup29203 ---29204 duration_ms: 86.1960029205 ...29206ok 5754 sequential/test-tls-psk-client # skip missing openssl cli29207 ---29208 duration_ms: 69.4180029209 ...29210ok 5755 sequential/test-tls-session-timeout # skip node compiled without OpenSSL CLI.29211 ---29212 duration_ms: 86.2820029213 ...29214ok 5756 sequential/test-util-debug29215 ---29216 duration_ms: 325.3130029217 ...29218ok 5757 sequential/test-vm-break-on-sigint29219 ---29220 duration_ms: 134.3410029221 ...29222ok 5758 sequential/test-vm-timeout-escape-promise-module-229223 ---29224 duration_ms: 86.1730029225 ...29226ok 5759 sequential/test-vm-timeout-rethrow29227 ---29228 duration_ms: 134.0870029229 ...29230ok 5760 sequential/test-watch-mode-restart-esm-loading-error29231 ---29232 duration_ms: 2312.8000029233 ...29234ok 5761 sequential/test-watch-mode-watch-flags29235 ---29236 duration_ms: 260.7270029237 ...29238ok 5762 sequential/test-watch-mode-worker29239 ---29240 duration_ms: 2208.0450029241 ...29242ok 5763 sequential/test-without-async-context-frame29243 ---29244 duration_ms: 1206.8200029245 ...29246ok 5764 sequential/test-worker-eventlooputil29247 ---29248 duration_ms: 261.2080029249 ...29250ok 5765 sequential/test-worker-fshandles-error-on-termination29251 ---29252 duration_ms: 261.3190029253 ...29254ok 5766 sequential/test-worker-fshandles-open-close-on-termination29255 ---29256 duration_ms: 260.9420029257 ...29258ok 5767 sequential/test-worker-heapsnapshot-options29259 ---29260 duration_ms: 606.9980029261 ...29262ok 5768 sequential/test-worker-prof29263 ---29264 duration_ms: 1907.2770029265 ...29266ok 5769 sequential/test-write-heapsnapshot-options29267 ---29268 duration_ms: 1106.9490029269 ...29270ok 5770 sequential/test-zlib-crc32-fast-api29271 ---29272 duration_ms: 86.5460029273 ...2927429275Failed tests:29276out/Release/node /build/node-v26.9.0/test/parallel/test-fs-cp-async-file-modes.mjs29277make: *** [Makefile:631: test-ci-js] Error 1