nixbot

builds

failed nodejs-slim-26.9.0 checks.x86_64-linux.hermes-vm · build #181 · raw

1structuredAttrs is enabled
unpackPhase
2unpacking source archive /nix/store/7ajvk1c4mspigbdgf21bn9d7f7p9kmgk-node-v26.9.0.tar.xz3source root is node-v26.9.04setting SOURCE_DATE_EPOCH to timestamp 1789550914 of file "node-v26.9.0/tools/nix/v8.nix"
patchPhase
5applying patch /nix/store/j4p9lc7z8hi4g40cpqpj3qxb9a7bvanp-configure-armv6-vfpv2.patch6patching file configure.py7Hunk #1 succeeded at 49 with fuzz 1 (offset -1 lines).8applying patch /nix/store/igz0qnjkvwi4f2mn7i13h3ndxl9n5ryi-node-npm-build-npm-package-logic.patch9patching file deps/npm/node_modules/@npmcli/run-script/lib/set-path.js10Hunk #1 succeeded at 13 with fuzz 2 (offset 1 line).11Hunk #2 succeeded at 37 (offset 8 lines).12patching file deps/npm/node_modules/pacote/lib/git.js13Hunk #1 succeeded at 186 (offset -2 lines).14patching file deps/npm/node_modules/@npmcli/arborist/lib/arborist/build-ideal-tree.js15Hunk #1 succeeded at 802 (offset 62 lines).16patching file deps/npm/node_modules/@npmcli/arborist/lib/arborist/load-actual.js17Hunk #1 succeeded at 121 with fuzz 1 (offset -26 lines).18applying patch /nix/store/57n0csr7hpdd0y91ljxpiwlfw7fsx3kl-use-correct-env-in-tests.patch19patching file test/parallel/test-child-process-default-options.js20patching file test/parallel/test-child-process-env.js21patching file test/parallel/test-child-process-exec-env.js22applying patch /nix/store/p2mhv95s89kaqmdynhz6y6asalf8y4dh-bin-sh-node-run-v22.patch23patching file test/fixtures/run-script/node_modules/.bin/positional-args24Hunk #1 succeeded at 1 with fuzz 1.25applying patch /nix/store/3za8p3x3hjfr1a9b1lc3z4aapp9sm2ja-use-nix-codesign.patch26patching file test/parallel/test-macos-app-sandbox.js27applying patch /nix/store/6whc7i794ygkcwjwrprw7y9aglfl238g-fix-temporal-integration-with-shared-icu.patch28patching file deps/v8/src/objects/js-temporal-zoneinfo64.cc29patching file tools/v8_gypfiles/v8.gyp30Hunk #1 succeeded at 1398 (offset 19 lines).31Hunk #2 succeeded at 2051 (offset 93 lines).
updateAutotoolsGnuConfigScriptsPhase
32Updating Autotools / GNU config script to a newer upstream version: ./deps/cares/config/config.sub33Updating Autotools / GNU config script to a newer upstream version: ./deps/libffi/config.sub34Updating Autotools / GNU config script to a newer upstream version: ./deps/ngtcp2/ngtcp2/third-party/libev/config.sub35Updating Autotools / GNU config script to a newer upstream version: ./deps/cares/config/config.guess36Updating Autotools / GNU config script to a newer upstream version: ./deps/libffi/config.guess37Updating Autotools / GNU config script to a newer upstream version: ./deps/ngtcp2/ngtcp2/third-party/libev/config.guess
configurePhase
38fixing libtool script ./deps/cares/config/ltmain.sh39fixing libtool script ./deps/libffi/ltmain.sh40fixing libtool script ./deps/ngtcp2/ngtcp2/third-party/libev/ltmain.sh41./deps/cares/configure42./deps/libffi/configure43./deps/ngtcp2/ngtcp2/third-party/libev/configure44configure flags: --prefix=/nix/store/mn8r5sjblqmigxv5lg89q4wcj5zqb16n-nodejs-slim-26.9.0 --ninja --with-intl=system-icu --openssl-use-def-ca-store --no-cross-compiling --dest-os=linux --dest-cpu=x64 --v8-enable-temporal-support --use-prefix-to-find-headers --shared-abseil --shared-abseil-libpath=/nix/store/iqvb7h1ykhm12304qwx17xbncrhhy1g4-abseil-cpp-20260107.1/lib --shared-ada --shared-ada-libpath=/nix/store/vk3yq4nzlrdvq1qxgy3764qaycanr0mc-ada-4.0.0/lib --shared-brotli --shared-brotli-libpath=/nix/store/xhgd6rb4h8ssid9yw8nvw74cwq69md5y-brotli-1.2.0-lib/lib --shared-cares --shared-cares-libpath=/nix/store/68syfccdbv3hlz7imlc9xl9fzyz4v8gx-c-ares-1.34.8/lib --shared-ffi --shared-ffi-libpath=/nix/store/3r5wfb1dl3sfknvy1yringvmap0hxj4r-libffi-3.8.0/lib --shared-gtest --shared-gtest-libpath=/nix/store/5sdsmm8s00hck28yp95fk993rg42mqsp-gtest-1.18.0/lib --shared-hdr-histogram --shared-hdr-histogram-libpath=/nix/store/9g532g9jf92xy9xh68p99ml815q11zs0-hdrhistogram_c-0.11.10/lib --shared-highway --shared-highway-libpath=/nix/store/xs1jbkdzxs4ym0rh89nx8xfwj387x3aj-libhwy-1.4.0/lib --shared-http-parser --shared-http-parser-libpath=/nix/store/1lw7d9jsv7qb6nvc4fmvvqsyphaacqcs-llhttp-9.4.3/lib --shared-libuv --shared-libuv-libpath=/nix/store/68b1blnvl4scgdq48d4p7h4lw4pm5w0w-libuv-1.52.1/lib --shared-lief --shared-lief-libpath=/nix/store/nx4g3j20wvgq36b406q6rysvqzzrxaci-lief-0.17.6/lib --shared-merve --shared-merve-libpath=/nix/store/2gj58j8rd88kaan7bsqhl9fjxxp11qqi-merve-1.2.2/lib --shared-nbytes --shared-nbytes-libpath=/nix/store/zf8c839ahp1fn736lih7ai2y14rrx2gn-nbytes-0.1.4/lib --shared-nghttp2 --shared-nghttp2-libpath=/nix/store/6avzrsm02jh7q48ym3hgznj3ypc2shc2-nghttp2-1.70.0-lib/lib --shared-nghttp3 --shared-nghttp3-libpath=/nix/store/dki4fkk75v2x4aqkszmi257wxq6rkkyr-nghttp3-1.16.0/lib --shared-ngtcp2 --shared-ngtcp2-libpath=/nix/store/2hc131frgdz45bjbajmpvlrj185lah7p-ngtcp2-1.23.0/lib --shared-openssl --shared-openssl-libpath=/nix/store/yj34vymbqf7mf4lmffipy8jqc4kwr1mc-openssl-3.6.4/lib --shared-simdjson --shared-simdjson-libpath=/nix/store/129shchmqszagbb0m8kk7ddzb7nnklxv-simdjson-4.6.8/lib --shared-simdutf --shared-simdutf-libpath=/nix/store/dw6xlar7m4qfrhbk63zhcc5pmixa1ga1-simdutf-9.1.0/lib --shared-sqlite --shared-sqlite-libpath=/nix/store/7a0nx1a0rdc5s07vxrsdhplqnzncl5z9-sqlite-3.53.3/lib --shared-temporal_capi --shared-temporal_capi-libpath=/nix/store/7hrx4vyx67h46xxwqj3zw4nafa1m8d04-temporal_capi-0.2.6/lib --shared-uvwasi --shared-uvwasi-libpath=/nix/store/qnbgx63w8yya5330xcxyixja3ah6gfzm-uvwasi-0.0.23/lib --shared-zlib --shared-zlib-libpath=/nix/store/lw86vj9kfwgvlivg3p8qg2nibpmhmsl9-zlib-1.3.2/lib --shared-zstd --shared-zstd-libpath=/nix/store/8ik1d1r4l2jzm9mjh6bc0a13yczx62wg-zstd-1.5.7/lib45INFO: configure completed successfully
buildPhase
46build flags: -j32 SHELL=/nix/store/svx59425zxp552p2b8gm11qj5r09b56i-bash-5.3p15/bin/bash47TERM=dumb ninja -C out/Release -j3248ninja: Entering directory `out/Release'49[1/1871] CXX obj/deps/v8/src/base/v8_libbase.abort-mode.o50[2/1871] CXX obj/deps/v8/src/base/v8_libbase.fpu.o51[3/1871] CXX obj/deps/v8/src/base/v8_libbase.bits.o52[4/1871] CXX obj/deps/v8/src/base/v8_libbase.sys-info.o53[5/1871] CXX obj/deps/v8/src/base/v8_libbase.division-by-constant.o54[6/1871] CXX obj/deps/v8/src/base/v8_libbase.cpu.o55[7/1871] CXX obj/deps/v8/src/base/debug/v8_libbase.stack_trace.o56[8/1871] CXX obj/deps/v8/src/base/numbers/v8_libbase.diy-fp.o57[9/1871] CXX obj/deps/v8/src/base/v8_libbase.once.o58[10/1871] CXX obj/deps/v8/src/base/numbers/v8_libbase.cached-powers.o59[11/1871] CXX obj/deps/v8/src/base/platform/v8_libbase.semaphore.o60[12/1871] CXX obj/deps/v8/src/base/v8_libbase.file-utils.o61[13/1871] CXX obj/deps/v8/src/base/numbers/v8_libbase.dtoa.o62[14/1871] CXX obj/deps/v8/src/base/platform/v8_libbase.platform.o63[15/1871] CXX obj/deps/v8/src/base/platform/v8_libbase.memory-protection-key.o64[16/1871] CXX obj/deps/v8/src/base/v8_libbase.page-allocator.o65[17/1871] CXX obj/deps/v8/src/base/sanitizer/v8_libbase.lsan-virtual-address-space.o66[18/1871] CXX obj/deps/v8/src/base/v8_libbase.region-allocator.o67[19/1871] CXX obj/deps/v8/src/base/sanitizer/v8_libbase.lsan-page-allocator.o68[20/1871] CXX obj/deps/v8/src/base/v8_libbase.strings.o69[21/1871] CXX obj/deps/v8/src/base/numbers/v8_libbase.fixed-dtoa.o70[22/1871] CXX obj/deps/v8/src/base/numbers/v8_libbase.bignum-dtoa.o71[23/1871] CXX obj/deps/v8/src/base/numbers/v8_libbase.fast-dtoa.o72[24/1871] CXX obj/deps/v8/src/base/numbers/v8_libbase.strtod.o73[25/1871] CXX obj/deps/v8/src/base/numbers/v8_libbase.bignum.o74[26/1871] CXX obj/deps/v8/src/base/v8_libbase.ieee754.o75[27/1871] CXX obj/deps/v8/src/base/v8_libbase.vlq-base64.o76[28/1871] CXX obj/deps/v8/src/base/platform/v8_libbase.condition-variable.o77[29/1871] CXX obj/deps/v8/src/base/platform/v8_libbase.mutex.o78[30/1871] CXX obj/deps/v8/src/base/platform/v8_libbase.platform-posix-time.o79[31/1871] CXX obj/deps/v8/src/base/v8_libbase.logging.o80[32/1871] CXX obj/deps/v8/src/base/platform/v8_libbase.time.o81[33/1871] CXX obj/deps/v8/src/base/v8_libbase.bounded-page-allocator.o82[34/1871] CXX obj/deps/v8/src/base/v8_libbase.emulated-virtual-address-subspace.o83[35/1871] CXX obj/deps/v8/src/base/debug/v8_libbase.stack_trace_posix.o84[36/1871] CXX obj/deps/v8/src/base/platform/v8_libbase.platform-linux.o85[37/1871] CXX obj/deps/v8/src/base/utils/v8_libbase.random-number-generator.o86[38/1871] CXX obj/deps/v8/src/base/v8_libbase.virtual-address-space-page-allocator.o87[39/1871] ACTION Checking inspector protocol compatibility88[40/1871] CXX obj/deps/v8/src/base/v8_libbase.virtual-address-space.o89[41/1871] CXX obj/deps/v8/src/torque/torque_base.source-positions.o90[42/1871] CXX obj/deps/v8/src/base/platform/v8_libbase.platform-posix.o91[43/1871] AR obj/tools/v8_gypfiles/libv8_libbase.a92[44/1871] STAMP obj/tools/v8_gypfiles/v8_flags.actions_depends.stamp93[45/1871] ACTION Generating temporal zoneinfo static data94[46/1871] CC obj/deps/v8/third_party/zlib/v8_zlib.compress.o95cc1: warning: command-line option '-fvisibility-inlines-hidden' is valid for C++/ObjC++ but not for C96[47/1871] CC obj/deps/v8/third_party/zlib/v8_zlib.cpu_features.o97cc1: warning: command-line option '-fvisibility-inlines-hidden' is valid for C++/ObjC++ but not for C98[48/1871] CC obj/deps/v8/third_party/zlib/v8_zlib.adler32.o99cc1: warning: command-line option '-fvisibility-inlines-hidden' is valid for C++/ObjC++ but not for C100[49/1871] ACTION Generating inspector protocol sources from protocol json101[50/1871] STAMP obj/tools/v8_gypfiles/v8_inspector_headers.actions_rules_copies.stamp102[51/1871] CC obj/deps/v8/third_party/zlib/v8_zlib.crc32.o103cc1: warning: command-line option '-fvisibility-inlines-hidden' is valid for C++/ObjC++ but not for C104[52/1871] CXX obj/deps/v8/src/interpreter/bytecode_builtins_list_generator.bytecode-operands.o105[53/1871] CXX obj/deps/v8/src/torque/torque_base.cpp-builder.o106[54/1871] CC obj/deps/v8/third_party/zlib/v8_zlib.gzclose.o107cc1: warning: command-line option '-fvisibility-inlines-hidden' is valid for C++/ObjC++ but not for C108[55/1871] CC obj/deps/v8/third_party/zlib/v8_zlib.gzlib.o109cc1: warning: command-line option '-fvisibility-inlines-hidden' is valid for C++/ObjC++ but not for C110[56/1871] CC obj/deps/v8/third_party/zlib/v8_zlib.gzread.o111cc1: warning: command-line option '-fvisibility-inlines-hidden' is valid for C++/ObjC++ but not for C112[57/1871] CC obj/deps/v8/third_party/zlib/v8_zlib.gzwrite.o113cc1: warning: command-line option '-fvisibility-inlines-hidden' is valid for C++/ObjC++ but not for C114[58/1871] CXX obj/deps/v8/src/builtins/bytecode_builtins_list_generator.generate-bytecodes-builtins-list.o115[59/1871] CC obj/deps/v8/third_party/zlib/v8_zlib.inftrees.o116cc1: warning: command-line option '-fvisibility-inlines-hidden' is valid for C++/ObjC++ but not for C117[60/1871] CC obj/deps/v8/third_party/zlib/v8_zlib.inffast.o118cc1: warning: command-line option '-fvisibility-inlines-hidden' is valid for C++/ObjC++ but not for C119[61/1871] CXX obj/deps/v8/src/interpreter/bytecode_builtins_list_generator.bytecodes.o120[62/1871] CC obj/deps/v8/third_party/zlib/v8_zlib.deflate.o121cc1: warning: command-line option '-fvisibility-inlines-hidden' is valid for C++/ObjC++ but not for C122[63/1871] CC obj/deps/v8/third_party/zlib/v8_zlib.infback.o123cc1: warning: command-line option '-fvisibility-inlines-hidden' is valid for C++/ObjC++ but not for C124[64/1871] CC obj/deps/v8/third_party/zlib/v8_zlib.uncompr.o125cc1: warning: command-line option '-fvisibility-inlines-hidden' is valid for C++/ObjC++ but not for C126[65/1871] CC obj/deps/v8/third_party/zlib/v8_zlib.zutil.o127cc1: warning: command-line option '-fvisibility-inlines-hidden' is valid for C++/ObjC++ but not for C128[66/1871] CXX obj/deps/v8/src/regexp/gen-regexp-special-case.gen-regexp-special-case.o129[67/1871] CXX obj/deps/v8/third_party/zlib/google/v8_zlib.compression_utils_portable.o130[68/1871] CXX obj/deps/v8/src/torque/torque_base.global-context.o131[69/1871] CXX obj/deps/v8/src/torque/torque_base.type-inference.o132[70/1871] CC obj/deps/v8/third_party/zlib/v8_zlib.trees.o133cc1: warning: command-line option '-fvisibility-inlines-hidden' is valid for C++/ObjC++ but not for C134[71/1871] CXX obj/deps/v8/src/torque/torque_base.declarable.o135[72/1871] LINK bytecode_builtins_list_generator136[73/1871] CC obj/deps/v8/third_party/zlib/v8_zlib.inflate.o137cc1: warning: command-line option '-fvisibility-inlines-hidden' is valid for C++/ObjC++ but not for C138[74/1871] ACTION generate_bytecode_builtins_list: generate_bytecode_builtins_list_action_73a03d1964edbe79fc19deb968fa21d5c456544c3d095b62158c8959ed2aeed1139[75/1871] CXX obj/deps/v8/src/torque/torque_base.earley-parser.o140[76/1871] CXX obj/deps/v8/src/torque/torque_base.server-data.o141[77/1871] CXX obj/deps/v8/src/torque/torque_base.torque-code-generator.o142[78/1871] LINK gen-regexp-special-case143[79/1871] CXX obj/deps/v8/src/torque/torque_base.type-oracle.o144[80/1871] ACTION run_gen-regexp-special-case: run_gen-regexp-special-case_action_72d03329d19e24c609ee6e65eeeb110034e9261c37b8a8d83522628d574e9fa7145[81/1871] CXX obj/deps/v8/src/torque/torque_base.kythe-data.o146[82/1871] CXX obj/deps/v8/src/libplatform/v8_libplatform.default-thread-isolated-allocator.o147[83/1871] AR obj/tools/v8_gypfiles/libv8_zlib.a148[84/1871] CXX obj/deps/v8/src/torque/torque_base.utils.o149[85/1871] CXX obj/deps/v8/src/torque/torque_base.cfg.o150[86/1871] CXX obj/src/node_js2c.embedded_data.o151[87/1871] CXX obj/deps/v8/src/libplatform/tracing/v8_libplatform.trace-config.o152[88/1871] CXX obj/src/node_js2c.builtin_info.o153[89/1871] CXX obj/deps/v8/src/libplatform/tracing/v8_libplatform.trace-object.o154[90/1871] CXX obj/deps/v8/src/torque/torque_base.class-debug-reader-generator.o155[91/1871] CXX obj/deps/v8/src/libplatform/tracing/v8_libplatform.trace-writer.o156[92/1871] CXX obj/deps/v8/src/libplatform/v8_libplatform.default-job.o157[93/1871] CXX obj/deps/v8/src/libplatform/v8_libplatform.task-queue.o158[94/1871] CXX obj/deps/v8/src/libplatform/v8_libplatform.default-worker-threads-task-runner.o159[95/1871] CXX obj/deps/v8/src/libplatform/v8_libplatform.delayed-task-queue.o160[96/1871] CXX obj/deps/v8/src/libplatform/tracing/v8_libplatform.trace-buffer.o161[97/1871] CXX obj/deps/inspector_protocol/crdtp/crdtp.error_support.o162[98/1871] CC obj/test/nop/nop.nop.o163[99/1871] CC obj/test/overlapped-checker/overlapped-checker.main_unix.o164[100/1871] CXX obj/deps/inspector_protocol/crdtp/crdtp.json_platform.o165[101/1871] CXX obj/deps/v8/src/torque/torque_base.instance-type-generator.o166[102/1871] CXX obj/deps/ncrypto/ncrypto_engine.engine.o167[103/1871] AR obj/deps/ncrypto/libncrypto_engine.a168[104/1871] LINK overlapped-checker169[105/1871] CXX obj/deps/v8/src/libplatform/v8_libplatform.worker-thread.o170[106/1871] CXX obj/deps/inspector_protocol/crdtp/crdtp.span.o171[107/1871] CXX obj/deps/v8/src/libplatform/v8_libplatform.default-platform.o172[108/1871] CXX obj/deps/v8/src/libplatform/v8_libplatform.default-foreground-task-runner.o173[109/1871] CXX obj/deps/inspector_protocol/crdtp/crdtp.serializable.o174[110/1871] LINK nop175[111/1871] CXX obj/deps/v8/src/torque/torque_base.cc-generator.o176[112/1871] CXX obj/deps/inspector_protocol/crdtp/crdtp.status.o177[113/1871] CXX obj/deps/v8/src/libplatform/tracing/v8_libplatform.tracing-controller.o178[114/1871] AR obj/tools/v8_gypfiles/libv8_libplatform.a179[115/1871] CXX obj/deps/v8/src/torque/torque_base.declaration-visitor.o180[116/1871] CXX obj/deps/v8/src/torque/torque.torque.o181[117/1871] CXX obj/deps/v8/src/torque/torque_base.declarations.o182[118/1871] CXX obj/deps/v8/src/torque/torque_base.instructions.o183[119/1871] CXX obj/deps/inspector_protocol/crdtp/crdtp.protocol_core.o184[120/1871] CXX obj/deps/inspector_protocol/crdtp/crdtp.cbor.o185[121/1871] CXX obj/deps/v8/src/torque/torque_base.csa-generator.o186[122/1871] CXX obj/deps/inspector_protocol/crdtp/crdtp.dispatch.o187[123/1871] CXX obj/deps/v8/src/torque/torque_base.torque-compiler.o188[124/1871] CXX obj/deps/v8/src/torque/torque_base.type-visitor.o189[125/1871] CXX obj/tools/node_js2c.js2c.o190[126/1871] LINK node_js2c191[127/1871] STAMP obj/node_base.actions_depends.stamp192[128/1871] ACTION node_base: convert_node_protocol_to_json_f26a10641803f604d1307d23f68bde8b450ad8f073bd43313642df31e7a3478c193[129/1871] ACTION node_base: node_js2c_f26a10641803f604d1307d23f68bde8b450ad8f073bd43313642df31e7a3478c194[130/1871] ACTION node_base: concatenate_protocols_f26a10641803f604d1307d23f68bde8b450ad8f073bd43313642df31e7a3478c195[131/1871] ACTION node_base: v8_inspector_compress_protocol_json_f26a10641803f604d1307d23f68bde8b450ad8f073bd43313642df31e7a3478c196[132/1871] CXX obj/deps/inspector_protocol/crdtp/crdtp.json.o197[133/1871] AR obj/deps/inspector_protocol/libcrdtp.a198[134/1871] ACTION Generating node protocol sources from protocol json199[135/1871] STAMP obj/node_base.actions_rules_copies.stamp200[136/1871] CXX obj/src/node_base.builtin_info.o201[137/1871] CXX obj/deps/v8/src/torque/torque_base.types.o202[138/1871] CXX obj/src/api/node_base.utils.o203[139/1871] CXX obj/deps/ncrypto/ncrypto.ncrypto.o204[140/1871] CXX obj/src/node_base.embedded_data.o205[141/1871] CXX obj/gen/src/node/inspector/protocol/node_base.Storage.o206In file included from ../../src/util.h:29,207 from ../../src/inspector/node_string.h:10,208 from gen/src/node/inspector/protocol/Forward.h:19,209 from gen/src/node/inspector/protocol/Protocol.h:18,210 from gen/src/node/inspector/protocol/Storage.h:10,211 from gen/src/node/inspector/protocol/Storage.cpp:7:212../../deps/v8/include/v8-profiler.h: In constructor 'v8::HeapProfiler::HeapSnapshotOptions::HeapSnapshotOptions()':213../../deps/v8/include/v8-profiler.h:1128:27: warning: 'v8::HeapProfiler::HeapSnapshotOptions::global_object_name_resolver' is deprecated: Use context_name_resolver callback instead. [-Wdeprecated-declarations]214 1128 | HeapSnapshotOptions() {}215 | ^216../../deps/v8/include/v8-profiler.h:1142:25: note: declared here217 1142 | ObjectNameResolver* global_object_name_resolver = nullptr;218 | ^~~~~~~~~~~~~~~~~~~~~~~~~~~219../../deps/v8/include/v8-profiler.h:1128:27: warning: 'v8::HeapProfiler::HeapSnapshotOptions::global_object_name_resolver' is deprecated: Use context_name_resolver callback instead. [-Wdeprecated-declarations]220 1128 | HeapSnapshotOptions() {}221 | ^222../../deps/v8/include/v8-profiler.h:1142:25: note: declared here223 1142 | ObjectNameResolver* global_object_name_resolver = nullptr;224 | ^~~~~~~~~~~~~~~~~~~~~~~~~~~225[142/1871] CXX obj/gen/src/node/inspector/protocol/node_base.IO.o226In file included from ../../src/util.h:29,227 from ../../src/inspector/node_string.h:10,228 from gen/src/node/inspector/protocol/Forward.h:19,229 from gen/src/node/inspector/protocol/Protocol.h:18,230 from gen/src/node/inspector/protocol/IO.h:10,231 from gen/src/node/inspector/protocol/IO.cpp:7:232../../deps/v8/include/v8-profiler.h: In constructor 'v8::HeapProfiler::HeapSnapshotOptions::HeapSnapshotOptions()':233../../deps/v8/include/v8-profiler.h:1128:27: warning: 'v8::HeapProfiler::HeapSnapshotOptions::global_object_name_resolver' is deprecated: Use context_name_resolver callback instead. [-Wdeprecated-declarations]234 1128 | HeapSnapshotOptions() {}235 | ^236../../deps/v8/include/v8-profiler.h:1142:25: note: declared here237 1142 | ObjectNameResolver* global_object_name_resolver = nullptr;238 | ^~~~~~~~~~~~~~~~~~~~~~~~~~~239../../deps/v8/include/v8-profiler.h:1128:27: warning: 'v8::HeapProfiler::HeapSnapshotOptions::global_object_name_resolver' is deprecated: Use context_name_resolver callback instead. [-Wdeprecated-declarations]240 1128 | HeapSnapshotOptions() {}241 | ^242../../deps/v8/include/v8-profiler.h:1142:25: note: declared here243 1142 | ObjectNameResolver* global_object_name_resolver = nullptr;244 | ^~~~~~~~~~~~~~~~~~~~~~~~~~~245[143/1871] CXX obj/src/node_base.cleanup_queue.o246In file included from ../../src/memory_tracker.h:6,247 from ../../src/cleanup_queue.h:11,248 from ../../src/cleanup_queue.cc:1:249../../deps/v8/include/v8-profiler.h: In constructor 'v8::HeapProfiler::HeapSnapshotOptions::HeapSnapshotOptions()':250../../deps/v8/include/v8-profiler.h:1128:27: warning: 'v8::HeapProfiler::HeapSnapshotOptions::global_object_name_resolver' is deprecated: Use context_name_resolver callback instead. [-Wdeprecated-declarations]251 1128 | HeapSnapshotOptions() {}252 | ^253../../deps/v8/include/v8-profiler.h:1142:25: note: declared here254 1142 | ObjectNameResolver* global_object_name_resolver = nullptr;255 | ^~~~~~~~~~~~~~~~~~~~~~~~~~~256../../deps/v8/include/v8-profiler.h:1128:27: warning: 'v8::HeapProfiler::HeapSnapshotOptions::global_object_name_resolver' is deprecated: Use context_name_resolver callback instead. [-Wdeprecated-declarations]257 1128 | HeapSnapshotOptions() {}258 | ^259../../deps/v8/include/v8-profiler.h:1142:25: note: declared here260 1142 | ObjectNameResolver* global_object_name_resolver = nullptr;261 | ^~~~~~~~~~~~~~~~~~~~~~~~~~~262[144/1871] CXX obj/gen/src/node/inspector/protocol/node_base.NodeTracing.o263In file included from ../../src/util.h:29,264 from ../../src/inspector/node_string.h:10,265 from gen/src/node/inspector/protocol/Forward.h:19,266 from gen/src/node/inspector/protocol/Protocol.h:18,267 from gen/src/node/inspector/protocol/NodeTracing.h:10,268 from gen/src/node/inspector/protocol/NodeTracing.cpp:7:269../../deps/v8/include/v8-profiler.h: In constructor 'v8::HeapProfiler::HeapSnapshotOptions::HeapSnapshotOptions()':270../../deps/v8/include/v8-profiler.h:1128:27: warning: 'v8::HeapProfiler::HeapSnapshotOptions::global_object_name_resolver' is deprecated: Use context_name_resolver callback instead. [-Wdeprecated-declarations]271 1128 | HeapSnapshotOptions() {}272 | ^273../../deps/v8/include/v8-profiler.h:1142:25: note: declared here274 1142 | ObjectNameResolver* global_object_name_resolver = nullptr;275 | ^~~~~~~~~~~~~~~~~~~~~~~~~~~276../../deps/v8/include/v8-profiler.h:1128:27: warning: 'v8::HeapProfiler::HeapSnapshotOptions::global_object_name_resolver' is deprecated: Use context_name_resolver callback instead. [-Wdeprecated-declarations]277 1128 | HeapSnapshotOptions() {}278 | ^279../../deps/v8/include/v8-profiler.h:1142:25: note: declared here280 1142 | ObjectNameResolver* global_object_name_resolver = nullptr;281 | ^~~~~~~~~~~~~~~~~~~~~~~~~~~282[145/1871] CXX obj/gen/src/node/inspector/protocol/node_base.NodeRuntime.o283In file included from ../../src/util.h:29,284 from ../../src/inspector/node_string.h:10,285 from gen/src/node/inspector/protocol/Forward.h:19,286 from gen/src/node/inspector/protocol/Protocol.h:18,287 from gen/src/node/inspector/protocol/NodeRuntime.h:10,288 from gen/src/node/inspector/protocol/NodeRuntime.cpp:7:289../../deps/v8/include/v8-profiler.h: In constructor 'v8::HeapProfiler::HeapSnapshotOptions::HeapSnapshotOptions()':290../../deps/v8/include/v8-profiler.h:1128:27: warning: 'v8::HeapProfiler::HeapSnapshotOptions::global_object_name_resolver' is deprecated: Use context_name_resolver callback instead. [-Wdeprecated-declarations]291 1128 | HeapSnapshotOptions() {}292 | ^293../../deps/v8/include/v8-profiler.h:1142:25: note: declared here294 1142 | ObjectNameResolver* global_object_name_resolver = nullptr;295 | ^~~~~~~~~~~~~~~~~~~~~~~~~~~296../../deps/v8/include/v8-profiler.h:1128:27: warning: 'v8::HeapProfiler::HeapSnapshotOptions::global_object_name_resolver' is deprecated: Use context_name_resolver callback instead. [-Wdeprecated-declarations]297 1128 | HeapSnapshotOptions() {}298 | ^299../../deps/v8/include/v8-profiler.h:1142:25: note: declared here300 1142 | ObjectNameResolver* global_object_name_resolver = nullptr;301 | ^~~~~~~~~~~~~~~~~~~~~~~~~~~302[146/1871] CXX obj/gen/src/node/inspector/protocol/node_base.Target.o303In file included from ../../src/util.h:29,304 from ../../src/inspector/node_string.h:10,305 from gen/src/node/inspector/protocol/Forward.h:19,306 from gen/src/node/inspector/protocol/Protocol.h:18,307 from gen/src/node/inspector/protocol/Target.h:10,308 from gen/src/node/inspector/protocol/Target.cpp:7:309../../deps/v8/include/v8-profiler.h: In constructor 'v8::HeapProfiler::HeapSnapshotOptions::HeapSnapshotOptions()':310../../deps/v8/include/v8-profiler.h:1128:27: warning: 'v8::HeapProfiler::HeapSnapshotOptions::global_object_name_resolver' is deprecated: Use context_name_resolver callback instead. [-Wdeprecated-declarations]311 1128 | HeapSnapshotOptions() {}312 | ^313../../deps/v8/include/v8-profiler.h:1142:25: note: declared here314 1142 | ObjectNameResolver* global_object_name_resolver = nullptr;315 | ^~~~~~~~~~~~~~~~~~~~~~~~~~~316../../deps/v8/include/v8-profiler.h:1128:27: warning: 'v8::HeapProfiler::HeapSnapshotOptions::global_object_name_resolver' is deprecated: Use context_name_resolver callback instead. [-Wdeprecated-declarations]317 1128 | HeapSnapshotOptions() {}318 | ^319../../deps/v8/include/v8-profiler.h:1142:25: note: declared here320 1142 | ObjectNameResolver* global_object_name_resolver = nullptr;321 | ^~~~~~~~~~~~~~~~~~~~~~~~~~~322[147/1871] CXX obj/gen/src/node/inspector/protocol/node_base.NodeWorker.o323In file included from ../../src/util.h:29,324 from ../../src/inspector/node_string.h:10,325 from gen/src/node/inspector/protocol/Forward.h:19,326 from gen/src/node/inspector/protocol/Protocol.h:18,327 from gen/src/node/inspector/protocol/NodeWorker.h:10,328 from gen/src/node/inspector/protocol/NodeWorker.cpp:7:329../../deps/v8/include/v8-profiler.h: In constructor 'v8::HeapProfiler::HeapSnapshotOptions::HeapSnapshotOptions()':330../../deps/v8/include/v8-profiler.h:1128:27: warning: 'v8::HeapProfiler::HeapSnapshotOptions::global_object_name_resolver' is deprecated: Use context_name_resolver callback instead. [-Wdeprecated-declarations]331 1128 | HeapSnapshotOptions() {}332 | ^333../../deps/v8/include/v8-profiler.h:1142:25: note: declared here334 1142 | ObjectNameResolver* global_object_name_resolver = nullptr;335 | ^~~~~~~~~~~~~~~~~~~~~~~~~~~336../../deps/v8/include/v8-profiler.h:1128:27: warning: 'v8::HeapProfiler::HeapSnapshotOptions::global_object_name_resolver' is deprecated: Use context_name_resolver callback instead. [-Wdeprecated-declarations]337 1128 | HeapSnapshotOptions() {}338 | ^339../../deps/v8/include/v8-profiler.h:1142:25: note: declared here340 1142 | ObjectNameResolver* global_object_name_resolver = nullptr;341 | ^~~~~~~~~~~~~~~~~~~~~~~~~~~342[148/1871] CXX obj/gen/src/node/inspector/protocol/node_base.DOMStorage.o343In file included from ../../src/util.h:29,344 from ../../src/inspector/node_string.h:10,345 from gen/src/node/inspector/protocol/Forward.h:19,346 from gen/src/node/inspector/protocol/Protocol.h:18,347 from gen/src/node/inspector/protocol/DOMStorage.h:10,348 from gen/src/node/inspector/protocol/DOMStorage.cpp:7:349../../deps/v8/include/v8-profiler.h: In constructor 'v8::HeapProfiler::HeapSnapshotOptions::HeapSnapshotOptions()':350../../deps/v8/include/v8-profiler.h:1128:27: warning: 'v8::HeapProfiler::HeapSnapshotOptions::global_object_name_resolver' is deprecated: Use context_name_resolver callback instead. [-Wdeprecated-declarations]351 1128 | HeapSnapshotOptions() {}352 | ^353../../deps/v8/include/v8-profiler.h:1142:25: note: declared here354 1142 | ObjectNameResolver* global_object_name_resolver = nullptr;355 | ^~~~~~~~~~~~~~~~~~~~~~~~~~~356../../deps/v8/include/v8-profiler.h:1128:27: warning: 'v8::HeapProfiler::HeapSnapshotOptions::global_object_name_resolver' is deprecated: Use context_name_resolver callback instead. [-Wdeprecated-declarations]357 1128 | HeapSnapshotOptions() {}358 | ^359../../deps/v8/include/v8-profiler.h:1142:25: note: declared here360 1142 | ObjectNameResolver* global_object_name_resolver = nullptr;361 | ^~~~~~~~~~~~~~~~~~~~~~~~~~~362[149/1871] CXX obj/gen/src/node/inspector/protocol/node_base.Network.o363In file included from ../../src/util.h:29,364 from ../../src/inspector/node_string.h:10,365 from gen/src/node/inspector/protocol/Forward.h:19,366 from gen/src/node/inspector/protocol/Protocol.h:18,367 from gen/src/node/inspector/protocol/Network.h:10,368 from gen/src/node/inspector/protocol/Network.cpp:7:369../../deps/v8/include/v8-profiler.h: In constructor 'v8::HeapProfiler::HeapSnapshotOptions::HeapSnapshotOptions()':370../../deps/v8/include/v8-profiler.h:1128:27: warning: 'v8::HeapProfiler::HeapSnapshotOptions::global_object_name_resolver' is deprecated: Use context_name_resolver callback instead. [-Wdeprecated-declarations]371 1128 | HeapSnapshotOptions() {}372 | ^373../../deps/v8/include/v8-profiler.h:1142:25: note: declared here374 1142 | ObjectNameResolver* global_object_name_resolver = nullptr;375 | ^~~~~~~~~~~~~~~~~~~~~~~~~~~376../../deps/v8/include/v8-profiler.h:1128:27: warning: 'v8::HeapProfiler::HeapSnapshotOptions::global_object_name_resolver' is deprecated: Use context_name_resolver callback instead. [-Wdeprecated-declarations]377 1128 | HeapSnapshotOptions() {}378 | ^379../../deps/v8/include/v8-profiler.h:1142:25: note: declared here380 1142 | ObjectNameResolver* global_object_name_resolver = nullptr;381 | ^~~~~~~~~~~~~~~~~~~~~~~~~~~382[150/1871] CXX obj/gen/src/node/inspector/protocol/node_base.Protocol.o383In file included from ../../src/util.h:29,384 from ../../src/inspector/node_string.h:10,385 from gen/src/node/inspector/protocol/Forward.h:19,386 from gen/src/node/inspector/protocol/Protocol.h:18,387 from gen/src/node/inspector/protocol/Protocol.cpp:7:388../../deps/v8/include/v8-profiler.h: In constructor 'v8::HeapProfiler::HeapSnapshotOptions::HeapSnapshotOptions()':389../../deps/v8/include/v8-profiler.h:1128:27: warning: 'v8::HeapProfiler::HeapSnapshotOptions::global_object_name_resolver' is deprecated: Use context_name_resolver callback instead. [-Wdeprecated-declarations]390 1128 | HeapSnapshotOptions() {}391 | ^392../../deps/v8/include/v8-profiler.h:1142:25: note: declared here393 1142 | ObjectNameResolver* global_object_name_resolver = nullptr;394 | ^~~~~~~~~~~~~~~~~~~~~~~~~~~395../../deps/v8/include/v8-profiler.h:1128:27: warning: 'v8::HeapProfiler::HeapSnapshotOptions::global_object_name_resolver' is deprecated: Use context_name_resolver callback instead. [-Wdeprecated-declarations]396 1128 | HeapSnapshotOptions() {}397 | ^398../../deps/v8/include/v8-profiler.h:1142:25: note: declared here399 1142 | ObjectNameResolver* global_object_name_resolver = nullptr;400 | ^~~~~~~~~~~~~~~~~~~~~~~~~~~401[151/1871] CXX obj/src/node_base.internal_only_v8.o402In file included from ../../src/util.h:29,403 from ../../src/util-inl.h:33,404 from ../../src/internal_only_v8.cc:3:405../../deps/v8/include/v8-profiler.h: In constructor 'v8::HeapProfiler::HeapSnapshotOptions::HeapSnapshotOptions()':406../../deps/v8/include/v8-profiler.h:1128:27: warning: 'v8::HeapProfiler::HeapSnapshotOptions::global_object_name_resolver' is deprecated: Use context_name_resolver callback instead. [-Wdeprecated-declarations]407 1128 | HeapSnapshotOptions() {}408 | ^409../../deps/v8/include/v8-profiler.h:1142:25: note: declared here410 1142 | ObjectNameResolver* global_object_name_resolver = nullptr;411 | ^~~~~~~~~~~~~~~~~~~~~~~~~~~412../../deps/v8/include/v8-profiler.h:1128:27: warning: 'v8::HeapProfiler::HeapSnapshotOptions::global_object_name_resolver' is deprecated: Use context_name_resolver callback instead. [-Wdeprecated-declarations]413 1128 | HeapSnapshotOptions() {}414 | ^415../../deps/v8/include/v8-profiler.h:1142:25: note: declared here416 1142 | ObjectNameResolver* global_object_name_resolver = nullptr;417 | ^~~~~~~~~~~~~~~~~~~~~~~~~~~418[152/1871] CXX obj/src/node_base.json_utils.o419[153/1871] CXX obj/src/node_base.connect_wrap.o420In file included from ../../src/memory_tracker.h:6,421 from ../../src/base_object.h:29,422 from ../../src/async_wrap.h:27,423 from ../../src/req_wrap.h:6,424 from ../../src/req_wrap-inl.h:6,425 from ../../src/connect_wrap.h:6,426 from ../../src/connect_wrap.cc:1:427../../deps/v8/include/v8-profiler.h: In constructor 'v8::HeapProfiler::HeapSnapshotOptions::HeapSnapshotOptions()':428../../deps/v8/include/v8-profiler.h:1128:27: warning: 'v8::HeapProfiler::HeapSnapshotOptions::global_object_name_resolver' is deprecated: Use context_name_resolver callback instead. [-Wdeprecated-declarations]429 1128 | HeapSnapshotOptions() {}430 | ^431../../deps/v8/include/v8-profiler.h:1142:25: note: declared here432 1142 | ObjectNameResolver* global_object_name_resolver = nullptr;433 | ^~~~~~~~~~~~~~~~~~~~~~~~~~~434../../deps/v8/include/v8-profiler.h:1128:27: warning: 'v8::HeapProfiler::HeapSnapshotOptions::global_object_name_resolver' is deprecated: Use context_name_resolver callback instead. [-Wdeprecated-declarations]435 1128 | HeapSnapshotOptions() {}436 | ^437../../deps/v8/include/v8-profiler.h:1142:25: note: declared here438 1142 | ObjectNameResolver* global_object_name_resolver = nullptr;439 | ^~~~~~~~~~~~~~~~~~~~~~~~~~~440[154/1871] CXX obj/src/api/node_base.encoding.o441In file included from ../../src/memory_tracker.h:6,442 from ../../src/aliased_buffer.h:7,443 from ../../src/aliased_buffer-inl.h:6,444 from ../../src/env-inl.h:27,445 from ../../src/string_bytes.h:30,446 from ../../src/api/encoding.cc:2:447../../deps/v8/include/v8-profiler.h: In constructor 'v8::HeapProfiler::HeapSnapshotOptions::HeapSnapshotOptions()':448../../deps/v8/include/v8-profiler.h:1128:27: warning: 'v8::HeapProfiler::HeapSnapshotOptions::global_object_name_resolver' is deprecated: Use context_name_resolver callback instead. [-Wdeprecated-declarations]449 1128 | HeapSnapshotOptions() {}450 | ^451../../deps/v8/include/v8-profiler.h:1142:25: note: declared here452 1142 | ObjectNameResolver* global_object_name_resolver = nullptr;453 | ^~~~~~~~~~~~~~~~~~~~~~~~~~~454../../deps/v8/include/v8-profiler.h:1128:27: warning: 'v8::HeapProfiler::HeapSnapshotOptions::global_object_name_resolver' is deprecated: Use context_name_resolver callback instead. [-Wdeprecated-declarations]455 1128 | HeapSnapshotOptions() {}456 | ^457../../deps/v8/include/v8-profiler.h:1142:25: note: declared here458 1142 | ObjectNameResolver* global_object_name_resolver = nullptr;459 | ^~~~~~~~~~~~~~~~~~~~~~~~~~~460[155/1871] CXX obj/src/api/node_base.callback.o461In file included from ../../src/memory_tracker.h:6,462 from ../../src/base_object.h:29,463 from ../../src/async_context_frame.h:6,464 from ../../src/api/callback.cc:1:465../../deps/v8/include/v8-profiler.h: In constructor 'v8::HeapProfiler::HeapSnapshotOptions::HeapSnapshotOptions()':466../../deps/v8/include/v8-profiler.h:1128:27: warning: 'v8::HeapProfiler::HeapSnapshotOptions::global_object_name_resolver' is deprecated: Use context_name_resolver callback instead. [-Wdeprecated-declarations]467 1128 | HeapSnapshotOptions() {}468 | ^469../../deps/v8/include/v8-profiler.h:1142:25: note: declared here470 1142 | ObjectNameResolver* global_object_name_resolver = nullptr;471 | ^~~~~~~~~~~~~~~~~~~~~~~~~~~472../../deps/v8/include/v8-profiler.h:1128:27: warning: 'v8::HeapProfiler::HeapSnapshotOptions::global_object_name_resolver' is deprecated: Use context_name_resolver callback instead. [-Wdeprecated-declarations]473 1128 | HeapSnapshotOptions() {}474 | ^475../../deps/v8/include/v8-profiler.h:1142:25: note: declared here476 1142 | ObjectNameResolver* global_object_name_resolver = nullptr;477 | ^~~~~~~~~~~~~~~~~~~~~~~~~~~478[156/1871] CXX obj/src/node_base.connection_wrap.o479In file included from ../../src/memory_tracker.h:6,480 from ../../src/aliased_buffer.h:7,481 from ../../src/env.h:27,482 from ../../src/stream_base.h:6,483 from ../../src/stream_wrap.h:27,484 from ../../src/connection_wrap.h:6,485 from ../../src/connection_wrap.cc:1:486../../deps/v8/include/v8-profiler.h: In constructor 'v8::HeapProfiler::HeapSnapshotOptions::HeapSnapshotOptions()':487../../deps/v8/include/v8-profiler.h:1128:27: warning: 'v8::HeapProfiler::HeapSnapshotOptions::global_object_name_resolver' is deprecated: Use context_name_resolver callback instead. [-Wdeprecated-declarations]488 1128 | HeapSnapshotOptions() {}489 | ^490../../deps/v8/include/v8-profiler.h:1142:25: note: declared here491 1142 | ObjectNameResolver* global_object_name_resolver = nullptr;492 | ^~~~~~~~~~~~~~~~~~~~~~~~~~~493../../deps/v8/include/v8-profiler.h:1128:27: warning: 'v8::HeapProfiler::HeapSnapshotOptions::global_object_name_resolver' is deprecated: Use context_name_resolver callback instead. [-Wdeprecated-declarations]494 1128 | HeapSnapshotOptions() {}495 | ^496../../deps/v8/include/v8-profiler.h:1142:25: note: declared here497 1142 | ObjectNameResolver* global_object_name_resolver = nullptr;498 | ^~~~~~~~~~~~~~~~~~~~~~~~~~~499[157/1871] CXX obj/src/node_base.async_context_frame.o500In file included from ../../src/memory_tracker.h:6,501 from ../../src/base_object.h:29,502 from ../../src/async_context_frame.h:6,503 from ../../src/async_context_frame.cc:1:504../../deps/v8/include/v8-profiler.h: In constructor 'v8::HeapProfiler::HeapSnapshotOptions::HeapSnapshotOptions()':505../../deps/v8/include/v8-profiler.h:1128:27: warning: 'v8::HeapProfiler::HeapSnapshotOptions::global_object_name_resolver' is deprecated: Use context_name_resolver callback instead. [-Wdeprecated-declarations]506 1128 | HeapSnapshotOptions() {}507 | ^508../../deps/v8/include/v8-profiler.h:1142:25: note: declared here509 1142 | ObjectNameResolver* global_object_name_resolver = nullptr;510 | ^~~~~~~~~~~~~~~~~~~~~~~~~~~511../../deps/v8/include/v8-profiler.h:1128:27: warning: 'v8::HeapProfiler::HeapSnapshotOptions::global_object_name_resolver' is deprecated: Use context_name_resolver callback instead. [-Wdeprecated-declarations]512 1128 | HeapSnapshotOptions() {}513 | ^514../../deps/v8/include/v8-profiler.h:1142:25: note: declared here515 1142 | ObjectNameResolver* global_object_name_resolver = nullptr;516 | ^~~~~~~~~~~~~~~~~~~~~~~~~~~517[158/1871] CXX obj/src/api/node_base.embed_helpers.o518In file included from ../../src/memory_tracker.h:6,519 from ../../src/base_object.h:29,520 from ../../src/async_wrap.h:27,521 from ../../src/debug_utils.h:6,522 from ../../src/debug_utils-inl.h:6,523 from ../../src/api/embed_helpers.cc:1:524../../deps/v8/include/v8-profiler.h: In constructor 'v8::HeapProfiler::HeapSnapshotOptions::HeapSnapshotOptions()':525../../deps/v8/include/v8-profiler.h:1128:27: warning: 'v8::HeapProfiler::HeapSnapshotOptions::global_object_name_resolver' is deprecated: Use context_name_resolver callback instead. [-Wdeprecated-declarations]526 1128 | HeapSnapshotOptions() {}527 | ^528../../deps/v8/include/v8-profiler.h:1142:25: note: declared here529 1142 | ObjectNameResolver* global_object_name_resolver = nullptr;530 | ^~~~~~~~~~~~~~~~~~~~~~~~~~~531../../deps/v8/include/v8-profiler.h:1128:27: warning: 'v8::HeapProfiler::HeapSnapshotOptions::global_object_name_resolver' is deprecated: Use context_name_resolver callback instead. [-Wdeprecated-declarations]532 1128 | HeapSnapshotOptions() {}533 | ^534../../deps/v8/include/v8-profiler.h:1142:25: note: declared here535 1142 | ObjectNameResolver* global_object_name_resolver = nullptr;536 | ^~~~~~~~~~~~~~~~~~~~~~~~~~~537[159/1871] CXX obj/src/api/node_base.exceptions.o538In file included from ../../src/memory_tracker.h:6,539 from ../../src/aliased_buffer.h:7,540 from ../../src/aliased_buffer-inl.h:6,541 from ../../src/env-inl.h:27,542 from ../../src/api/exceptions.cc:3:543../../deps/v8/include/v8-profiler.h: In constructor 'v8::HeapProfiler::HeapSnapshotOptions::HeapSnapshotOptions()':544../../deps/v8/include/v8-profiler.h:1128:27: warning: 'v8::HeapProfiler::HeapSnapshotOptions::global_object_name_resolver' is deprecated: Use context_name_resolver callback instead. [-Wdeprecated-declarations]545 1128 | HeapSnapshotOptions() {}546 | ^547../../deps/v8/include/v8-profiler.h:1142:25: note: declared here548 1142 | ObjectNameResolver* global_object_name_resolver = nullptr;549 | ^~~~~~~~~~~~~~~~~~~~~~~~~~~550../../deps/v8/include/v8-profiler.h:1128:27: warning: 'v8::HeapProfiler::HeapSnapshotOptions::global_object_name_resolver' is deprecated: Use context_name_resolver callback instead. [-Wdeprecated-declarations]551 1128 | HeapSnapshotOptions() {}552 | ^553../../deps/v8/include/v8-profiler.h:1142:25: note: declared here554 1142 | ObjectNameResolver* global_object_name_resolver = nullptr;555 | ^~~~~~~~~~~~~~~~~~~~~~~~~~~556[160/1871] CXX obj/src/api/node_base.async_resource.o557In file included from ../../src/memory_tracker.h:6,558 from ../../src/base_object.h:29,559 from ../../src/async_context_frame.h:6,560 from ../../src/api/async_resource.cc:1:561../../deps/v8/include/v8-profiler.h: In constructor 'v8::HeapProfiler::HeapSnapshotOptions::HeapSnapshotOptions()':562../../deps/v8/include/v8-profiler.h:1128:27: warning: 'v8::HeapProfiler::HeapSnapshotOptions::global_object_name_resolver' is deprecated: Use context_name_resolver callback instead. [-Wdeprecated-declarations]563 1128 | HeapSnapshotOptions() {}564 | ^565../../deps/v8/include/v8-profiler.h:1142:25: note: declared here566 1142 | ObjectNameResolver* global_object_name_resolver = nullptr;567 | ^~~~~~~~~~~~~~~~~~~~~~~~~~~568../../deps/v8/include/v8-profiler.h:1128:27: warning: 'v8::HeapProfiler::HeapSnapshotOptions::global_object_name_resolver' is deprecated: Use context_name_resolver callback instead. [-Wdeprecated-declarations]569 1128 | HeapSnapshotOptions() {}570 | ^571../../deps/v8/include/v8-profiler.h:1142:25: note: declared here572 1142 | ObjectNameResolver* global_object_name_resolver = nullptr;573 | ^~~~~~~~~~~~~~~~~~~~~~~~~~~574[161/1871] CXX obj/src/node_base.base_object.o575In file included from ../../src/memory_tracker.h:6,576 from ../../src/base_object.h:29,577 from ../../src/base_object.cc:1:578../../deps/v8/include/v8-profiler.h: In constructor 'v8::HeapProfiler::HeapSnapshotOptions::HeapSnapshotOptions()':579../../deps/v8/include/v8-profiler.h:1128:27: warning: 'v8::HeapProfiler::HeapSnapshotOptions::global_object_name_resolver' is deprecated: Use context_name_resolver callback instead. [-Wdeprecated-declarations]580 1128 | HeapSnapshotOptions() {}581 | ^582../../deps/v8/include/v8-profiler.h:1142:25: note: declared here583 1142 | ObjectNameResolver* global_object_name_resolver = nullptr;584 | ^~~~~~~~~~~~~~~~~~~~~~~~~~~585../../deps/v8/include/v8-profiler.h:1128:27: warning: 'v8::HeapProfiler::HeapSnapshotOptions::global_object_name_resolver' is deprecated: Use context_name_resolver callback instead. [-Wdeprecated-declarations]586 1128 | HeapSnapshotOptions() {}587 | ^588../../deps/v8/include/v8-profiler.h:1142:25: note: declared here589 1142 | ObjectNameResolver* global_object_name_resolver = nullptr;590 | ^~~~~~~~~~~~~~~~~~~~~~~~~~~591[162/1871] CXX obj/src/api/node_base.hooks.o592In file included from ../../src/memory_tracker.h:6,593 from ../../src/aliased_buffer.h:7,594 from ../../src/aliased_buffer-inl.h:6,595 from ../../src/env-inl.h:27,596 from ../../src/api/hooks.cc:1:597../../deps/v8/include/v8-profiler.h: In constructor 'v8::HeapProfiler::HeapSnapshotOptions::HeapSnapshotOptions()':598../../deps/v8/include/v8-profiler.h:1128:27: warning: 'v8::HeapProfiler::HeapSnapshotOptions::global_object_name_resolver' is deprecated: Use context_name_resolver callback instead. [-Wdeprecated-declarations]599 1128 | HeapSnapshotOptions() {}600 | ^601../../deps/v8/include/v8-profiler.h:1142:25: note: declared here602 1142 | ObjectNameResolver* global_object_name_resolver = nullptr;603 | ^~~~~~~~~~~~~~~~~~~~~~~~~~~604../../deps/v8/include/v8-profiler.h:1128:27: warning: 'v8::HeapProfiler::HeapSnapshotOptions::global_object_name_resolver' is deprecated: Use context_name_resolver callback instead. [-Wdeprecated-declarations]605 1128 | HeapSnapshotOptions() {}606 | ^607../../deps/v8/include/v8-profiler.h:1142:25: note: declared here608 1142 | ObjectNameResolver* global_object_name_resolver = nullptr;609 | ^~~~~~~~~~~~~~~~~~~~~~~~~~~610[163/1871] CXX obj/src/node_base.compile_cache.o611In file included from ../../src/memory_tracker.h:6,612 from ../../src/base_object.h:29,613 from ../../src/async_wrap.h:27,614 from ../../src/debug_utils.h:6,615 from ../../src/debug_utils-inl.h:6,616 from ../../src/compile_cache.cc:3:617../../deps/v8/include/v8-profiler.h: In constructor 'v8::HeapProfiler::HeapSnapshotOptions::HeapSnapshotOptions()':618../../deps/v8/include/v8-profiler.h:1128:27: warning: 'v8::HeapProfiler::HeapSnapshotOptions::global_object_name_resolver' is deprecated: Use context_name_resolver callback instead. [-Wdeprecated-declarations]619 1128 | HeapSnapshotOptions() {}620 | ^621../../deps/v8/include/v8-profiler.h:1142:25: note: declared here622 1142 | ObjectNameResolver* global_object_name_resolver = nullptr;623 | ^~~~~~~~~~~~~~~~~~~~~~~~~~~624../../deps/v8/include/v8-profiler.h:1128:27: warning: 'v8::HeapProfiler::HeapSnapshotOptions::global_object_name_resolver' is deprecated: Use context_name_resolver callback instead. [-Wdeprecated-declarations]625 1128 | HeapSnapshotOptions() {}626 | ^627../../deps/v8/include/v8-profiler.h:1142:25: note: declared here628 1142 | ObjectNameResolver* global_object_name_resolver = nullptr;629 | ^~~~~~~~~~~~~~~~~~~~~~~~~~~630[164/1871] CXX obj/src/node_base.node_debug.o631[165/1871] CXX obj/src/node_base.debug_utils.o632In file included from ../../src/memory_tracker.h:6,633 from ../../src/base_object.h:29,634 from ../../src/async_wrap.h:27,635 from ../../src/debug_utils.h:6,636 from ../../src/debug_utils-inl.h:6,637 from ../../src/debug_utils.cc:1:638../../deps/v8/include/v8-profiler.h: In constructor 'v8::HeapProfiler::HeapSnapshotOptions::HeapSnapshotOptions()':639../../deps/v8/include/v8-profiler.h:1128:27: warning: 'v8::HeapProfiler::HeapSnapshotOptions::global_object_name_resolver' is deprecated: Use context_name_resolver callback instead. [-Wdeprecated-declarations]640 1128 | HeapSnapshotOptions() {}641 | ^642../../deps/v8/include/v8-profiler.h:1142:25: note: declared here643 1142 | ObjectNameResolver* global_object_name_resolver = nullptr;644 | ^~~~~~~~~~~~~~~~~~~~~~~~~~~645../../deps/v8/include/v8-profiler.h:1128:27: warning: 'v8::HeapProfiler::HeapSnapshotOptions::global_object_name_resolver' is deprecated: Use context_name_resolver callback instead. [-Wdeprecated-declarations]646 1128 | HeapSnapshotOptions() {}647 | ^648../../deps/v8/include/v8-profiler.h:1142:25: note: declared here649 1142 | ObjectNameResolver* global_object_name_resolver = nullptr;650 | ^~~~~~~~~~~~~~~~~~~~~~~~~~~651[166/1871] CXX obj/src/node_base.async_wrap.o652In file included from ../../src/memory_tracker.h:6,653 from ../../src/base_object.h:29,654 from ../../src/async_wrap.h:27,655 from ../../src/async_wrap.cc:22:656../../deps/v8/include/v8-profiler.h: In constructor 'v8::HeapProfiler::HeapSnapshotOptions::HeapSnapshotOptions()':657../../deps/v8/include/v8-profiler.h:1128:27: warning: 'v8::HeapProfiler::HeapSnapshotOptions::global_object_name_resolver' is deprecated: Use context_name_resolver callback instead. [-Wdeprecated-declarations]658 1128 | HeapSnapshotOptions() {}659 | ^660../../deps/v8/include/v8-profiler.h:1142:25: note: declared here661 1142 | ObjectNameResolver* global_object_name_resolver = nullptr;662 | ^~~~~~~~~~~~~~~~~~~~~~~~~~~663../../deps/v8/include/v8-profiler.h:1128:27: warning: 'v8::HeapProfiler::HeapSnapshotOptions::global_object_name_resolver' is deprecated: Use context_name_resolver callback instead. [-Wdeprecated-declarations]664 1128 | HeapSnapshotOptions() {}665 | ^666../../deps/v8/include/v8-profiler.h:1142:25: note: declared here667 1142 | ObjectNameResolver* global_object_name_resolver = nullptr;668 | ^~~~~~~~~~~~~~~~~~~~~~~~~~~669[167/1871] CXX obj/src/api/node_base.environment.o670In file included from ../../src/memory_tracker.h:6,671 from ../../src/base_object.h:29,672 from ../../src/async_wrap.h:27,673 from ../../src/crypto/crypto_util.h:6,674 from ../../src/api/environment.cc:3:675../../deps/v8/include/v8-profiler.h: In constructor 'v8::HeapProfiler::HeapSnapshotOptions::HeapSnapshotOptions()':676../../deps/v8/include/v8-profiler.h:1128:27: warning: 'v8::HeapProfiler::HeapSnapshotOptions::global_object_name_resolver' is deprecated: Use context_name_resolver callback instead. [-Wdeprecated-declarations]677 1128 | HeapSnapshotOptions() {}678 | ^679../../deps/v8/include/v8-profiler.h:1142:25: note: declared here680 1142 | ObjectNameResolver* global_object_name_resolver = nullptr;681 | ^~~~~~~~~~~~~~~~~~~~~~~~~~~682../../deps/v8/include/v8-profiler.h:1128:27: warning: 'v8::HeapProfiler::HeapSnapshotOptions::global_object_name_resolver' is deprecated: Use context_name_resolver callback instead. [-Wdeprecated-declarations]683 1128 | HeapSnapshotOptions() {}684 | ^685../../deps/v8/include/v8-profiler.h:1142:25: note: declared here686 1142 | ObjectNameResolver* global_object_name_resolver = nullptr;687 | ^~~~~~~~~~~~~~~~~~~~~~~~~~~688[168/1871] CXX obj/src/node_base.fs_event_wrap.o689In file included from ../../src/memory_tracker.h:6,690 from ../../src/base_object.h:29,691 from ../../src/async_wrap.h:27,692 from ../../src/async_wrap-inl.h:27,693 from ../../src/fs_event_wrap.cc:22:694../../deps/v8/include/v8-profiler.h: In constructor 'v8::HeapProfiler::HeapSnapshotOptions::HeapSnapshotOptions()':695../../deps/v8/include/v8-profiler.h:1128:27: warning: 'v8::HeapProfiler::HeapSnapshotOptions::global_object_name_resolver' is deprecated: Use context_name_resolver callback instead. [-Wdeprecated-declarations]696 1128 | HeapSnapshotOptions() {}697 | ^698../../deps/v8/include/v8-profiler.h:1142:25: note: declared here699 1142 | ObjectNameResolver* global_object_name_resolver = nullptr;700 | ^~~~~~~~~~~~~~~~~~~~~~~~~~~701../../deps/v8/include/v8-profiler.h:1128:27: warning: 'v8::HeapProfiler::HeapSnapshotOptions::global_object_name_resolver' is deprecated: Use context_name_resolver callback instead. [-Wdeprecated-declarations]702 1128 | HeapSnapshotOptions() {}703 | ^704../../deps/v8/include/v8-profiler.h:1142:25: note: declared here705 1142 | ObjectNameResolver* global_object_name_resolver = nullptr;706 | ^~~~~~~~~~~~~~~~~~~~~~~~~~~707[169/1871] CXX obj/src/dataqueue/node_base.queue.o708In file included from ../../src/memory_tracker.h:6,709 from ../../src/base_object.h:29,710 from ../../src/dataqueue/queue.h:5,711 from ../../src/dataqueue/queue.cc:1:712../../deps/v8/include/v8-profiler.h: In constructor 'v8::HeapProfiler::HeapSnapshotOptions::HeapSnapshotOptions()':713../../deps/v8/include/v8-profiler.h:1128:27: warning: 'v8::HeapProfiler::HeapSnapshotOptions::global_object_name_resolver' is deprecated: Use context_name_resolver callback instead. [-Wdeprecated-declarations]714 1128 | HeapSnapshotOptions() {}715 | ^716../../deps/v8/include/v8-profiler.h:1142:25: note: declared here717 1142 | ObjectNameResolver* global_object_name_resolver = nullptr;718 | ^~~~~~~~~~~~~~~~~~~~~~~~~~~719../../deps/v8/include/v8-profiler.h:1128:27: warning: 'v8::HeapProfiler::HeapSnapshotOptions::global_object_name_resolver' is deprecated: Use context_name_resolver callback instead. [-Wdeprecated-declarations]720 1128 | HeapSnapshotOptions() {}721 | ^722../../deps/v8/include/v8-profiler.h:1142:25: note: declared here723 1142 | ObjectNameResolver* global_object_name_resolver = nullptr;724 | ^~~~~~~~~~~~~~~~~~~~~~~~~~~725[170/1871] CXX obj/src/node_base.handle_wrap.o726In file included from ../../src/memory_tracker.h:6,727 from ../../src/base_object.h:29,728 from ../../src/async_wrap.h:27,729 from ../../src/handle_wrap.h:27,730 from ../../src/handle_wrap.cc:22:731../../deps/v8/include/v8-profiler.h: In constructor 'v8::HeapProfiler::HeapSnapshotOptions::HeapSnapshotOptions()':732../../deps/v8/include/v8-profiler.h:1128:27: warning: 'v8::HeapProfiler::HeapSnapshotOptions::global_object_name_resolver' is deprecated: Use context_name_resolver callback instead. [-Wdeprecated-declarations]733 1128 | HeapSnapshotOptions() {}734 | ^735../../deps/v8/include/v8-profiler.h:1142:25: note: declared here736 1142 | ObjectNameResolver* global_object_name_resolver = nullptr;737 | ^~~~~~~~~~~~~~~~~~~~~~~~~~~738../../deps/v8/include/v8-profiler.h:1128:27: warning: 'v8::HeapProfiler::HeapSnapshotOptions::global_object_name_resolver' is deprecated: Use context_name_resolver callback instead. [-Wdeprecated-declarations]739 1128 | HeapSnapshotOptions() {}740 | ^741../../deps/v8/include/v8-profiler.h:1142:25: note: declared here742 1142 | ObjectNameResolver* global_object_name_resolver = nullptr;743 | ^~~~~~~~~~~~~~~~~~~~~~~~~~~744[171/1871] CXX obj/src/node_base.js_stream.o745In file included from ../../src/memory_tracker.h:6,746 from ../../src/base_object.h:29,747 from ../../src/async_wrap.h:27,748 from ../../src/js_stream.h:6,749 from ../../src/js_stream.cc:1:750../../deps/v8/include/v8-profiler.h: In constructor 'v8::HeapProfiler::HeapSnapshotOptions::HeapSnapshotOptions()':751../../deps/v8/include/v8-profiler.h:1128:27: warning: 'v8::HeapProfiler::HeapSnapshotOptions::global_object_name_resolver' is deprecated: Use context_name_resolver callback instead. [-Wdeprecated-declarations]752 1128 | HeapSnapshotOptions() {}753 | ^754../../deps/v8/include/v8-profiler.h:1142:25: note: declared here755 1142 | ObjectNameResolver* global_object_name_resolver = nullptr;756 | ^~~~~~~~~~~~~~~~~~~~~~~~~~~757../../deps/v8/include/v8-profiler.h:1128:27: warning: 'v8::HeapProfiler::HeapSnapshotOptions::global_object_name_resolver' is deprecated: Use context_name_resolver callback instead. [-Wdeprecated-declarations]758 1128 | HeapSnapshotOptions() {}759 | ^760../../deps/v8/include/v8-profiler.h:1142:25: note: declared here761 1142 | ObjectNameResolver* global_object_name_resolver = nullptr;762 | ^~~~~~~~~~~~~~~~~~~~~~~~~~~763[172/1871] CXX obj/src/node_base.js_udp_wrap.o764In file included from ../../src/memory_tracker.h:6,765 from ../../src/base_object.h:29,766 from ../../src/async_wrap.h:27,767 from ../../src/handle_wrap.h:27,768 from ../../src/udp_wrap.h:27,769 from ../../src/js_udp_wrap.cc:1:770../../deps/v8/include/v8-profiler.h: In constructor 'v8::HeapProfiler::HeapSnapshotOptions::HeapSnapshotOptions()':771../../deps/v8/include/v8-profiler.h:1128:27: warning: 'v8::HeapProfiler::HeapSnapshotOptions::global_object_name_resolver' is deprecated: Use context_name_resolver callback instead. [-Wdeprecated-declarations]772 1128 | HeapSnapshotOptions() {}773 | ^774../../deps/v8/include/v8-profiler.h:1142:25: note: declared here775 1142 | ObjectNameResolver* global_object_name_resolver = nullptr;776 | ^~~~~~~~~~~~~~~~~~~~~~~~~~~777../../deps/v8/include/v8-profiler.h:1128:27: warning: 'v8::HeapProfiler::HeapSnapshotOptions::global_object_name_resolver' is deprecated: Use context_name_resolver callback instead. [-Wdeprecated-declarations]778 1128 | HeapSnapshotOptions() {}779 | ^780../../deps/v8/include/v8-profiler.h:1142:25: note: declared here781 1142 | ObjectNameResolver* global_object_name_resolver = nullptr;782 | ^~~~~~~~~~~~~~~~~~~~~~~~~~~783[173/1871] CXX obj/src/node_base.heap_utils.o784In file included from ../../src/memory_tracker.h:6,785 from ../../src/aliased_buffer.h:7,786 from ../../src/env.h:27,787 from ../../src/node_internals.h:27,788 from ../../src/diagnosticfilename-inl.h:6,789 from ../../src/heap_utils.cc:1:790../../deps/v8/include/v8-profiler.h: In constructor 'v8::HeapProfiler::HeapSnapshotOptions::HeapSnapshotOptions()':791../../deps/v8/include/v8-profiler.h:1128:27: warning: 'v8::HeapProfiler::HeapSnapshotOptions::global_object_name_resolver' is deprecated: Use context_name_resolver callback instead. [-Wdeprecated-declarations]792 1128 | HeapSnapshotOptions() {}793 | ^794../../deps/v8/include/v8-profiler.h:1142:25: note: declared here795 1142 | ObjectNameResolver* global_object_name_resolver = nullptr;796 | ^~~~~~~~~~~~~~~~~~~~~~~~~~~797../../deps/v8/include/v8-profiler.h:1128:27: warning: 'v8::HeapProfiler::HeapSnapshotOptions::global_object_name_resolver' is deprecated: Use context_name_resolver callback instead. [-Wdeprecated-declarations]798 1128 | HeapSnapshotOptions() {}799 | ^800../../deps/v8/include/v8-profiler.h:1142:25: note: declared here801 1142 | ObjectNameResolver* global_object_name_resolver = nullptr;802 | ^~~~~~~~~~~~~~~~~~~~~~~~~~~803[174/1871] CXX obj/src/node_base.encoding_binding.o804In file included from ../../src/memory_tracker.h:6,805 from ../../src/aliased_buffer.h:7,806 from ../../src/encoding_binding.h:7,807 from ../../src/encoding_binding.cc:1:808../../deps/v8/include/v8-profiler.h: In constructor 'v8::HeapProfiler::HeapSnapshotOptions::HeapSnapshotOptions()':809../../deps/v8/include/v8-profiler.h:1128:27: warning: 'v8::HeapProfiler::HeapSnapshotOptions::global_object_name_resolver' is deprecated: Use context_name_resolver callback instead. [-Wdeprecated-declarations]810 1128 | HeapSnapshotOptions() {}811 | ^812../../deps/v8/include/v8-profiler.h:1142:25: note: declared here813 1142 | ObjectNameResolver* global_object_name_resolver = nullptr;814 | ^~~~~~~~~~~~~~~~~~~~~~~~~~~815../../deps/v8/include/v8-profiler.h:1128:27: warning: 'v8::HeapProfiler::HeapSnapshotOptions::global_object_name_resolver' is deprecated: Use context_name_resolver callback instead. [-Wdeprecated-declarations]816 1128 | HeapSnapshotOptions() {}817 | ^818../../deps/v8/include/v8-profiler.h:1142:25: note: declared here819 1142 | ObjectNameResolver* global_object_name_resolver = nullptr;820 | ^~~~~~~~~~~~~~~~~~~~~~~~~~~821[175/1871] CXX obj/src/node_base.histogram.o822In file included from ../../src/memory_tracker.h:6,823 from ../../src/base_object.h:29,824 from ../../src/histogram.h:7,825 from ../../src/histogram.cc:1:826../../deps/v8/include/v8-profiler.h: In constructor 'v8::HeapProfiler::HeapSnapshotOptions::HeapSnapshotOptions()':827../../deps/v8/include/v8-profiler.h:1128:27: warning: 'v8::HeapProfiler::HeapSnapshotOptions::global_object_name_resolver' is deprecated: Use context_name_resolver callback instead. [-Wdeprecated-declarations]828 1128 | HeapSnapshotOptions() {}829 | ^830../../deps/v8/include/v8-profiler.h:1142:25: note: declared here831 1142 | ObjectNameResolver* global_object_name_resolver = nullptr;832 | ^~~~~~~~~~~~~~~~~~~~~~~~~~~833../../deps/v8/include/v8-profiler.h:1128:27: warning: 'v8::HeapProfiler::HeapSnapshotOptions::global_object_name_resolver' is deprecated: Use context_name_resolver callback instead. [-Wdeprecated-declarations]834 1128 | HeapSnapshotOptions() {}835 | ^836../../deps/v8/include/v8-profiler.h:1142:25: note: declared here837 1142 | ObjectNameResolver* global_object_name_resolver = nullptr;838 | ^~~~~~~~~~~~~~~~~~~~~~~~~~~839[176/1871] CXX obj/src/node_base.js_native_api_v8.o840In file included from ../../src/memory_tracker.h:6,841 from ../../src/aliased_buffer.h:7,842 from ../../src/aliased_buffer-inl.h:6,843 from ../../src/env-inl.h:27,844 from ../../src/js_native_api_v8.cc:7:845../../deps/v8/include/v8-profiler.h: In constructor 'v8::HeapProfiler::HeapSnapshotOptions::HeapSnapshotOptions()':846../../deps/v8/include/v8-profiler.h:1128:27: warning: 'v8::HeapProfiler::HeapSnapshotOptions::global_object_name_resolver' is deprecated: Use context_name_resolver callback instead. [-Wdeprecated-declarations]847 1128 | HeapSnapshotOptions() {}848 | ^849../../deps/v8/include/v8-profiler.h:1142:25: note: declared here850 1142 | ObjectNameResolver* global_object_name_resolver = nullptr;851 | ^~~~~~~~~~~~~~~~~~~~~~~~~~~852../../deps/v8/include/v8-profiler.h:1128:27: warning: 'v8::HeapProfiler::HeapSnapshotOptions::global_object_name_resolver' is deprecated: Use context_name_resolver callback instead. [-Wdeprecated-declarations]853 1128 | HeapSnapshotOptions() {}854 | ^855../../deps/v8/include/v8-profiler.h:1142:25: note: declared here856 1142 | ObjectNameResolver* global_object_name_resolver = nullptr;857 | ^~~~~~~~~~~~~~~~~~~~~~~~~~~858[177/1871] CXX obj/src/node_base.node_file_utils.o859In file included from ../../src/util.h:29,860 from ../../src/util-inl.h:33,861 from ../../src/node_file_utils.cc:10:862../../deps/v8/include/v8-profiler.h: In constructor 'v8::HeapProfiler::HeapSnapshotOptions::HeapSnapshotOptions()':863../../deps/v8/include/v8-profiler.h:1128:27: warning: 'v8::HeapProfiler::HeapSnapshotOptions::global_object_name_resolver' is deprecated: Use context_name_resolver callback instead. [-Wdeprecated-declarations]864 1128 | HeapSnapshotOptions() {}865 | ^866../../deps/v8/include/v8-profiler.h:1142:25: note: declared here867 1142 | ObjectNameResolver* global_object_name_resolver = nullptr;868 | ^~~~~~~~~~~~~~~~~~~~~~~~~~~869../../deps/v8/include/v8-profiler.h:1128:27: warning: 'v8::HeapProfiler::HeapSnapshotOptions::global_object_name_resolver' is deprecated: Use context_name_resolver callback instead. [-Wdeprecated-declarations]870 1128 | HeapSnapshotOptions() {}871 | ^872../../deps/v8/include/v8-profiler.h:1142:25: note: declared here873 1142 | ObjectNameResolver* global_object_name_resolver = nullptr;874 | ^~~~~~~~~~~~~~~~~~~~~~~~~~~875../../src/node_file_utils.cc: In function 'int node::WriteFileSync(const char*, uv_buf_t*, size_t)':876../../src/node_file_utils.cc:62:32: warning: enumerated and non-enumerated type in conditional expression [-Wextra]877 62 | int err = req.result < 0 ? req.result : UV_EIO;878 | ~~~~~~~~~~~~~~~^~~~~~~~~~~~~~~~~~~~~879[178/1871] CXX obj/gen/node_base.node_javascript.o880In file included from ../../src/memory_tracker.h:6,881 from ../../src/aliased_buffer.h:7,882 from ../../src/aliased_buffer-inl.h:6,883 from ../../src/env-inl.h:27,884 from gen/node_javascript.cc:2:885../../deps/v8/include/v8-profiler.h: In constructor 'v8::HeapProfiler::HeapSnapshotOptions::HeapSnapshotOptions()':886../../deps/v8/include/v8-profiler.h:1128:27: warning: 'v8::HeapProfiler::HeapSnapshotOptions::global_object_name_resolver' is deprecated: Use context_name_resolver callback instead. [-Wdeprecated-declarations]887 1128 | HeapSnapshotOptions() {}888 | ^889../../deps/v8/include/v8-profiler.h:1142:25: note: declared here890 1142 | ObjectNameResolver* global_object_name_resolver = nullptr;891 | ^~~~~~~~~~~~~~~~~~~~~~~~~~~892../../deps/v8/include/v8-profiler.h:1128:27: warning: 'v8::HeapProfiler::HeapSnapshotOptions::global_object_name_resolver' is deprecated: Use context_name_resolver callback instead. [-Wdeprecated-declarations]893 1128 | HeapSnapshotOptions() {}894 | ^895../../deps/v8/include/v8-profiler.h:1142:25: note: declared here896 1142 | ObjectNameResolver* global_object_name_resolver = nullptr;897 | ^~~~~~~~~~~~~~~~~~~~~~~~~~~898[179/1871] CXX obj/src/node_base.node_api.o899In file included from ../../src/memory_tracker.h:6,900 from ../../src/base_object.h:29,901 from ../../src/async_context_frame.h:6,902 from ../../src/node_api.cc:1:903../../deps/v8/include/v8-profiler.h: In constructor 'v8::HeapProfiler::HeapSnapshotOptions::HeapSnapshotOptions()':904../../deps/v8/include/v8-profiler.h:1128:27: warning: 'v8::HeapProfiler::HeapSnapshotOptions::global_object_name_resolver' is deprecated: Use context_name_resolver callback instead. [-Wdeprecated-declarations]905 1128 | HeapSnapshotOptions() {}906 | ^907../../deps/v8/include/v8-profiler.h:1142:25: note: declared here908 1142 | ObjectNameResolver* global_object_name_resolver = nullptr;909 | ^~~~~~~~~~~~~~~~~~~~~~~~~~~910../../deps/v8/include/v8-profiler.h:1128:27: warning: 'v8::HeapProfiler::HeapSnapshotOptions::global_object_name_resolver' is deprecated: Use context_name_resolver callback instead. [-Wdeprecated-declarations]911 1128 | HeapSnapshotOptions() {}912 | ^913../../deps/v8/include/v8-profiler.h:1142:25: note: declared here914 1142 | ObjectNameResolver* global_object_name_resolver = nullptr;915 | ^~~~~~~~~~~~~~~~~~~~~~~~~~~916[180/1871] CXX obj/src/node_base.module_wrap.o917In file included from ../../src/memory_tracker.h:6,918 from ../../src/base_object.h:29,919 from ../../src/module_wrap.h:10,920 from ../../src/module_wrap.cc:1:921../../deps/v8/include/v8-profiler.h: In constructor 'v8::HeapProfiler::HeapSnapshotOptions::HeapSnapshotOptions()':922../../deps/v8/include/v8-profiler.h:1128:27: warning: 'v8::HeapProfiler::HeapSnapshotOptions::global_object_name_resolver' is deprecated: Use context_name_resolver callback instead. [-Wdeprecated-declarations]923 1128 | HeapSnapshotOptions() {}924 | ^925../../deps/v8/include/v8-profiler.h:1142:25: note: declared here926 1142 | ObjectNameResolver* global_object_name_resolver = nullptr;927 | ^~~~~~~~~~~~~~~~~~~~~~~~~~~928../../deps/v8/include/v8-profiler.h:1128:27: warning: 'v8::HeapProfiler::HeapSnapshotOptions::global_object_name_resolver' is deprecated: Use context_name_resolver callback instead. [-Wdeprecated-declarations]929 1128 | HeapSnapshotOptions() {}930 | ^931../../deps/v8/include/v8-profiler.h:1142:25: note: declared here932 1142 | ObjectNameResolver* global_object_name_resolver = nullptr;933 | ^~~~~~~~~~~~~~~~~~~~~~~~~~~934[181/1871] CXX obj/src/node_base.node.o935In file included from ../../src/memory_tracker.h:6,936 from ../../src/aliased_buffer.h:7,937 from ../../src/env.h:27,938 from ../../src/node_internals.h:27,939 from ../../src/node_config_file.h:12,940 from ../../src/node.cc:23:941../../deps/v8/include/v8-profiler.h: In constructor 'v8::HeapProfiler::HeapSnapshotOptions::HeapSnapshotOptions()':942../../deps/v8/include/v8-profiler.h:1128:27: warning: 'v8::HeapProfiler::HeapSnapshotOptions::global_object_name_resolver' is deprecated: Use context_name_resolver callback instead. [-Wdeprecated-declarations]943 1128 | HeapSnapshotOptions() {}944 | ^945../../deps/v8/include/v8-profiler.h:1142:25: note: declared here946 1142 | ObjectNameResolver* global_object_name_resolver = nullptr;947 | ^~~~~~~~~~~~~~~~~~~~~~~~~~~948../../deps/v8/include/v8-profiler.h:1128:27: warning: 'v8::HeapProfiler::HeapSnapshotOptions::global_object_name_resolver' is deprecated: Use context_name_resolver callback instead. [-Wdeprecated-declarations]949 1128 | HeapSnapshotOptions() {}950 | ^951../../deps/v8/include/v8-profiler.h:1142:25: note: declared here952 1142 | ObjectNameResolver* global_object_name_resolver = nullptr;953 | ^~~~~~~~~~~~~~~~~~~~~~~~~~~954[182/1871] CXX obj/src/node_base.cares_wrap.o955In file included from ../../src/memory_tracker.h:6,956 from ../../src/base_object.h:29,957 from ../../src/async_wrap.h:27,958 from ../../src/cares_wrap.h:8,959 from ../../src/cares_wrap.cc:22:960../../deps/v8/include/v8-profiler.h: In constructor 'v8::HeapProfiler::HeapSnapshotOptions::HeapSnapshotOptions()':961../../deps/v8/include/v8-profiler.h:1128:27: warning: 'v8::HeapProfiler::HeapSnapshotOptions::global_object_name_resolver' is deprecated: Use context_name_resolver callback instead. [-Wdeprecated-declarations]962 1128 | HeapSnapshotOptions() {}963 | ^964../../deps/v8/include/v8-profiler.h:1142:25: note: declared here965 1142 | ObjectNameResolver* global_object_name_resolver = nullptr;966 | ^~~~~~~~~~~~~~~~~~~~~~~~~~~967../../deps/v8/include/v8-profiler.h:1128:27: warning: 'v8::HeapProfiler::HeapSnapshotOptions::global_object_name_resolver' is deprecated: Use context_name_resolver callback instead. [-Wdeprecated-declarations]968 1128 | HeapSnapshotOptions() {}969 | ^970../../deps/v8/include/v8-profiler.h:1142:25: note: declared here971 1142 | ObjectNameResolver* global_object_name_resolver = nullptr;972 | ^~~~~~~~~~~~~~~~~~~~~~~~~~~973../../src/cares_wrap.cc: In function 'v8::Maybe<int> node::cares_wrap::{anonymous}::ParseGeneralReply(node::Environment*, const unsigned char*, int, int*, v8::Local<v8::Array>, void*, int*)':974../../src/cares_wrap.cc:244:34: warning: 'int ares_parse_a_reply(const unsigned char*, int, hostent**, ares_addrttl*, int*)' is deprecated: Use ares_dns_parse instead [-Wdeprecated-declarations]975 244 | status = ares_parse_a_reply(buf,976 | ~~~~~~~~~~~~~~~~~~^~~~~977 245 | len,978 | ~~~~979 246 | &host,980 | ~~~~~~981 247 | static_cast<ares_addrttl*>(addrttls),982 | ~~~~~~~~~~~~~~~~~~~~~~~~~~~~~~~~~~~~~983 248 | naddrttls);984 | ~~~~~~~~~~985In file included from ../../src/cares_wrap.h:17:986/nix/store/j239p458yixap89j6wpfib9yjypd3ii5-c-ares-1.34.8-dev/include/ares.h:1106:55: note: declared here987 1106 | CARES_EXTERN CARES_DEPRECATED_FOR(ares_dns_parse) int ares_parse_a_reply(988 | ^~~~~~~~~~~~~~~~~~989../../src/cares_wrap.cc:251:37: warning: 'int ares_parse_aaaa_reply(const unsigned char*, int, hostent**, ares_addr6ttl*, int*)' is deprecated: Use ares_dns_parse instead [-Wdeprecated-declarations]990 251 | status = ares_parse_aaaa_reply(buf,991 | ~~~~~~~~~~~~~~~~~~~~~^~~~~992 252 | len,993 | ~~~~994 253 | &host,995 | ~~~~~~996 254 | static_cast<ares_addr6ttl*>(addrttls),997 | ~~~~~~~~~~~~~~~~~~~~~~~~~~~~~~~~~~~~~~998 255 | naddrttls);999 | ~~~~~~~~~~1000/nix/store/j239p458yixap89j6wpfib9yjypd3ii5-c-ares-1.34.8-dev/include/ares.h:1110:55: note: declared here1001 1110 | CARES_EXTERN CARES_DEPRECATED_FOR(ares_dns_parse) int ares_parse_aaaa_reply(1002 | ^~~~~~~~~~~~~~~~~~~~~1003../../src/cares_wrap.cc:258:35: warning: 'int ares_parse_ns_reply(const unsigned char*, int, hostent**)' is deprecated: Use ares_dns_parse instead [-Wdeprecated-declarations]1004 258 | status = ares_parse_ns_reply(buf, len, &host);1005 | ~~~~~~~~~~~~~~~~~~~^~~~~~~~~~~~~~~~~1006/nix/store/j239p458yixap89j6wpfib9yjypd3ii5-c-ares-1.34.8-dev/include/ares.h:1121:55: note: declared here1007 1121 | CARES_EXTERN CARES_DEPRECATED_FOR(ares_dns_parse) int ares_parse_ns_reply(1008 | ^~~~~~~~~~~~~~~~~~~1009../../src/cares_wrap.cc:261:36: warning: 'int ares_parse_ptr_reply(const unsigned char*, int, const void*, int, int, hostent**)' is deprecated: Use ares_dns_parse instead [-Wdeprecated-declarations]1010 261 | status = ares_parse_ptr_reply(buf, len, nullptr, 0, AF_INET, &host);1011 | ~~~~~~~~~~~~~~~~~~~~^~~~~~~~~~~~~~~~~~~~~~~~~~~~~~~~~~~~~~1012/nix/store/j239p458yixap89j6wpfib9yjypd3ii5-c-ares-1.34.8-dev/include/ares.h:1117:55: note: declared here1013 1117 | CARES_EXTERN CARES_DEPRECATED_FOR(ares_dns_parse) int ares_parse_ptr_reply(1014 | ^~~~~~~~~~~~~~~~~~~~1015../../src/cares_wrap.cc: In function 'v8::Maybe<int> node::cares_wrap::{anonymous}::ParseMxReply(node::Environment*, const unsigned char*, int, v8::Local<v8::Array>, bool)':1016../../src/cares_wrap.cc:337:35: warning: 'int ares_parse_mx_reply(const unsigned char*, int, ares_mx_reply**)' is deprecated: Use ares_dns_parse instead [-Wdeprecated-declarations]1017 337 | int status = ares_parse_mx_reply(buf, len, &mx_start);1018 | ~~~~~~~~~~~~~~~~~~~^~~~~~~~~~~~~~~~~~~~~1019/nix/store/j239p458yixap89j6wpfib9yjypd3ii5-c-ares-1.34.8-dev/include/ares.h:1127:55: note: declared here1020 1127 | CARES_EXTERN CARES_DEPRECATED_FOR(ares_dns_parse) int ares_parse_mx_reply(1021 | ^~~~~~~~~~~~~~~~~~~1022../../src/cares_wrap.cc: In function 'v8::Maybe<int> node::cares_wrap::{anonymous}::ParseCaaReply(node::Environment*, const unsigned char*, int, v8::Local<v8::Array>, bool)':1023../../src/cares_wrap.cc:383:36: warning: 'int ares_parse_caa_reply(const unsigned char*, int, ares_caa_reply**)' is deprecated: Use ares_dns_parse instead [-Wdeprecated-declarations]1024 383 | int status = ares_parse_caa_reply(buf, len, &caa_start);1025 | ~~~~~~~~~~~~~~~~~~~~^~~~~~~~~~~~~~~~~~~~~~1026/nix/store/j239p458yixap89j6wpfib9yjypd3ii5-c-ares-1.34.8-dev/include/ares.h:1114:55: note: declared here1027 1114 | CARES_EXTERN CARES_DEPRECATED_FOR(ares_dns_parse) int ares_parse_caa_reply(1028 | ^~~~~~~~~~~~~~~~~~~~1029../../src/cares_wrap.cc: In function 'v8::Maybe<int> node::cares_wrap::{anonymous}::ParseTxtReply(node::Environment*, const unsigned char*, int, v8::Local<v8::Array>, bool)':1030../../src/cares_wrap.cc:511:40: warning: 'int ares_parse_txt_reply_ext(const unsigned char*, int, ares_txt_ext**)' is deprecated: Use ares_dns_parse instead [-Wdeprecated-declarations]1031 511 | int status = ares_parse_txt_reply_ext(buf, len, &txt_out);1032 | ~~~~~~~~~~~~~~~~~~~~~~~~^~~~~~~~~~~~~~~~~~~~1033/nix/store/j239p458yixap89j6wpfib9yjypd3ii5-c-ares-1.34.8-dev/include/ares.h:1133:55: note: declared here1034 1133 | CARES_EXTERN CARES_DEPRECATED_FOR(ares_dns_parse) int ares_parse_txt_reply_ext(1035 | ^~~~~~~~~~~~~~~~~~~~~~~~1036../../src/cares_wrap.cc: In function 'v8::Maybe<int> node::cares_wrap::{anonymous}::ParseSrvReply(node::Environment*, const unsigned char*, int, v8::Local<v8::Array>, bool)':1037../../src/cares_wrap.cc:598:36: warning: 'int ares_parse_srv_reply(const unsigned char*, int, ares_srv_reply**)' is deprecated: Use ares_dns_parse instead [-Wdeprecated-declarations]1038 598 | int status = ares_parse_srv_reply(buf, len, &srv_start);1039 | ~~~~~~~~~~~~~~~~~~~~^~~~~~~~~~~~~~~~~~~~~~1040/nix/store/j239p458yixap89j6wpfib9yjypd3ii5-c-ares-1.34.8-dev/include/ares.h:1124:55: note: declared here1041 1124 | CARES_EXTERN CARES_DEPRECATED_FOR(ares_dns_parse) int ares_parse_srv_reply(1042 | ^~~~~~~~~~~~~~~~~~~~1043../../src/cares_wrap.cc: In function 'v8::Maybe<int> node::cares_wrap::{anonymous}::ParseNaptrReply(node::Environment*, const unsigned char*, int, v8::Local<v8::Array>, bool)':1044../../src/cares_wrap.cc:653:38: warning: 'int ares_parse_naptr_reply(const unsigned char*, int, ares_naptr_reply**)' is deprecated: Use ares_dns_parse instead [-Wdeprecated-declarations]1045 653 | int status = ares_parse_naptr_reply(buf, len, &naptr_start);1046 | ~~~~~~~~~~~~~~~~~~~~~~^~~~~~~~~~~~~~~~~~~~~~~~1047/nix/store/j239p458yixap89j6wpfib9yjypd3ii5-c-ares-1.34.8-dev/include/ares.h:1136:55: note: declared here1048 1136 | CARES_EXTERN CARES_DEPRECATED_FOR(ares_dns_parse) int ares_parse_naptr_reply(1049 | ^~~~~~~~~~~~~~~~~~~~~~1050../../src/cares_wrap.cc: In member function 'void node::cares_wrap::ChannelWrap::EnsureServers()':1051../../src/cares_wrap.cc:1000:25: warning: 'int ares_get_servers_ports(const ares_channel_t*, ares_addr_port_node**)' is deprecated: Use ares_get_servers_csv instead [-Wdeprecated-declarations]1052 1000 | ares_get_servers_ports(channel_, &servers);1053 | ~~~~~~~~~~~~~~~~~~~~~~^~~~~~~~~~~~~~~~~~~~1054/nix/store/j239p458yixap89j6wpfib9yjypd3ii5-c-ares-1.34.8-dev/include/ares.h:1196:28: note: declared here1055 1196 | int ares_get_servers_ports(const ares_channel_t *channel,1056 | ^~~~~~~~~~~~~~~~~~~~~~1057../../src/cares_wrap.cc: In static member function 'static v8::Maybe<int> node::cares_wrap::SoaTraits::Parse(node::cares_wrap::QuerySoaWrap*, const std::unique_ptr<node::cares_wrap::ResponseData>&)':1058../../src/cares_wrap.cc:1711:36: warning: 'int ares_parse_soa_reply(const unsigned char*, int, ares_soa_reply**)' is deprecated: Use ares_dns_parse instead [-Wdeprecated-declarations]1059 1711 | int status = ares_parse_soa_reply(buf, len, &soa_out);1060 | ~~~~~~~~~~~~~~~~~~~~^~~~~~~~~~~~~~~~~~~~1061/nix/store/j239p458yixap89j6wpfib9yjypd3ii5-c-ares-1.34.8-dev/include/ares.h:1139:55: note: declared here1062 1139 | CARES_EXTERN CARES_DEPRECATED_FOR(ares_dns_parse) int ares_parse_soa_reply(1063 | ^~~~~~~~~~~~~~~~~~~~1064../../src/cares_wrap.cc: In function 'void node::cares_wrap::{anonymous}::GetServers(const v8::FunctionCallbackInfo<v8::Value>&)':1065../../src/cares_wrap.cc:2092:33: warning: 'int ares_get_servers_ports(const ares_channel_t*, ares_addr_port_node**)' is deprecated: Use ares_get_servers_csv instead [-Wdeprecated-declarations]1066 2092 | int r = ares_get_servers_ports(channel->cares_channel(), &servers);1067 | ~~~~~~~~~~~~~~~~~~~~~~^~~~~~~~~~~~~~~~~~~~~~~~~~~~~~~~~~~~1068/nix/store/j239p458yixap89j6wpfib9yjypd3ii5-c-ares-1.34.8-dev/include/ares.h:1196:28: note: declared here1069 1196 | int ares_get_servers_ports(const ares_channel_t *channel,1070 | ^~~~~~~~~~~~~~~~~~~~~~1071../../src/cares_wrap.cc: In function 'void node::cares_wrap::{anonymous}::SetServers(const v8::FunctionCallbackInfo<v8::Value>&)':1072../../src/cares_wrap.cc:2137:30: warning: 'int ares_set_servers(ares_channel_t*, const ares_addr_node*)' is deprecated: Use ares_set_servers_csv instead [-Wdeprecated-declarations]1073 2137 | int rv = ares_set_servers(channel->cares_channel(), nullptr);1074 | ~~~~~~~~~~~~~~~~^~~~~~~~~~~~~~~~~~~~~~~~~~~~~~~~~~~1075/nix/store/j239p458yixap89j6wpfib9yjypd3ii5-c-ares-1.34.8-dev/include/ares.h:1176:61: note: declared here1076 1176 | CARES_EXTERN CARES_DEPRECATED_FOR(ares_set_servers_csv) int ares_set_servers(1077 | ^~~~~~~~~~~~~~~~1078../../src/cares_wrap.cc:2197:33: warning: 'int ares_set_servers_ports(ares_channel_t*, const ares_addr_port_node*)' is deprecated: Use ares_set_servers_ports_csv instead [-Wdeprecated-declarations]1079 2197 | err = ares_set_servers_ports(channel->cares_channel(), servers.data());1080 | ~~~~~~~~~~~~~~~~~~~~~~^~~~~~~~~~~~~~~~~~~~~~~~~~~~~~~~~~~~~~~~~~1081/nix/store/j239p458yixap89j6wpfib9yjypd3ii5-c-ares-1.34.8-dev/include/ares.h:1181:20: note: declared here1082 1181 | int ares_set_servers_ports(ares_channel_t *channel,1083 | ^~~~~~~~~~~~~~~~~~~~~~1084[183/1871] CXX obj/src/node_base.node_cjs_lexer.o1085In file included from ../../src/memory_tracker.h:6,1086 from ../../src/aliased_buffer.h:7,1087 from ../../src/aliased_buffer-inl.h:6,1088 from ../../src/env-inl.h:27,1089 from ../../src/node_cjs_lexer.cc:1:1090../../deps/v8/include/v8-profiler.h: In constructor 'v8::HeapProfiler::HeapSnapshotOptions::HeapSnapshotOptions()':1091../../deps/v8/include/v8-profiler.h:1128:27: warning: 'v8::HeapProfiler::HeapSnapshotOptions::global_object_name_resolver' is deprecated: Use context_name_resolver callback instead. [-Wdeprecated-declarations]1092 1128 | HeapSnapshotOptions() {}1093 | ^1094../../deps/v8/include/v8-profiler.h:1142:25: note: declared here1095 1142 | ObjectNameResolver* global_object_name_resolver = nullptr;1096 | ^~~~~~~~~~~~~~~~~~~~~~~~~~~1097../../deps/v8/include/v8-profiler.h:1128:27: warning: 'v8::HeapProfiler::HeapSnapshotOptions::global_object_name_resolver' is deprecated: Use context_name_resolver callback instead. [-Wdeprecated-declarations]1098 1128 | HeapSnapshotOptions() {}1099 | ^1100../../deps/v8/include/v8-profiler.h:1142:25: note: declared here1101 1142 | ObjectNameResolver* global_object_name_resolver = nullptr;1102 | ^~~~~~~~~~~~~~~~~~~~~~~~~~~1103[184/1871] CXX obj/src/node_base.node_binding.o1104In file included from ../../src/memory_tracker.h:6,1105 from ../../src/aliased_buffer.h:7,1106 from ../../src/aliased_buffer-inl.h:6,1107 from ../../src/env-inl.h:27,1108 from ../../src/node_binding.cc:3:1109../../deps/v8/include/v8-profiler.h: In constructor 'v8::HeapProfiler::HeapSnapshotOptions::HeapSnapshotOptions()':1110../../deps/v8/include/v8-profiler.h:1128:27: warning: 'v8::HeapProfiler::HeapSnapshotOptions::global_object_name_resolver' is deprecated: Use context_name_resolver callback instead. [-Wdeprecated-declarations]1111 1128 | HeapSnapshotOptions() {}1112 | ^1113../../deps/v8/include/v8-profiler.h:1142:25: note: declared here1114 1142 | ObjectNameResolver* global_object_name_resolver = nullptr;1115 | ^~~~~~~~~~~~~~~~~~~~~~~~~~~1116../../deps/v8/include/v8-profiler.h:1128:27: warning: 'v8::HeapProfiler::HeapSnapshotOptions::global_object_name_resolver' is deprecated: Use context_name_resolver callback instead. [-Wdeprecated-declarations]1117 1128 | HeapSnapshotOptions() {}1118 | ^1119../../deps/v8/include/v8-profiler.h:1142:25: note: declared here1120 1142 | ObjectNameResolver* global_object_name_resolver = nullptr;1121 | ^~~~~~~~~~~~~~~~~~~~~~~~~~~1122[185/1871] CXX obj/src/node_base.node_credentials.o1123In file included from ../../src/memory_tracker.h:6,1124 from ../../src/aliased_buffer.h:7,1125 from ../../src/aliased_buffer-inl.h:6,1126 from ../../src/env-inl.h:27,1127 from ../../src/node_credentials.cc:1:1128../../deps/v8/include/v8-profiler.h: In constructor 'v8::HeapProfiler::HeapSnapshotOptions::HeapSnapshotOptions()':1129../../deps/v8/include/v8-profiler.h:1128:27: warning: 'v8::HeapProfiler::HeapSnapshotOptions::global_object_name_resolver' is deprecated: Use context_name_resolver callback instead. [-Wdeprecated-declarations]1130 1128 | HeapSnapshotOptions() {}1131 | ^1132../../deps/v8/include/v8-profiler.h:1142:25: note: declared here1133 1142 | ObjectNameResolver* global_object_name_resolver = nullptr;1134 | ^~~~~~~~~~~~~~~~~~~~~~~~~~~1135../../deps/v8/include/v8-profiler.h:1128:27: warning: 'v8::HeapProfiler::HeapSnapshotOptions::global_object_name_resolver' is deprecated: Use context_name_resolver callback instead. [-Wdeprecated-declarations]1136 1128 | HeapSnapshotOptions() {}1137 | ^1138../../deps/v8/include/v8-profiler.h:1142:25: note: declared here1139 1142 | ObjectNameResolver* global_object_name_resolver = nullptr;1140 | ^~~~~~~~~~~~~~~~~~~~~~~~~~~1141[186/1871] CXX obj/src/node_base.node_dir.o1142In file included from ../../src/memory_tracker.h:6,1143 from ../../src/aliased_buffer.h:7,1144 from ../../src/node_file.h:7,1145 from ../../src/node_dir.h:6,1146 from ../../src/node_dir.cc:1:1147../../deps/v8/include/v8-profiler.h: In constructor 'v8::HeapProfiler::HeapSnapshotOptions::HeapSnapshotOptions()':1148../../deps/v8/include/v8-profiler.h:1128:27: warning: 'v8::HeapProfiler::HeapSnapshotOptions::global_object_name_resolver' is deprecated: Use context_name_resolver callback instead. [-Wdeprecated-declarations]1149 1128 | HeapSnapshotOptions() {}1150 | ^1151../../deps/v8/include/v8-profiler.h:1142:25: note: declared here1152 1142 | ObjectNameResolver* global_object_name_resolver = nullptr;1153 | ^~~~~~~~~~~~~~~~~~~~~~~~~~~1154../../deps/v8/include/v8-profiler.h:1128:27: warning: 'v8::HeapProfiler::HeapSnapshotOptions::global_object_name_resolver' is deprecated: Use context_name_resolver callback instead. [-Wdeprecated-declarations]1155 1128 | HeapSnapshotOptions() {}1156 | ^1157../../deps/v8/include/v8-profiler.h:1142:25: note: declared here1158 1142 | ObjectNameResolver* global_object_name_resolver = nullptr;1159 | ^~~~~~~~~~~~~~~~~~~~~~~~~~~1160[187/1871] CXX obj/src/node_base.node_constants.o1161In file included from ../../src/memory_tracker.h:6,1162 from ../../src/aliased_buffer.h:7,1163 from ../../src/aliased_buffer-inl.h:6,1164 from ../../src/env-inl.h:27,1165 from ../../src/node_constants.cc:22:1166../../deps/v8/include/v8-profiler.h: In constructor 'v8::HeapProfiler::HeapSnapshotOptions::HeapSnapshotOptions()':1167../../deps/v8/include/v8-profiler.h:1128:27: warning: 'v8::HeapProfiler::HeapSnapshotOptions::global_object_name_resolver' is deprecated: Use context_name_resolver callback instead. [-Wdeprecated-declarations]1168 1128 | HeapSnapshotOptions() {}1169 | ^1170../../deps/v8/include/v8-profiler.h:1142:25: note: declared here1171 1142 | ObjectNameResolver* global_object_name_resolver = nullptr;1172 | ^~~~~~~~~~~~~~~~~~~~~~~~~~~1173../../deps/v8/include/v8-profiler.h:1128:27: warning: 'v8::HeapProfiler::HeapSnapshotOptions::global_object_name_resolver' is deprecated: Use context_name_resolver callback instead. [-Wdeprecated-declarations]1174 1128 | HeapSnapshotOptions() {}1175 | ^1176../../deps/v8/include/v8-profiler.h:1142:25: note: declared here1177 1142 | ObjectNameResolver* global_object_name_resolver = nullptr;1178 | ^~~~~~~~~~~~~~~~~~~~~~~~~~~1179[188/1871] CXX obj/src/node_base.node_config_file.o1180In file included from ../../src/memory_tracker.h:6,1181 from ../../src/aliased_buffer.h:7,1182 from ../../src/env.h:27,1183 from ../../src/node_internals.h:27,1184 from ../../src/node_config_file.h:12,1185 from ../../src/node_config_file.cc:1:1186../../deps/v8/include/v8-profiler.h: In constructor 'v8::HeapProfiler::HeapSnapshotOptions::HeapSnapshotOptions()':1187../../deps/v8/include/v8-profiler.h:1128:27: warning: 'v8::HeapProfiler::HeapSnapshotOptions::global_object_name_resolver' is deprecated: Use context_name_resolver callback instead. [-Wdeprecated-declarations]1188 1128 | HeapSnapshotOptions() {}1189 | ^1190../../deps/v8/include/v8-profiler.h:1142:25: note: declared here1191 1142 | ObjectNameResolver* global_object_name_resolver = nullptr;1192 | ^~~~~~~~~~~~~~~~~~~~~~~~~~~1193../../deps/v8/include/v8-profiler.h:1128:27: warning: 'v8::HeapProfiler::HeapSnapshotOptions::global_object_name_resolver' is deprecated: Use context_name_resolver callback instead. [-Wdeprecated-declarations]1194 1128 | HeapSnapshotOptions() {}1195 | ^1196../../deps/v8/include/v8-profiler.h:1142:25: note: declared here1197 1142 | ObjectNameResolver* global_object_name_resolver = nullptr;1198 | ^~~~~~~~~~~~~~~~~~~~~~~~~~~1199[189/1871] CXX obj/src/node_base.node_config.o1200In file included from ../../src/memory_tracker.h:6,1201 from ../../src/aliased_buffer.h:7,1202 from ../../src/aliased_buffer-inl.h:6,1203 from ../../src/env-inl.h:27,1204 from ../../src/node_config.cc:1:1205../../deps/v8/include/v8-profiler.h: In constructor 'v8::HeapProfiler::HeapSnapshotOptions::HeapSnapshotOptions()':1206../../deps/v8/include/v8-profiler.h:1128:27: warning: 'v8::HeapProfiler::HeapSnapshotOptions::global_object_name_resolver' is deprecated: Use context_name_resolver callback instead. [-Wdeprecated-declarations]1207 1128 | HeapSnapshotOptions() {}1208 | ^1209../../deps/v8/include/v8-profiler.h:1142:25: note: declared here1210 1142 | ObjectNameResolver* global_object_name_resolver = nullptr;1211 | ^~~~~~~~~~~~~~~~~~~~~~~~~~~1212../../deps/v8/include/v8-profiler.h:1128:27: warning: 'v8::HeapProfiler::HeapSnapshotOptions::global_object_name_resolver' is deprecated: Use context_name_resolver callback instead. [-Wdeprecated-declarations]1213 1128 | HeapSnapshotOptions() {}1214 | ^1215../../deps/v8/include/v8-profiler.h:1142:25: note: declared here1216 1142 | ObjectNameResolver* global_object_name_resolver = nullptr;1217 | ^~~~~~~~~~~~~~~~~~~~~~~~~~~1218[190/1871] CXX obj/src/node_base.node_blob.o1219In file included from ../../src/memory_tracker.h:6,1220 from ../../src/base_object.h:29,1221 from ../../src/async_wrap.h:27,1222 from ../../src/node_blob.h:8,1223 from ../../src/node_blob.cc:1:1224../../deps/v8/include/v8-profiler.h: In constructor 'v8::HeapProfiler::HeapSnapshotOptions::HeapSnapshotOptions()':1225../../deps/v8/include/v8-profiler.h:1128:27: warning: 'v8::HeapProfiler::HeapSnapshotOptions::global_object_name_resolver' is deprecated: Use context_name_resolver callback instead. [-Wdeprecated-declarations]1226 1128 | HeapSnapshotOptions() {}1227 | ^1228../../deps/v8/include/v8-profiler.h:1142:25: note: declared here1229 1142 | ObjectNameResolver* global_object_name_resolver = nullptr;1230 | ^~~~~~~~~~~~~~~~~~~~~~~~~~~1231../../deps/v8/include/v8-profiler.h:1128:27: warning: 'v8::HeapProfiler::HeapSnapshotOptions::global_object_name_resolver' is deprecated: Use context_name_resolver callback instead. [-Wdeprecated-declarations]1232 1128 | HeapSnapshotOptions() {}1233 | ^1234../../deps/v8/include/v8-profiler.h:1142:25: note: declared here1235 1142 | ObjectNameResolver* global_object_name_resolver = nullptr;1236 | ^~~~~~~~~~~~~~~~~~~~~~~~~~~1237[191/1871] CXX obj/src/node_base.node_env_var.o1238In file included from ../../src/memory_tracker.h:6,1239 from ../../src/base_object.h:29,1240 from ../../src/async_wrap.h:27,1241 from ../../src/debug_utils.h:6,1242 from ../../src/debug_utils-inl.h:6,1243 from ../../src/node_env_var.cc:1:1244../../deps/v8/include/v8-profiler.h: In constructor 'v8::HeapProfiler::HeapSnapshotOptions::HeapSnapshotOptions()':1245../../deps/v8/include/v8-profiler.h:1128:27: warning: 'v8::HeapProfiler::HeapSnapshotOptions::global_object_name_resolver' is deprecated: Use context_name_resolver callback instead. [-Wdeprecated-declarations]1246 1128 | HeapSnapshotOptions() {}1247 | ^1248../../deps/v8/include/v8-profiler.h:1142:25: note: declared here1249 1142 | ObjectNameResolver* global_object_name_resolver = nullptr;1250 | ^~~~~~~~~~~~~~~~~~~~~~~~~~~1251../../deps/v8/include/v8-profiler.h:1128:27: warning: 'v8::HeapProfiler::HeapSnapshotOptions::global_object_name_resolver' is deprecated: Use context_name_resolver callback instead. [-Wdeprecated-declarations]1252 1128 | HeapSnapshotOptions() {}1253 | ^1254../../deps/v8/include/v8-profiler.h:1142:25: note: declared here1255 1142 | ObjectNameResolver* global_object_name_resolver = nullptr;1256 | ^~~~~~~~~~~~~~~~~~~~~~~~~~~1257[192/1871] CXX obj/src/node_base.node_dotenv.o1258In file included from ../../src/util.h:29,1259 from ../../src/util-inl.h:33,1260 from ../../src/node_dotenv.h:6,1261 from ../../src/node_dotenv.cc:1:1262../../deps/v8/include/v8-profiler.h: In constructor 'v8::HeapProfiler::HeapSnapshotOptions::HeapSnapshotOptions()':1263../../deps/v8/include/v8-profiler.h:1128:27: warning: 'v8::HeapProfiler::HeapSnapshotOptions::global_object_name_resolver' is deprecated: Use context_name_resolver callback instead. [-Wdeprecated-declarations]1264 1128 | HeapSnapshotOptions() {}1265 | ^1266../../deps/v8/include/v8-profiler.h:1142:25: note: declared here1267 1142 | ObjectNameResolver* global_object_name_resolver = nullptr;1268 | ^~~~~~~~~~~~~~~~~~~~~~~~~~~1269../../deps/v8/include/v8-profiler.h:1128:27: warning: 'v8::HeapProfiler::HeapSnapshotOptions::global_object_name_resolver' is deprecated: Use context_name_resolver callback instead. [-Wdeprecated-declarations]1270 1128 | HeapSnapshotOptions() {}1271 | ^1272../../deps/v8/include/v8-profiler.h:1142:25: note: declared here1273 1142 | ObjectNameResolver* global_object_name_resolver = nullptr;1274 | ^~~~~~~~~~~~~~~~~~~~~~~~~~~1275[193/1871] CXX obj/src/node_base.node_builtins.o1276In file included from ../../src/util.h:29,1277 from ../../src/node_mutex.h:6,1278 from ../../src/node_builtins.h:16,1279 from ../../src/node_builtins.cc:1:1280../../deps/v8/include/v8-profiler.h: In constructor 'v8::HeapProfiler::HeapSnapshotOptions::HeapSnapshotOptions()':1281../../deps/v8/include/v8-profiler.h:1128:27: warning: 'v8::HeapProfiler::HeapSnapshotOptions::global_object_name_resolver' is deprecated: Use context_name_resolver callback instead. [-Wdeprecated-declarations]1282 1128 | HeapSnapshotOptions() {}1283 | ^1284../../deps/v8/include/v8-profiler.h:1142:25: note: declared here1285 1142 | ObjectNameResolver* global_object_name_resolver = nullptr;1286 | ^~~~~~~~~~~~~~~~~~~~~~~~~~~1287../../deps/v8/include/v8-profiler.h:1128:27: warning: 'v8::HeapProfiler::HeapSnapshotOptions::global_object_name_resolver' is deprecated: Use context_name_resolver callback instead. [-Wdeprecated-declarations]1288 1128 | HeapSnapshotOptions() {}1289 | ^1290../../deps/v8/include/v8-profiler.h:1142:25: note: declared here1291 1142 | ObjectNameResolver* global_object_name_resolver = nullptr;1292 | ^~~~~~~~~~~~~~~~~~~~~~~~~~~1293[194/1871] CXX obj/deps/v8/src/torque/torque_base.implementation-visitor.o1294[195/1871] CXX obj/src/node_base.node_external_reference.o1295In file included from ../../src/memory_tracker.h:6,1296 from ../../src/base_object.h:29,1297 from ../../src/base_object-inl.h:27,1298 from ../../src/node_external_reference.cc:4:1299../../deps/v8/include/v8-profiler.h: In constructor 'v8::HeapProfiler::HeapSnapshotOptions::HeapSnapshotOptions()':1300../../deps/v8/include/v8-profiler.h:1128:27: warning: 'v8::HeapProfiler::HeapSnapshotOptions::global_object_name_resolver' is deprecated: Use context_name_resolver callback instead. [-Wdeprecated-declarations]1301 1128 | HeapSnapshotOptions() {}1302 | ^1303../../deps/v8/include/v8-profiler.h:1142:25: note: declared here1304 1142 | ObjectNameResolver* global_object_name_resolver = nullptr;1305 | ^~~~~~~~~~~~~~~~~~~~~~~~~~~1306../../deps/v8/include/v8-profiler.h:1128:27: warning: 'v8::HeapProfiler::HeapSnapshotOptions::global_object_name_resolver' is deprecated: Use context_name_resolver callback instead. [-Wdeprecated-declarations]1307 1128 | HeapSnapshotOptions() {}1308 | ^1309../../deps/v8/include/v8-profiler.h:1142:25: note: declared here1310 1142 | ObjectNameResolver* global_object_name_resolver = nullptr;1311 | ^~~~~~~~~~~~~~~~~~~~~~~~~~~1312[196/1871] CXX obj/deps/v8/src/torque/torque_base.torque-parser.o1313[197/1871] AR obj/tools/v8_gypfiles/libtorque_base.a1314[198/1871] STAMP obj/tools/v8_gypfiles/torque.actions_depends.stamp1315[199/1871] CXX obj/src/node_base.node_profiling.o1316In file included from ../../src/node_profiling.h:6,1317 from ../../src/node_profiling.cc:1:1318../../deps/v8/include/v8-profiler.h: In constructor 'v8::HeapProfiler::HeapSnapshotOptions::HeapSnapshotOptions()':1319../../deps/v8/include/v8-profiler.h:1128:27: warning: 'v8::HeapProfiler::HeapSnapshotOptions::global_object_name_resolver' is deprecated: Use context_name_resolver callback instead. [-Wdeprecated-declarations]1320 1128 | HeapSnapshotOptions() {}1321 | ^1322../../deps/v8/include/v8-profiler.h:1142:25: note: declared here1323 1142 | ObjectNameResolver* global_object_name_resolver = nullptr;1324 | ^~~~~~~~~~~~~~~~~~~~~~~~~~~1325../../deps/v8/include/v8-profiler.h:1128:27: warning: 'v8::HeapProfiler::HeapSnapshotOptions::global_object_name_resolver' is deprecated: Use context_name_resolver callback instead. [-Wdeprecated-declarations]1326 1128 | HeapSnapshotOptions() {}1327 | ^1328../../deps/v8/include/v8-profiler.h:1142:25: note: declared here1329 1142 | ObjectNameResolver* global_object_name_resolver = nullptr;1330 | ^~~~~~~~~~~~~~~~~~~~~~~~~~~1331[200/1871] CXX obj/src/node_base.node_errors.o1332In file included from ../../src/memory_tracker.h:6,1333 from ../../src/base_object.h:29,1334 from ../../src/async_wrap.h:27,1335 from ../../src/debug_utils.h:6,1336 from ../../src/debug_utils-inl.h:6,1337 from ../../src/node_errors.cc:6:1338../../deps/v8/include/v8-profiler.h: In constructor 'v8::HeapProfiler::HeapSnapshotOptions::HeapSnapshotOptions()':1339../../deps/v8/include/v8-profiler.h:1128:27: warning: 'v8::HeapProfiler::HeapSnapshotOptions::global_object_name_resolver' is deprecated: Use context_name_resolver callback instead. [-Wdeprecated-declarations]1340 1128 | HeapSnapshotOptions() {}1341 | ^1342../../deps/v8/include/v8-profiler.h:1142:25: note: declared here1343 1142 | ObjectNameResolver* global_object_name_resolver = nullptr;1344 | ^~~~~~~~~~~~~~~~~~~~~~~~~~~1345../../deps/v8/include/v8-profiler.h:1128:27: warning: 'v8::HeapProfiler::HeapSnapshotOptions::global_object_name_resolver' is deprecated: Use context_name_resolver callback instead. [-Wdeprecated-declarations]1346 1128 | HeapSnapshotOptions() {}1347 | ^1348../../deps/v8/include/v8-profiler.h:1142:25: note: declared here1349 1142 | ObjectNameResolver* global_object_name_resolver = nullptr;1350 | ^~~~~~~~~~~~~~~~~~~~~~~~~~~1351[201/1871] CXX obj/src/node_base.node_buffer.o1352In file included from ../../src/memory_tracker.h:6,1353 from ../../src/base_object.h:29,1354 from ../../src/async_wrap.h:27,1355 from ../../src/node_blob.h:8,1356 from ../../src/node_buffer.cc:24:1357../../deps/v8/include/v8-profiler.h: In constructor 'v8::HeapProfiler::HeapSnapshotOptions::HeapSnapshotOptions()':1358../../deps/v8/include/v8-profiler.h:1128:27: warning: 'v8::HeapProfiler::HeapSnapshotOptions::global_object_name_resolver' is deprecated: Use context_name_resolver callback instead. [-Wdeprecated-declarations]1359 1128 | HeapSnapshotOptions() {}1360 | ^1361../../deps/v8/include/v8-profiler.h:1142:25: note: declared here1362 1142 | ObjectNameResolver* global_object_name_resolver = nullptr;1363 | ^~~~~~~~~~~~~~~~~~~~~~~~~~~1364../../deps/v8/include/v8-profiler.h:1128:27: warning: 'v8::HeapProfiler::HeapSnapshotOptions::global_object_name_resolver' is deprecated: Use context_name_resolver callback instead. [-Wdeprecated-declarations]1365 1128 | HeapSnapshotOptions() {}1366 | ^1367../../deps/v8/include/v8-profiler.h:1142:25: note: declared here1368 1142 | ObjectNameResolver* global_object_name_resolver = nullptr;1369 | ^~~~~~~~~~~~~~~~~~~~~~~~~~~1370[202/1871] CXX obj/src/node_base.node_http_parser.o1371In file included from ../../src/util.h:29,1372 from ../../src/node_http_parser.cc:24:1373../../deps/v8/include/v8-profiler.h: In constructor 'v8::HeapProfiler::HeapSnapshotOptions::HeapSnapshotOptions()':1374../../deps/v8/include/v8-profiler.h:1128:27: warning: 'v8::HeapProfiler::HeapSnapshotOptions::global_object_name_resolver' is deprecated: Use context_name_resolver callback instead. [-Wdeprecated-declarations]1375 1128 | HeapSnapshotOptions() {}1376 | ^1377../../deps/v8/include/v8-profiler.h:1142:25: note: declared here1378 1142 | ObjectNameResolver* global_object_name_resolver = nullptr;1379 | ^~~~~~~~~~~~~~~~~~~~~~~~~~~1380../../deps/v8/include/v8-profiler.h:1128:27: warning: 'v8::HeapProfiler::HeapSnapshotOptions::global_object_name_resolver' is deprecated: Use context_name_resolver callback instead. [-Wdeprecated-declarations]1381 1128 | HeapSnapshotOptions() {}1382 | ^1383../../deps/v8/include/v8-profiler.h:1142:25: note: declared here1384 1142 | ObjectNameResolver* global_object_name_resolver = nullptr;1385 | ^~~~~~~~~~~~~~~~~~~~~~~~~~~1386[203/1871] LINK torque1387[204/1871] CXX obj/src/node_base.node_i18n.o1388In file included from ../../src/memory_tracker.h:6,1389 from ../../src/base_object.h:29,1390 from ../../src/node_i18n.h:29,1391 from ../../src/node_i18n.cc:43:1392../../deps/v8/include/v8-profiler.h: In constructor 'v8::HeapProfiler::HeapSnapshotOptions::HeapSnapshotOptions()':1393../../deps/v8/include/v8-profiler.h:1128:27: warning: 'v8::HeapProfiler::HeapSnapshotOptions::global_object_name_resolver' is deprecated: Use context_name_resolver callback instead. [-Wdeprecated-declarations]1394 1128 | HeapSnapshotOptions() {}1395 | ^1396../../deps/v8/include/v8-profiler.h:1142:25: note: declared here1397 1142 | ObjectNameResolver* global_object_name_resolver = nullptr;1398 | ^~~~~~~~~~~~~~~~~~~~~~~~~~~1399../../deps/v8/include/v8-profiler.h:1128:27: warning: 'v8::HeapProfiler::HeapSnapshotOptions::global_object_name_resolver' is deprecated: Use context_name_resolver callback instead. [-Wdeprecated-declarations]1400 1128 | HeapSnapshotOptions() {}1401 | ^1402../../deps/v8/include/v8-profiler.h:1142:25: note: declared here1403 1142 | ObjectNameResolver* global_object_name_resolver = nullptr;1404 | ^~~~~~~~~~~~~~~~~~~~~~~~~~~1405[205/1871] CXX obj/src/node_base.node_ipc_serdes.o1406In file included from ../../src/memory_tracker.h:6,1407 from ../../src/aliased_buffer.h:7,1408 from ../../src/aliased_buffer-inl.h:6,1409 from ../../src/env-inl.h:27,1410 from ../../src/node_ipc_serdes.cc:1:1411../../deps/v8/include/v8-profiler.h: In constructor 'v8::HeapProfiler::HeapSnapshotOptions::HeapSnapshotOptions()':1412../../deps/v8/include/v8-profiler.h:1128:27: warning: 'v8::HeapProfiler::HeapSnapshotOptions::global_object_name_resolver' is deprecated: Use context_name_resolver callback instead. [-Wdeprecated-declarations]1413 1128 | HeapSnapshotOptions() {}1414 | ^1415../../deps/v8/include/v8-profiler.h:1142:25: note: declared here1416 1142 | ObjectNameResolver* global_object_name_resolver = nullptr;1417 | ^~~~~~~~~~~~~~~~~~~~~~~~~~~1418../../deps/v8/include/v8-profiler.h:1128:27: warning: 'v8::HeapProfiler::HeapSnapshotOptions::global_object_name_resolver' is deprecated: Use context_name_resolver callback instead. [-Wdeprecated-declarations]1419 1128 | HeapSnapshotOptions() {}1420 | ^1421../../deps/v8/include/v8-profiler.h:1142:25: note: declared here1422 1142 | ObjectNameResolver* global_object_name_resolver = nullptr;1423 | ^~~~~~~~~~~~~~~~~~~~~~~~~~~1424[206/1871] CXX obj/deps/v8/third_party/simdutf/simdutf.simdutf.o1425[207/1871] AR obj/tools/v8_gypfiles/libsimdutf.a1426[208/1871] CXX obj/src/node_base.node_contextify.o1427In file included from ../../src/memory_tracker.h:6,1428 from ../../src/base_object.h:29,1429 from ../../src/base_object-inl.h:27,1430 from ../../src/node_contextify.h:6,1431 from ../../src/node_contextify.cc:22:1432../../deps/v8/include/v8-profiler.h: In constructor 'v8::HeapProfiler::HeapSnapshotOptions::HeapSnapshotOptions()':1433../../deps/v8/include/v8-profiler.h:1128:27: warning: 'v8::HeapProfiler::HeapSnapshotOptions::global_object_name_resolver' is deprecated: Use context_name_resolver callback instead. [-Wdeprecated-declarations]1434 1128 | HeapSnapshotOptions() {}1435 | ^1436../../deps/v8/include/v8-profiler.h:1142:25: note: declared here1437 1142 | ObjectNameResolver* global_object_name_resolver = nullptr;1438 | ^~~~~~~~~~~~~~~~~~~~~~~~~~~1439../../deps/v8/include/v8-profiler.h:1128:27: warning: 'v8::HeapProfiler::HeapSnapshotOptions::global_object_name_resolver' is deprecated: Use context_name_resolver callback instead. [-Wdeprecated-declarations]1440 1128 | HeapSnapshotOptions() {}1441 | ^1442../../deps/v8/include/v8-profiler.h:1142:25: note: declared here1443 1142 | ObjectNameResolver* global_object_name_resolver = nullptr;1444 | ^~~~~~~~~~~~~~~~~~~~~~~~~~~1445[209/1871] CXX obj/src/node_base.node_metadata.o1446In file included from ../../src/util.h:29,1447 from ../../src/node_metadata.cc:22:1448../../deps/v8/include/v8-profiler.h: In constructor 'v8::HeapProfiler::HeapSnapshotOptions::HeapSnapshotOptions()':1449../../deps/v8/include/v8-profiler.h:1128:27: warning: 'v8::HeapProfiler::HeapSnapshotOptions::global_object_name_resolver' is deprecated: Use context_name_resolver callback instead. [-Wdeprecated-declarations]1450 1128 | HeapSnapshotOptions() {}1451 | ^1452../../deps/v8/include/v8-profiler.h:1142:25: note: declared here1453 1142 | ObjectNameResolver* global_object_name_resolver = nullptr;1454 | ^~~~~~~~~~~~~~~~~~~~~~~~~~~1455../../deps/v8/include/v8-profiler.h:1128:27: warning: 'v8::HeapProfiler::HeapSnapshotOptions::global_object_name_resolver' is deprecated: Use context_name_resolver callback instead. [-Wdeprecated-declarations]1456 1128 | HeapSnapshotOptions() {}1457 | ^1458../../deps/v8/include/v8-profiler.h:1142:25: note: declared here1459 1142 | ObjectNameResolver* global_object_name_resolver = nullptr;1460 | ^~~~~~~~~~~~~~~~~~~~~~~~~~~1461[210/1871] CXX obj/src/node_base.node_main_instance.o1462In file included from ../../src/util.h:29,1463 from ../../src/node_main_instance.h:11,1464 from ../../src/node_main_instance.cc:1:1465../../deps/v8/include/v8-profiler.h: In constructor 'v8::HeapProfiler::HeapSnapshotOptions::HeapSnapshotOptions()':1466../../deps/v8/include/v8-profiler.h:1128:27: warning: 'v8::HeapProfiler::HeapSnapshotOptions::global_object_name_resolver' is deprecated: Use context_name_resolver callback instead. [-Wdeprecated-declarations]1467 1128 | HeapSnapshotOptions() {}1468 | ^1469../../deps/v8/include/v8-profiler.h:1142:25: note: declared here1470 1142 | ObjectNameResolver* global_object_name_resolver = nullptr;1471 | ^~~~~~~~~~~~~~~~~~~~~~~~~~~1472../../deps/v8/include/v8-profiler.h:1128:27: warning: 'v8::HeapProfiler::HeapSnapshotOptions::global_object_name_resolver' is deprecated: Use context_name_resolver callback instead. [-Wdeprecated-declarations]1473 1128 | HeapSnapshotOptions() {}1474 | ^1475../../deps/v8/include/v8-profiler.h:1142:25: note: declared here1476 1142 | ObjectNameResolver* global_object_name_resolver = nullptr;1477 | ^~~~~~~~~~~~~~~~~~~~~~~~~~~1478[211/1871] CXX obj/src/node_base.node_locks.o1479In file included from ../../src/memory_tracker.h:6,1480 from ../../src/base_object.h:29,1481 from ../../src/node_locks.h:11,1482 from ../../src/node_locks.cc:1:1483../../deps/v8/include/v8-profiler.h: In constructor 'v8::HeapProfiler::HeapSnapshotOptions::HeapSnapshotOptions()':1484../../deps/v8/include/v8-profiler.h:1128:27: warning: 'v8::HeapProfiler::HeapSnapshotOptions::global_object_name_resolver' is deprecated: Use context_name_resolver callback instead. [-Wdeprecated-declarations]1485 1128 | HeapSnapshotOptions() {}1486 | ^1487../../deps/v8/include/v8-profiler.h:1142:25: note: declared here1488 1142 | ObjectNameResolver* global_object_name_resolver = nullptr;1489 | ^~~~~~~~~~~~~~~~~~~~~~~~~~~1490../../deps/v8/include/v8-profiler.h:1128:27: warning: 'v8::HeapProfiler::HeapSnapshotOptions::global_object_name_resolver' is deprecated: Use context_name_resolver callback instead. [-Wdeprecated-declarations]1491 1128 | HeapSnapshotOptions() {}1492 | ^1493../../deps/v8/include/v8-profiler.h:1142:25: note: declared here1494 1142 | ObjectNameResolver* global_object_name_resolver = nullptr;1495 | ^~~~~~~~~~~~~~~~~~~~~~~~~~~1496[212/1871] CXX obj/src/node_base.node_diagnostics_channel.o1497In file included from ../../src/memory_tracker.h:6,1498 from ../../src/aliased_buffer.h:7,1499 from ../../src/node_diagnostics_channel.h:11,1500 from ../../src/node_diagnostics_channel.cc:1:1501../../deps/v8/include/v8-profiler.h: In constructor 'v8::HeapProfiler::HeapSnapshotOptions::HeapSnapshotOptions()':1502../../deps/v8/include/v8-profiler.h:1128:27: warning: 'v8::HeapProfiler::HeapSnapshotOptions::global_object_name_resolver' is deprecated: Use context_name_resolver callback instead. [-Wdeprecated-declarations]1503 1128 | HeapSnapshotOptions() {}1504 | ^1505../../deps/v8/include/v8-profiler.h:1142:25: note: declared here1506 1142 | ObjectNameResolver* global_object_name_resolver = nullptr;1507 | ^~~~~~~~~~~~~~~~~~~~~~~~~~~1508../../deps/v8/include/v8-profiler.h:1128:27: warning: 'v8::HeapProfiler::HeapSnapshotOptions::global_object_name_resolver' is deprecated: Use context_name_resolver callback instead. [-Wdeprecated-declarations]1509 1128 | HeapSnapshotOptions() {}1510 | ^1511../../deps/v8/include/v8-profiler.h:1142:25: note: declared here1512 1142 | ObjectNameResolver* global_object_name_resolver = nullptr;1513 | ^~~~~~~~~~~~~~~~~~~~~~~~~~~1514[213/1871] CXX obj/src/node_base.node_os.o1515In file included from ../../src/memory_tracker.h:6,1516 from ../../src/aliased_buffer.h:7,1517 from ../../src/aliased_buffer-inl.h:6,1518 from ../../src/env-inl.h:27,1519 from ../../src/node_os.cc:22:1520../../deps/v8/include/v8-profiler.h: In constructor 'v8::HeapProfiler::HeapSnapshotOptions::HeapSnapshotOptions()':1521../../deps/v8/include/v8-profiler.h:1128:27: warning: 'v8::HeapProfiler::HeapSnapshotOptions::global_object_name_resolver' is deprecated: Use context_name_resolver callback instead. [-Wdeprecated-declarations]1522 1128 | HeapSnapshotOptions() {}1523 | ^1524../../deps/v8/include/v8-profiler.h:1142:25: note: declared here1525 1142 | ObjectNameResolver* global_object_name_resolver = nullptr;1526 | ^~~~~~~~~~~~~~~~~~~~~~~~~~~1527../../deps/v8/include/v8-profiler.h:1128:27: warning: 'v8::HeapProfiler::HeapSnapshotOptions::global_object_name_resolver' is deprecated: Use context_name_resolver callback instead. [-Wdeprecated-declarations]1528 1128 | HeapSnapshotOptions() {}1529 | ^1530../../deps/v8/include/v8-profiler.h:1142:25: note: declared here1531 1142 | ObjectNameResolver* global_object_name_resolver = nullptr;1532 | ^~~~~~~~~~~~~~~~~~~~~~~~~~~1533[214/1871] CXX obj/src/node_base.node_perf.o1534In file included from ../../src/memory_tracker.h:6,1535 from ../../src/base_object.h:29,1536 from ../../src/base_object-inl.h:27,1537 from ../../src/node_perf.h:6,1538 from ../../src/node_perf.cc:1:1539../../deps/v8/include/v8-profiler.h: In constructor 'v8::HeapProfiler::HeapSnapshotOptions::HeapSnapshotOptions()':1540../../deps/v8/include/v8-profiler.h:1128:27: warning: 'v8::HeapProfiler::HeapSnapshotOptions::global_object_name_resolver' is deprecated: Use context_name_resolver callback instead. [-Wdeprecated-declarations]1541 1128 | HeapSnapshotOptions() {}1542 | ^1543../../deps/v8/include/v8-profiler.h:1142:25: note: declared here1544 1142 | ObjectNameResolver* global_object_name_resolver = nullptr;1545 | ^~~~~~~~~~~~~~~~~~~~~~~~~~~1546../../deps/v8/include/v8-profiler.h:1128:27: warning: 'v8::HeapProfiler::HeapSnapshotOptions::global_object_name_resolver' is deprecated: Use context_name_resolver callback instead. [-Wdeprecated-declarations]1547 1128 | HeapSnapshotOptions() {}1548 | ^1549../../deps/v8/include/v8-profiler.h:1142:25: note: declared here1550 1142 | ObjectNameResolver* global_object_name_resolver = nullptr;1551 | ^~~~~~~~~~~~~~~~~~~~~~~~~~~1552[215/1871] CXX obj/src/node_base.node_process_events.o1553In file included from ../../src/memory_tracker.h:6,1554 from ../../src/aliased_buffer.h:7,1555 from ../../src/aliased_buffer-inl.h:6,1556 from ../../src/env-inl.h:27,1557 from ../../src/node_process_events.cc:3:1558../../deps/v8/include/v8-profiler.h: In constructor 'v8::HeapProfiler::HeapSnapshotOptions::HeapSnapshotOptions()':1559../../deps/v8/include/v8-profiler.h:1128:27: warning: 'v8::HeapProfiler::HeapSnapshotOptions::global_object_name_resolver' is deprecated: Use context_name_resolver callback instead. [-Wdeprecated-declarations]1560 1128 | HeapSnapshotOptions() {}1561 | ^1562../../deps/v8/include/v8-profiler.h:1142:25: note: declared here1563 1142 | ObjectNameResolver* global_object_name_resolver = nullptr;1564 | ^~~~~~~~~~~~~~~~~~~~~~~~~~~1565../../deps/v8/include/v8-profiler.h:1128:27: warning: 'v8::HeapProfiler::HeapSnapshotOptions::global_object_name_resolver' is deprecated: Use context_name_resolver callback instead. [-Wdeprecated-declarations]1566 1128 | HeapSnapshotOptions() {}1567 | ^1568../../deps/v8/include/v8-profiler.h:1142:25: note: declared here1569 1142 | ObjectNameResolver* global_object_name_resolver = nullptr;1570 | ^~~~~~~~~~~~~~~~~~~~~~~~~~~1571[216/1871] CXX obj/src/node_base.node_postmortem_metadata.o1572In file included from ../../src/memory_tracker.h:6,1573 from ../../src/base_object.h:29,1574 from ../../src/base_object-inl.h:27,1575 from ../../src/node_postmortem_metadata.cc:1:1576../../deps/v8/include/v8-profiler.h: In constructor 'v8::HeapProfiler::HeapSnapshotOptions::HeapSnapshotOptions()':1577../../deps/v8/include/v8-profiler.h:1128:27: warning: 'v8::HeapProfiler::HeapSnapshotOptions::global_object_name_resolver' is deprecated: Use context_name_resolver callback instead. [-Wdeprecated-declarations]1578 1128 | HeapSnapshotOptions() {}1579 | ^1580../../deps/v8/include/v8-profiler.h:1142:25: note: declared here1581 1142 | ObjectNameResolver* global_object_name_resolver = nullptr;1582 | ^~~~~~~~~~~~~~~~~~~~~~~~~~~1583../../deps/v8/include/v8-profiler.h:1128:27: warning: 'v8::HeapProfiler::HeapSnapshotOptions::global_object_name_resolver' is deprecated: Use context_name_resolver callback instead. [-Wdeprecated-declarations]1584 1128 | HeapSnapshotOptions() {}1585 | ^1586../../deps/v8/include/v8-profiler.h:1142:25: note: declared here1587 1142 | ObjectNameResolver* global_object_name_resolver = nullptr;1588 | ^~~~~~~~~~~~~~~~~~~~~~~~~~~1589[217/1871] CXX obj/src/node_base.node_messaging.o1590In file included from ../../src/memory_tracker.h:6,1591 from ../../src/aliased_buffer.h:7,1592 from ../../src/env.h:27,1593 from ../../src/node_messaging.h:6,1594 from ../../src/node_messaging.cc:1:1595../../deps/v8/include/v8-profiler.h: In constructor 'v8::HeapProfiler::HeapSnapshotOptions::HeapSnapshotOptions()':1596../../deps/v8/include/v8-profiler.h:1128:27: warning: 'v8::HeapProfiler::HeapSnapshotOptions::global_object_name_resolver' is deprecated: Use context_name_resolver callback instead. [-Wdeprecated-declarations]1597 1128 | HeapSnapshotOptions() {}1598 | ^1599../../deps/v8/include/v8-profiler.h:1142:25: note: declared here1600 1142 | ObjectNameResolver* global_object_name_resolver = nullptr;1601 | ^~~~~~~~~~~~~~~~~~~~~~~~~~~1602../../deps/v8/include/v8-profiler.h:1128:27: warning: 'v8::HeapProfiler::HeapSnapshotOptions::global_object_name_resolver' is deprecated: Use context_name_resolver callback instead. [-Wdeprecated-declarations]1603 1128 | HeapSnapshotOptions() {}1604 | ^1605../../deps/v8/include/v8-profiler.h:1142:25: note: declared here1606 1142 | ObjectNameResolver* global_object_name_resolver = nullptr;1607 | ^~~~~~~~~~~~~~~~~~~~~~~~~~~1608[218/1871] CXX obj/src/node_base.node_process_object.o1609In file included from ../../src/memory_tracker.h:6,1610 from ../../src/aliased_buffer.h:7,1611 from ../../src/aliased_buffer-inl.h:6,1612 from ../../src/env-inl.h:27,1613 from ../../src/node_process_object.cc:1:1614../../deps/v8/include/v8-profiler.h: In constructor 'v8::HeapProfiler::HeapSnapshotOptions::HeapSnapshotOptions()':1615../../deps/v8/include/v8-profiler.h:1128:27: warning: 'v8::HeapProfiler::HeapSnapshotOptions::global_object_name_resolver' is deprecated: Use context_name_resolver callback instead. [-Wdeprecated-declarations]1616 1128 | HeapSnapshotOptions() {}1617 | ^1618../../deps/v8/include/v8-profiler.h:1142:25: note: declared here1619 1142 | ObjectNameResolver* global_object_name_resolver = nullptr;1620 | ^~~~~~~~~~~~~~~~~~~~~~~~~~~1621../../deps/v8/include/v8-profiler.h:1128:27: warning: 'v8::HeapProfiler::HeapSnapshotOptions::global_object_name_resolver' is deprecated: Use context_name_resolver callback instead. [-Wdeprecated-declarations]1622 1128 | HeapSnapshotOptions() {}1623 | ^1624../../deps/v8/include/v8-profiler.h:1142:25: note: declared here1625 1142 | ObjectNameResolver* global_object_name_resolver = nullptr;1626 | ^~~~~~~~~~~~~~~~~~~~~~~~~~~1627[219/1871] CXX obj/src/node_base.node_report_utils.o1628In file included from ../../src/memory_tracker.h:6,1629 from ../../src/aliased_buffer.h:7,1630 from ../../src/env.h:27,1631 from ../../src/node_internals.h:27,1632 from ../../src/node_report_utils.cc:2:1633../../deps/v8/include/v8-profiler.h: In constructor 'v8::HeapProfiler::HeapSnapshotOptions::HeapSnapshotOptions()':1634../../deps/v8/include/v8-profiler.h:1128:27: warning: 'v8::HeapProfiler::HeapSnapshotOptions::global_object_name_resolver' is deprecated: Use context_name_resolver callback instead. [-Wdeprecated-declarations]1635 1128 | HeapSnapshotOptions() {}1636 | ^1637../../deps/v8/include/v8-profiler.h:1142:25: note: declared here1638 1142 | ObjectNameResolver* global_object_name_resolver = nullptr;1639 | ^~~~~~~~~~~~~~~~~~~~~~~~~~~1640../../deps/v8/include/v8-profiler.h:1128:27: warning: 'v8::HeapProfiler::HeapSnapshotOptions::global_object_name_resolver' is deprecated: Use context_name_resolver callback instead. [-Wdeprecated-declarations]1641 1128 | HeapSnapshotOptions() {}1642 | ^1643../../deps/v8/include/v8-profiler.h:1142:25: note: declared here1644 1142 | ObjectNameResolver* global_object_name_resolver = nullptr;1645 | ^~~~~~~~~~~~~~~~~~~~~~~~~~~1646[220/1871] CXX obj/src/node_base.node_report_module.o1647In file included from ../../src/memory_tracker.h:6,1648 from ../../src/aliased_buffer.h:7,1649 from ../../src/env.h:27,1650 from ../../src/node_report_module.cc:1:1651../../deps/v8/include/v8-profiler.h: In constructor 'v8::HeapProfiler::HeapSnapshotOptions::HeapSnapshotOptions()':1652../../deps/v8/include/v8-profiler.h:1128:27: warning: 'v8::HeapProfiler::HeapSnapshotOptions::global_object_name_resolver' is deprecated: Use context_name_resolver callback instead. [-Wdeprecated-declarations]1653 1128 | HeapSnapshotOptions() {}1654 | ^1655../../deps/v8/include/v8-profiler.h:1142:25: note: declared here1656 1142 | ObjectNameResolver* global_object_name_resolver = nullptr;1657 | ^~~~~~~~~~~~~~~~~~~~~~~~~~~1658../../deps/v8/include/v8-profiler.h:1128:27: warning: 'v8::HeapProfiler::HeapSnapshotOptions::global_object_name_resolver' is deprecated: Use context_name_resolver callback instead. [-Wdeprecated-declarations]1659 1128 | HeapSnapshotOptions() {}1660 | ^1661../../deps/v8/include/v8-profiler.h:1142:25: note: declared here1662 1142 | ObjectNameResolver* global_object_name_resolver = nullptr;1663 | ^~~~~~~~~~~~~~~~~~~~~~~~~~~1664[221/1871] CXX obj/src/node_base.node_platform.o1665In file included from ../../src/util.h:29,1666 from ../../src/node_mutex.h:6,1667 from ../../src/node_platform.h:15,1668 from ../../src/node_platform.cc:1:1669../../deps/v8/include/v8-profiler.h: In constructor 'v8::HeapProfiler::HeapSnapshotOptions::HeapSnapshotOptions()':1670../../deps/v8/include/v8-profiler.h:1128:27: warning: 'v8::HeapProfiler::HeapSnapshotOptions::global_object_name_resolver' is deprecated: Use context_name_resolver callback instead. [-Wdeprecated-declarations]1671 1128 | HeapSnapshotOptions() {}1672 | ^1673../../deps/v8/include/v8-profiler.h:1142:25: note: declared here1674 1142 | ObjectNameResolver* global_object_name_resolver = nullptr;1675 | ^~~~~~~~~~~~~~~~~~~~~~~~~~~1676../../deps/v8/include/v8-profiler.h:1128:27: warning: 'v8::HeapProfiler::HeapSnapshotOptions::global_object_name_resolver' is deprecated: Use context_name_resolver callback instead. [-Wdeprecated-declarations]1677 1128 | HeapSnapshotOptions() {}1678 | ^1679../../deps/v8/include/v8-profiler.h:1142:25: note: declared here1680 1142 | ObjectNameResolver* global_object_name_resolver = nullptr;1681 | ^~~~~~~~~~~~~~~~~~~~~~~~~~~1682[222/1871] CXX obj/src/node_base.node_process_methods.o1683In file included from ../../src/memory_tracker.h:6,1684 from ../../src/base_object.h:29,1685 from ../../src/async_wrap.h:27,1686 from ../../src/async_wrap-inl.h:27,1687 from ../../src/node_process_methods.cc:1:1688../../deps/v8/include/v8-profiler.h: In constructor 'v8::HeapProfiler::HeapSnapshotOptions::HeapSnapshotOptions()':1689../../deps/v8/include/v8-profiler.h:1128:27: warning: 'v8::HeapProfiler::HeapSnapshotOptions::global_object_name_resolver' is deprecated: Use context_name_resolver callback instead. [-Wdeprecated-declarations]1690 1128 | HeapSnapshotOptions() {}1691 | ^1692../../deps/v8/include/v8-profiler.h:1142:25: note: declared here1693 1142 | ObjectNameResolver* global_object_name_resolver = nullptr;1694 | ^~~~~~~~~~~~~~~~~~~~~~~~~~~1695../../deps/v8/include/v8-profiler.h:1128:27: warning: 'v8::HeapProfiler::HeapSnapshotOptions::global_object_name_resolver' is deprecated: Use context_name_resolver callback instead. [-Wdeprecated-declarations]1696 1128 | HeapSnapshotOptions() {}1697 | ^1698../../deps/v8/include/v8-profiler.h:1142:25: note: declared here1699 1142 | ObjectNameResolver* global_object_name_resolver = nullptr;1700 | ^~~~~~~~~~~~~~~~~~~~~~~~~~~1701[223/1871] CXX obj/src/node_base.node_modules.o1702In file included from ../../src/memory_tracker.h:6,1703 from ../../src/aliased_buffer.h:7,1704 from ../../src/node_snapshotable.h:7,1705 from ../../src/node_modules.h:7,1706 from ../../src/node_modules.cc:1:1707../../deps/v8/include/v8-profiler.h: In constructor 'v8::HeapProfiler::HeapSnapshotOptions::HeapSnapshotOptions()':1708../../deps/v8/include/v8-profiler.h:1128:27: warning: 'v8::HeapProfiler::HeapSnapshotOptions::global_object_name_resolver' is deprecated: Use context_name_resolver callback instead. [-Wdeprecated-declarations]1709 1128 | HeapSnapshotOptions() {}1710 | ^1711../../deps/v8/include/v8-profiler.h:1142:25: note: declared here1712 1142 | ObjectNameResolver* global_object_name_resolver = nullptr;1713 | ^~~~~~~~~~~~~~~~~~~~~~~~~~~1714../../deps/v8/include/v8-profiler.h:1128:27: warning: 'v8::HeapProfiler::HeapSnapshotOptions::global_object_name_resolver' is deprecated: Use context_name_resolver callback instead. [-Wdeprecated-declarations]1715 1128 | HeapSnapshotOptions() {}1716 | ^1717../../deps/v8/include/v8-profiler.h:1142:25: note: declared here1718 1142 | ObjectNameResolver* global_object_name_resolver = nullptr;1719 | ^~~~~~~~~~~~~~~~~~~~~~~~~~~1720[224/1871] CXX obj/src/node_base.node_report.o1721In file included from ../../src/util.h:29,1722 from ../../src/node_report.h:9,1723 from ../../src/node_report.cc:1:1724../../deps/v8/include/v8-profiler.h: In constructor 'v8::HeapProfiler::HeapSnapshotOptions::HeapSnapshotOptions()':1725../../deps/v8/include/v8-profiler.h:1128:27: warning: 'v8::HeapProfiler::HeapSnapshotOptions::global_object_name_resolver' is deprecated: Use context_name_resolver callback instead. [-Wdeprecated-declarations]1726 1128 | HeapSnapshotOptions() {}1727 | ^1728../../deps/v8/include/v8-profiler.h:1142:25: note: declared here1729 1142 | ObjectNameResolver* global_object_name_resolver = nullptr;1730 | ^~~~~~~~~~~~~~~~~~~~~~~~~~~1731../../deps/v8/include/v8-profiler.h:1128:27: warning: 'v8::HeapProfiler::HeapSnapshotOptions::global_object_name_resolver' is deprecated: Use context_name_resolver callback instead. [-Wdeprecated-declarations]1732 1128 | HeapSnapshotOptions() {}1733 | ^1734../../deps/v8/include/v8-profiler.h:1142:25: note: declared here1735 1142 | ObjectNameResolver* global_object_name_resolver = nullptr;1736 | ^~~~~~~~~~~~~~~~~~~~~~~~~~~1737[225/1871] CXX obj/src/node_base.node_serdes.o1738In file included from ../../src/memory_tracker.h:6,1739 from ../../src/base_object.h:29,1740 from ../../src/base_object-inl.h:27,1741 from ../../src/node_serdes.cc:1:1742../../deps/v8/include/v8-profiler.h: In constructor 'v8::HeapProfiler::HeapSnapshotOptions::HeapSnapshotOptions()':1743../../deps/v8/include/v8-profiler.h:1128:27: warning: 'v8::HeapProfiler::HeapSnapshotOptions::global_object_name_resolver' is deprecated: Use context_name_resolver callback instead. [-Wdeprecated-declarations]1744 1128 | HeapSnapshotOptions() {}1745 | ^1746../../deps/v8/include/v8-profiler.h:1142:25: note: declared here1747 1142 | ObjectNameResolver* global_object_name_resolver = nullptr;1748 | ^~~~~~~~~~~~~~~~~~~~~~~~~~~1749../../deps/v8/include/v8-profiler.h:1128:27: warning: 'v8::HeapProfiler::HeapSnapshotOptions::global_object_name_resolver' is deprecated: Use context_name_resolver callback instead. [-Wdeprecated-declarations]1750 1128 | HeapSnapshotOptions() {}1751 | ^1752../../deps/v8/include/v8-profiler.h:1142:25: note: declared here1753 1142 | ObjectNameResolver* global_object_name_resolver = nullptr;1754 | ^~~~~~~~~~~~~~~~~~~~~~~~~~~1755[226/1871] CXX obj/src/node_base.node_shadow_realm.o1756In file included from ../../src/memory_tracker.h:6,1757 from ../../src/cleanup_queue.h:11,1758 from ../../src/node_realm.h:8,1759 from ../../src/node_shadow_realm.h:6,1760 from ../../src/node_shadow_realm.cc:1:1761../../deps/v8/include/v8-profiler.h: In constructor 'v8::HeapProfiler::HeapSnapshotOptions::HeapSnapshotOptions()':1762../../deps/v8/include/v8-profiler.h:1128:27: warning: 'v8::HeapProfiler::HeapSnapshotOptions::global_object_name_resolver' is deprecated: Use context_name_resolver callback instead. [-Wdeprecated-declarations]1763 1128 | HeapSnapshotOptions() {}1764 | ^1765../../deps/v8/include/v8-profiler.h:1142:25: note: declared here1766 1142 | ObjectNameResolver* global_object_name_resolver = nullptr;1767 | ^~~~~~~~~~~~~~~~~~~~~~~~~~~1768../../deps/v8/include/v8-profiler.h:1128:27: warning: 'v8::HeapProfiler::HeapSnapshotOptions::global_object_name_resolver' is deprecated: Use context_name_resolver callback instead. [-Wdeprecated-declarations]1769 1128 | HeapSnapshotOptions() {}1770 | ^1771../../deps/v8/include/v8-profiler.h:1142:25: note: declared here1772 1142 | ObjectNameResolver* global_object_name_resolver = nullptr;1773 | ^~~~~~~~~~~~~~~~~~~~~~~~~~~1774[227/1871] CXX obj/src/node_base.node_realm.o1775In file included from ../../src/memory_tracker.h:6,1776 from ../../src/cleanup_queue.h:11,1777 from ../../src/node_realm.h:8,1778 from ../../src/node_realm.cc:1:1779../../deps/v8/include/v8-profiler.h: In constructor 'v8::HeapProfiler::HeapSnapshotOptions::HeapSnapshotOptions()':1780../../deps/v8/include/v8-profiler.h:1128:27: warning: 'v8::HeapProfiler::HeapSnapshotOptions::global_object_name_resolver' is deprecated: Use context_name_resolver callback instead. [-Wdeprecated-declarations]1781 1128 | HeapSnapshotOptions() {}1782 | ^1783../../deps/v8/include/v8-profiler.h:1142:25: note: declared here1784 1142 | ObjectNameResolver* global_object_name_resolver = nullptr;1785 | ^~~~~~~~~~~~~~~~~~~~~~~~~~~1786../../deps/v8/include/v8-profiler.h:1128:27: warning: 'v8::HeapProfiler::HeapSnapshotOptions::global_object_name_resolver' is deprecated: Use context_name_resolver callback instead. [-Wdeprecated-declarations]1787 1128 | HeapSnapshotOptions() {}1788 | ^1789../../deps/v8/include/v8-profiler.h:1142:25: note: declared here1790 1142 | ObjectNameResolver* global_object_name_resolver = nullptr;1791 | ^~~~~~~~~~~~~~~~~~~~~~~~~~~1792[228/1871] CXX obj/src/node_base.node_http2.o1793In file included from ../../src/memory_tracker.h:6,1794 from ../../src/aliased_buffer.h:7,1795 from ../../src/env.h:27,1796 from ../../src/node_http2.h:11,1797 from ../../src/node_http2.cc:1:1798../../deps/v8/include/v8-profiler.h: In constructor 'v8::HeapProfiler::HeapSnapshotOptions::HeapSnapshotOptions()':1799../../deps/v8/include/v8-profiler.h:1128:27: warning: 'v8::HeapProfiler::HeapSnapshotOptions::global_object_name_resolver' is deprecated: Use context_name_resolver callback instead. [-Wdeprecated-declarations]1800 1128 | HeapSnapshotOptions() {}1801 | ^1802../../deps/v8/include/v8-profiler.h:1142:25: note: declared here1803 1142 | ObjectNameResolver* global_object_name_resolver = nullptr;1804 | ^~~~~~~~~~~~~~~~~~~~~~~~~~~1805../../deps/v8/include/v8-profiler.h:1128:27: warning: 'v8::HeapProfiler::HeapSnapshotOptions::global_object_name_resolver' is deprecated: Use context_name_resolver callback instead. [-Wdeprecated-declarations]1806 1128 | HeapSnapshotOptions() {}1807 | ^1808../../deps/v8/include/v8-profiler.h:1142:25: note: declared here1809 1142 | ObjectNameResolver* global_object_name_resolver = nullptr;1810 | ^~~~~~~~~~~~~~~~~~~~~~~~~~~1811[229/1871] CXX obj/src/node_base.node_stat_watcher.o1812In file included from ../../src/memory_tracker.h:6,1813 from ../../src/base_object.h:29,1814 from ../../src/async_wrap.h:27,1815 from ../../src/handle_wrap.h:27,1816 from ../../src/node_stat_watcher.h:28,1817 from ../../src/node_stat_watcher.cc:22:1818../../deps/v8/include/v8-profiler.h: In constructor 'v8::HeapProfiler::HeapSnapshotOptions::HeapSnapshotOptions()':1819../../deps/v8/include/v8-profiler.h:1128:27: warning: 'v8::HeapProfiler::HeapSnapshotOptions::global_object_name_resolver' is deprecated: Use context_name_resolver callback instead. [-Wdeprecated-declarations]1820 1128 | HeapSnapshotOptions() {}1821 | ^1822../../deps/v8/include/v8-profiler.h:1142:25: note: declared here1823 1142 | ObjectNameResolver* global_object_name_resolver = nullptr;1824 | ^~~~~~~~~~~~~~~~~~~~~~~~~~~1825../../deps/v8/include/v8-profiler.h:1128:27: warning: 'v8::HeapProfiler::HeapSnapshotOptions::global_object_name_resolver' is deprecated: Use context_name_resolver callback instead. [-Wdeprecated-declarations]1826 1128 | HeapSnapshotOptions() {}1827 | ^1828../../deps/v8/include/v8-profiler.h:1142:25: note: declared here1829 1142 | ObjectNameResolver* global_object_name_resolver = nullptr;1830 | ^~~~~~~~~~~~~~~~~~~~~~~~~~~1831[230/1871] CXX obj/src/node_base.node_file.o1832In file included from ../../src/memory_tracker.h:6,1833 from ../../src/aliased_buffer.h:7,1834 from ../../src/node_file.h:7,1835 from ../../src/node_file.cc:21:1836../../deps/v8/include/v8-profiler.h: In constructor 'v8::HeapProfiler::HeapSnapshotOptions::HeapSnapshotOptions()':1837../../deps/v8/include/v8-profiler.h:1128:27: warning: 'v8::HeapProfiler::HeapSnapshotOptions::global_object_name_resolver' is deprecated: Use context_name_resolver callback instead. [-Wdeprecated-declarations]1838 1128 | HeapSnapshotOptions() {}1839 | ^1840../../deps/v8/include/v8-profiler.h:1142:25: note: declared here1841 1142 | ObjectNameResolver* global_object_name_resolver = nullptr;1842 | ^~~~~~~~~~~~~~~~~~~~~~~~~~~1843../../deps/v8/include/v8-profiler.h:1128:27: warning: 'v8::HeapProfiler::HeapSnapshotOptions::global_object_name_resolver' is deprecated: Use context_name_resolver callback instead. [-Wdeprecated-declarations]1844 1128 | HeapSnapshotOptions() {}1845 | ^1846../../deps/v8/include/v8-profiler.h:1142:25: note: declared here1847 1142 | ObjectNameResolver* global_object_name_resolver = nullptr;1848 | ^~~~~~~~~~~~~~~~~~~~~~~~~~~1849[231/1871] CXX obj/src/node_base.node_task_queue.o1850In file included from ../../src/memory_tracker.h:6,1851 from ../../src/base_object.h:29,1852 from ../../src/async_wrap.h:27,1853 from ../../src/node_task_queue.cc:1:1854../../deps/v8/include/v8-profiler.h: In constructor 'v8::HeapProfiler::HeapSnapshotOptions::HeapSnapshotOptions()':1855../../deps/v8/include/v8-profiler.h:1128:27: warning: 'v8::HeapProfiler::HeapSnapshotOptions::global_object_name_resolver' is deprecated: Use context_name_resolver callback instead. [-Wdeprecated-declarations]1856 1128 | HeapSnapshotOptions() {}1857 | ^1858../../deps/v8/include/v8-profiler.h:1142:25: note: declared here1859 1142 | ObjectNameResolver* global_object_name_resolver = nullptr;1860 | ^~~~~~~~~~~~~~~~~~~~~~~~~~~1861../../deps/v8/include/v8-profiler.h:1128:27: warning: 'v8::HeapProfiler::HeapSnapshotOptions::global_object_name_resolver' is deprecated: Use context_name_resolver callback instead. [-Wdeprecated-declarations]1862 1128 | HeapSnapshotOptions() {}1863 | ^1864../../deps/v8/include/v8-profiler.h:1142:25: note: declared here1865 1142 | ObjectNameResolver* global_object_name_resolver = nullptr;1866 | ^~~~~~~~~~~~~~~~~~~~~~~~~~~1867[232/1871] CXX obj/src/node_base.node_symbols.o1868In file included from ../../src/memory_tracker.h:6,1869 from ../../src/aliased_buffer.h:7,1870 from ../../src/aliased_buffer-inl.h:6,1871 from ../../src/env-inl.h:27,1872 from ../../src/node_symbols.cc:1:1873../../deps/v8/include/v8-profiler.h: In constructor 'v8::HeapProfiler::HeapSnapshotOptions::HeapSnapshotOptions()':1874../../deps/v8/include/v8-profiler.h:1128:27: warning: 'v8::HeapProfiler::HeapSnapshotOptions::global_object_name_resolver' is deprecated: Use context_name_resolver callback instead. [-Wdeprecated-declarations]1875 1128 | HeapSnapshotOptions() {}1876 | ^1877../../deps/v8/include/v8-profiler.h:1142:25: note: declared here1878 1142 | ObjectNameResolver* global_object_name_resolver = nullptr;1879 | ^~~~~~~~~~~~~~~~~~~~~~~~~~~1880../../deps/v8/include/v8-profiler.h:1128:27: warning: 'v8::HeapProfiler::HeapSnapshotOptions::global_object_name_resolver' is deprecated: Use context_name_resolver callback instead. [-Wdeprecated-declarations]1881 1128 | HeapSnapshotOptions() {}1882 | ^1883../../deps/v8/include/v8-profiler.h:1142:25: note: declared here1884 1142 | ObjectNameResolver* global_object_name_resolver = nullptr;1885 | ^~~~~~~~~~~~~~~~~~~~~~~~~~~1886[233/1871] CXX obj/src/node_base.env.o1887In file included from ../../src/memory_tracker.h:6,1888 from ../../src/aliased_buffer.h:7,1889 from ../../src/env.h:27,1890 from ../../src/env.cc:1:1891../../deps/v8/include/v8-profiler.h: In constructor 'v8::HeapProfiler::HeapSnapshotOptions::HeapSnapshotOptions()':1892../../deps/v8/include/v8-profiler.h:1128:27: warning: 'v8::HeapProfiler::HeapSnapshotOptions::global_object_name_resolver' is deprecated: Use context_name_resolver callback instead. [-Wdeprecated-declarations]1893 1128 | HeapSnapshotOptions() {}1894 | ^1895../../deps/v8/include/v8-profiler.h:1142:25: note: declared here1896 1142 | ObjectNameResolver* global_object_name_resolver = nullptr;1897 | ^~~~~~~~~~~~~~~~~~~~~~~~~~~1898../../deps/v8/include/v8-profiler.h:1128:27: warning: 'v8::HeapProfiler::HeapSnapshotOptions::global_object_name_resolver' is deprecated: Use context_name_resolver callback instead. [-Wdeprecated-declarations]1899 1128 | HeapSnapshotOptions() {}1900 | ^1901../../deps/v8/include/v8-profiler.h:1142:25: note: declared here1902 1142 | ObjectNameResolver* global_object_name_resolver = nullptr;1903 | ^~~~~~~~~~~~~~~~~~~~~~~~~~~1904[234/1871] CXX obj/src/node_base.node_trace_events.o1905In file included from ../../src/memory_tracker.h:6,1906 from ../../src/base_object.h:29,1907 from ../../src/base_object-inl.h:27,1908 from ../../src/node_trace_events.cc:1:1909../../deps/v8/include/v8-profiler.h: In constructor 'v8::HeapProfiler::HeapSnapshotOptions::HeapSnapshotOptions()':1910../../deps/v8/include/v8-profiler.h:1128:27: warning: 'v8::HeapProfiler::HeapSnapshotOptions::global_object_name_resolver' is deprecated: Use context_name_resolver callback instead. [-Wdeprecated-declarations]1911 1128 | HeapSnapshotOptions() {}1912 | ^1913../../deps/v8/include/v8-profiler.h:1142:25: note: declared here1914 1142 | ObjectNameResolver* global_object_name_resolver = nullptr;1915 | ^~~~~~~~~~~~~~~~~~~~~~~~~~~1916../../deps/v8/include/v8-profiler.h:1128:27: warning: 'v8::HeapProfiler::HeapSnapshotOptions::global_object_name_resolver' is deprecated: Use context_name_resolver callback instead. [-Wdeprecated-declarations]1917 1128 | HeapSnapshotOptions() {}1918 | ^1919../../deps/v8/include/v8-profiler.h:1142:25: note: declared here1920 1142 | ObjectNameResolver* global_object_name_resolver = nullptr;1921 | ^~~~~~~~~~~~~~~~~~~~~~~~~~~1922[235/1871] CXX obj/src/node_base.node_sockaddr.o1923In file included from ../../src/memory_tracker.h:6,1924 from ../../src/base_object.h:29,1925 from ../../src/node_sockaddr.h:6,1926 from ../../src/node_sockaddr.cc:1:1927../../deps/v8/include/v8-profiler.h: In constructor 'v8::HeapProfiler::HeapSnapshotOptions::HeapSnapshotOptions()':1928../../deps/v8/include/v8-profiler.h:1128:27: warning: 'v8::HeapProfiler::HeapSnapshotOptions::global_object_name_resolver' is deprecated: Use context_name_resolver callback instead. [-Wdeprecated-declarations]1929 1128 | HeapSnapshotOptions() {}1930 | ^1931../../deps/v8/include/v8-profiler.h:1142:25: note: declared here1932 1142 | ObjectNameResolver* global_object_name_resolver = nullptr;1933 | ^~~~~~~~~~~~~~~~~~~~~~~~~~~1934../../deps/v8/include/v8-profiler.h:1128:27: warning: 'v8::HeapProfiler::HeapSnapshotOptions::global_object_name_resolver' is deprecated: Use context_name_resolver callback instead. [-Wdeprecated-declarations]1935 1128 | HeapSnapshotOptions() {}1936 | ^1937../../deps/v8/include/v8-profiler.h:1142:25: note: declared here1938 1142 | ObjectNameResolver* global_object_name_resolver = nullptr;1939 | ^~~~~~~~~~~~~~~~~~~~~~~~~~~1940[236/1871] CXX obj/src/node_base.node_types.o1941In file included from ../../src/memory_tracker.h:6,1942 from ../../src/aliased_buffer.h:7,1943 from ../../src/aliased_buffer-inl.h:6,1944 from ../../src/env-inl.h:27,1945 from ../../src/node_types.cc:1:1946../../deps/v8/include/v8-profiler.h: In constructor 'v8::HeapProfiler::HeapSnapshotOptions::HeapSnapshotOptions()':1947../../deps/v8/include/v8-profiler.h:1128:27: warning: 'v8::HeapProfiler::HeapSnapshotOptions::global_object_name_resolver' is deprecated: Use context_name_resolver callback instead. [-Wdeprecated-declarations]1948 1128 | HeapSnapshotOptions() {}1949 | ^1950../../deps/v8/include/v8-profiler.h:1142:25: note: declared here1951 1142 | ObjectNameResolver* global_object_name_resolver = nullptr;1952 | ^~~~~~~~~~~~~~~~~~~~~~~~~~~1953../../deps/v8/include/v8-profiler.h:1128:27: warning: 'v8::HeapProfiler::HeapSnapshotOptions::global_object_name_resolver' is deprecated: Use context_name_resolver callback instead. [-Wdeprecated-declarations]1954 1128 | HeapSnapshotOptions() {}1955 | ^1956../../deps/v8/include/v8-profiler.h:1142:25: note: declared here1957 1142 | ObjectNameResolver* global_object_name_resolver = nullptr;1958 | ^~~~~~~~~~~~~~~~~~~~~~~~~~~1959[237/1871] CXX obj/src/node_base.node_util.o1960In file included from ../../src/memory_tracker.h:6,1961 from ../../src/base_object.h:29,1962 from ../../src/base_object-inl.h:27,1963 from ../../src/node_util.cc:1:1964../../deps/v8/include/v8-profiler.h: In constructor 'v8::HeapProfiler::HeapSnapshotOptions::HeapSnapshotOptions()':1965../../deps/v8/include/v8-profiler.h:1128:27: warning: 'v8::HeapProfiler::HeapSnapshotOptions::global_object_name_resolver' is deprecated: Use context_name_resolver callback instead. [-Wdeprecated-declarations]1966 1128 | HeapSnapshotOptions() {}1967 | ^1968../../deps/v8/include/v8-profiler.h:1142:25: note: declared here1969 1142 | ObjectNameResolver* global_object_name_resolver = nullptr;1970 | ^~~~~~~~~~~~~~~~~~~~~~~~~~~1971../../deps/v8/include/v8-profiler.h:1128:27: warning: 'v8::HeapProfiler::HeapSnapshotOptions::global_object_name_resolver' is deprecated: Use context_name_resolver callback instead. [-Wdeprecated-declarations]1972 1128 | HeapSnapshotOptions() {}1973 | ^1974../../deps/v8/include/v8-profiler.h:1142:25: note: declared here1975 1142 | ObjectNameResolver* global_object_name_resolver = nullptr;1976 | ^~~~~~~~~~~~~~~~~~~~~~~~~~~1977[238/1871] CXX obj/src/node_base.node_sea.o1978In file included from ../../src/memory_tracker.h:6,1979 from ../../src/base_object.h:29,1980 from ../../src/async_wrap.h:27,1981 from ../../src/debug_utils.h:6,1982 from ../../src/debug_utils-inl.h:6,1983 from ../../src/blob_serializer_deserializer-inl.h:14,1984 from ../../src/node_sea.cc:3:1985../../deps/v8/include/v8-profiler.h: In constructor 'v8::HeapProfiler::HeapSnapshotOptions::HeapSnapshotOptions()':1986../../deps/v8/include/v8-profiler.h:1128:27: warning: 'v8::HeapProfiler::HeapSnapshotOptions::global_object_name_resolver' is deprecated: Use context_name_resolver callback instead. [-Wdeprecated-declarations]1987 1128 | HeapSnapshotOptions() {}1988 | ^1989../../deps/v8/include/v8-profiler.h:1142:25: note: declared here1990 1142 | ObjectNameResolver* global_object_name_resolver = nullptr;1991 | ^~~~~~~~~~~~~~~~~~~~~~~~~~~1992../../deps/v8/include/v8-profiler.h:1128:27: warning: 'v8::HeapProfiler::HeapSnapshotOptions::global_object_name_resolver' is deprecated: Use context_name_resolver callback instead. [-Wdeprecated-declarations]1993 1128 | HeapSnapshotOptions() {}1994 | ^1995../../deps/v8/include/v8-profiler.h:1142:25: note: declared here1996 1142 | ObjectNameResolver* global_object_name_resolver = nullptr;1997 | ^~~~~~~~~~~~~~~~~~~~~~~~~~~1998[239/1871] CXX obj/src/node_base.node_options.o1999In file included from ../../src/util.h:29,2000 from ../../src/node_mutex.h:6,26278ok 5022 parallel/test-webstreams-adapters-writable-buffer-sources26279 ---26280 duration_ms: 107.7080026281 ...26282ok 5023 parallel/test-webstreams-duplex-fromweb-writev-unhandled-rejection26283 ---26284 duration_ms: 86.6520026285 ...26286ok 5024 parallel/test-webstreams-compose26287 ---26288 duration_ms: 107.6910026289 ...26290ok 5025 parallel/test-webstreams-clone-unref26291 ---26292 duration_ms: 109.2200026293 ...26294ok 5026 parallel/test-webcrypto-sign-verify-rsa26295 ---26296 duration_ms: 262.5450026297 ...26298ok 5027 parallel/test-webstreams-decompression-reject-trailing26299 ---26300 duration_ms: 107.5520026301 ...26302ok 5028 parallel/test-webstream-structured-clone-no-leftovers26303 ---26304 duration_ms: 134.5540026305 ...26306ok 5029 parallel/test-webstreams-finished26307 ---26308 duration_ms: 86.7900026309 ...26310ok 5030 parallel/test-webstreams-compression-bad-chunks26311 ---26312 duration_ms: 134.1440026313 ...26314ok 5031 parallel/test-webcrypto-prototype-pollution26315 ---26316 duration_ms: 329.7250026317 ...26318ok 5032 parallel/test-whatwg-encoding-custom-api-basics26319 ---26320 duration_ms: 69.7410026321 ...26322ok 5033 parallel/test-webstreams-pipeto-write-request26323 ---26324 duration_ms: 87.1000026325 ...26326ok 5034 parallel/test-webstreams-queue-wraparound26327 ---26328 duration_ms: 107.6530026329 ...26330ok 5035 parallel/test-whatwg-encoding-custom-fatal-streaming26331 ---26332 duration_ms: 87.0340026333 ...26334ok 5036 parallel/test-whatwg-encoding-custom-internals26335 ---26336 duration_ms: 87.1550026337 ...26338ok 5037 parallel/test-whatwg-encoding-custom-interop26339 ---26340 duration_ms: 87.2890026341 ...26342ok 5038 parallel/test-whatwg-encoding-custom-textdecoder26343 ---26344 duration_ms: 86.6900026345 ...26346ok 5039 parallel/test-webstreams-pipeline26347 ---26348 duration_ms: 134.6060026349 ...26350ok 5040 parallel/test-whatwg-encoding-custom-textdecoder-api-invalid-label26351 ---26352 duration_ms: 87.0840026353 ...26354ok 5041 parallel/test-whatwg-encoding-custom-textdecoder-fatal26355 ---26356 duration_ms: 86.4770026357 ...26358ok 5042 parallel/test-whatwg-encoding-custom-textdecoder-invalid-arg26359 ---26360 duration_ms: 86.5910026361 ...26362ok 5043 parallel/test-whatwg-encoding-custom-textdecoder-streaming26363 ---26364 duration_ms: 86.6980026365 ...26366ok 5044 parallel/test-whatwg-encoding-custom-textdecoder-utf16-surrogates26367 ---26368 duration_ms: 86.3960026369 ...26370ok 5045 parallel/test-whatwg-encoding-custom-textdecoder-ignorebom26371 ---26372 duration_ms: 107.8140026373 ...26374ok 5046 parallel/test-whatwg-events-add-event-listener-options-passive26375 ---26376 duration_ms: 86.4540026377 ...26378ok 5047 parallel/test-whatwg-events-add-event-listener-options-signal26379 ---26380 duration_ms: 86.4280026381 ...26382ok 5048 parallel/test-whatwg-events-customevent26383 ---26384 duration_ms: 86.5850026385 ...26386ok 5049 parallel/test-whatwg-events-event-constructors26387 ---26388 duration_ms: 86.6670026389 ...26390ok 5050 parallel/test-webworker-ref-unref26391 ---26392 duration_ms: 167.6770026393 ...26394ok 5051 parallel/test-webcrypto-digest-turboshake-rfc26395 ---26396 duration_ms: 606.2100026397 ...26398ok 5052 parallel/test-whatwg-events-eventtarget-this-of-listener26399 ---26400 duration_ms: 86.3020026401 ...26402ok 5053 parallel/test-whatwg-readablestream26403 ---26404 duration_ms: 86.8620026405 ...26406ok 5054 parallel/test-whatwg-readablestream-byob-read-min26407 ---26408 duration_ms: 86.4850026409 ...26410ok 5055 parallel/test-whatwg-transformstream26411 ---26412 duration_ms: 86.3740026413 ...26414ok 5056 parallel/test-whatwg-headers26415 ---26416 duration_ms: 108.6700026417 ...26418ok 5057 parallel/test-whatwg-readablebytestream26419 ---26420 duration_ms: 108.5010026421 ...26422ok 5058 parallel/test-whatwg-readablebytestream-bad-buffers-and-views26423 ---26424 duration_ms: 107.7440026425 ...26426ok 5059 parallel/test-whatwg-readablebytestreambyob26427 ---26428 duration_ms: 107.8550026429 ...26430ok 5060 parallel/test-whatwg-readablestream26431 ---26432 duration_ms: 108.4100026433 ...26434ok 5061 parallel/test-whatwg-encoding-singlebyte26435 ---26436 duration_ms: 167.9540026437 ...26438ok 5062 parallel/test-whatwg-url-custom-global26439 ---26440 duration_ms: 86.4590026441 ...26442ok 5063 parallel/test-whatwg-url-custom-href-side-effect26443 ---26444 duration_ms: 86.4330026445 ...26446ok 5064 parallel/test-whatwg-transformstream-cancel-write-race26447 ---26448 duration_ms: 107.6600026449 ...26450ok 5065 parallel/test-whatwg-url-canparse26451 ---26452 duration_ms: 107.8260026453 ...26454ok 5066 parallel/test-whatwg-url-custom-inspect26455 ---26456 duration_ms: 87.3790026457 ...26458ok 5067 parallel/test-whatwg-url-custom-deepequal26459 ---26460 duration_ms: 108.1050026461 ...26462ok 5068 parallel/test-whatwg-url-custom-properties26463 ---26464 duration_ms: 86.6160026465 ...26466ok 5069 parallel/test-whatwg-url-custom-searchparams26467 ---26468 duration_ms: 86.2660026469 ...26470ok 5070 parallel/test-whatwg-url-custom-parsing26471 ---26472 duration_ms: 108.0200026473 ...26474ok 5071 parallel/test-whatwg-url-custom-searchparams-append26475 ---26476 duration_ms: 86.3610026477 ...26478ok 5072 parallel/test-whatwg-url-custom-searchparams-getall26479 ---26480 duration_ms: 69.8570026481 ...26482ok 5073 parallel/test-whatwg-url-custom-searchparams-constructor26483 ---26484 duration_ms: 86.8200026485 ...26486ok 5074 parallel/test-whatwg-url-custom-searchparams-delete26487 ---26488 duration_ms: 86.8520026489 ...26490ok 5075 parallel/test-whatwg-url-custom-searchparams-entries26491 ---26492 duration_ms: 86.5400026493 ...26494ok 5076 parallel/test-whatwg-url-custom-searchparams-foreach26495 ---26496 duration_ms: 87.1510026497 ...26498ok 5077 parallel/test-whatwg-url-custom-searchparams-has26499 ---26500 duration_ms: 86.4820026501 ...26502ok 5078 parallel/test-whatwg-url-custom-searchparams-keys26503 ---26504 duration_ms: 86.8150026505 ...26506ok 5079 parallel/test-whatwg-url-custom-searchparams-set26507 ---26508 duration_ms: 86.5590026509 ...26510ok 5080 parallel/test-whatwg-url-custom-searchparams-sort26511 ---26512 duration_ms: 86.5450026513 ...26514ok 5081 parallel/test-whatwg-url-custom-searchparams-stringifier26515 ---26516 duration_ms: 86.3470026517 ...26518ok 5082 parallel/test-whatwg-url-custom-searchparams-get26519 ---26520 duration_ms: 108.2680026521 ...26522ok 5083 parallel/test-whatwg-url-custom-searchparams-values26523 ---26524 duration_ms: 87.1900026525 ...26526ok 5084 parallel/test-whatwg-url-custom-searchparams-inspect26527 ---26528 duration_ms: 108.0220026529 ...26530ok 5085 parallel/test-whatwg-url-custom-tostringtag26531 ---26532 duration_ms: 86.5360026533 ...26534ok 5086 parallel/test-whatwg-url-invalidthis26535 ---26536 duration_ms: 86.6350026537 ...26538ok 5087 parallel/test-whatwg-url-override-hostname26539 ---26540 duration_ms: 86.3400026541 ...26542ok 5088 parallel/test-whatwg-url-custom-setters26543 ---26544 duration_ms: 108.3040026545 ...26546ok 5089 parallel/test-whatwg-url-parse-fast-path26547 ---26548 duration_ms: 87.0500026549 ...26550ok 5090 parallel/test-whatwg-url-properties26551 ---26552 duration_ms: 86.5600026553 ...26554ok 5091 parallel/test-whatwg-url-searchparams-fast-path26555 ---26556 duration_ms: 86.5390026557 ...26558ok 5092 parallel/test-whatwg-webstreams-adapters-streambase26559 ---26560 duration_ms: 86.3420026561 ...26562ok 5093 parallel/test-whatwg-webstreams-adapters-to-readablestream26563 ---26564 duration_ms: 86.6140026565 ...26566ok 5094 parallel/test-whatwg-webstreams-adapters-to-streamreadable26567 ---26568 duration_ms: 86.5340026569 ...26570ok 5095 parallel/test-whatwg-webstreams-coverage26571 ---26572 duration_ms: 69.7210026573 ...26574ok 5096 parallel/test-whatwg-webstreams-adapters-to-readablewritablepair26575 ---26576 duration_ms: 107.6670026577 ...26578ok 5097 parallel/test-whatwg-webstreams-adapters-to-streamduplex26579 ---26580 duration_ms: 108.1750026581 ...26582ok 5098 parallel/test-whatwg-webstreams-encoding26583 ---26584 duration_ms: 87.1010026585 ...26586ok 5099 parallel/test-v8-stop-coverage26587 ---26588 duration_ms: 2312.1050026589 ...26590ok 5100 parallel/test-webcrypto-wrap-unwrap26591 ---26592 duration_ms: 614.1930026593 ...26594ok 5101 parallel/test-whatwg-webstreams-transform-stream-members26595 ---26596 duration_ms: 86.6250026597 ...26598ok 5102 parallel/test-whatwg-writablestream26599 ---26600 duration_ms: 86.9630026601 ...26602ok 5103 parallel/test-whatwg-webstreams-adapters-to-streamwritable26603 ---26604 duration_ms: 108.4150026605 ...26606ok 5104 parallel/test-whatwg-webstreams-adapters-to-writablestream26607 ---26608 duration_ms: 108.1890026609 ...26610ok 5105 parallel/test-whatwg-webstreams-compression26611 ---26612 duration_ms: 108.2070026613 ...26614ok 5106 parallel/test-windows-abort-exitcode # skip test is windows specific26615 ---26616 duration_ms: 86.8920026617 ...26618ok 5107 parallel/test-windows-failed-heap-allocation # skip Windows-only26619 ---26620 duration_ms: 86.4510026621 ...26622ok 5108 parallel/test-whatwg-writablestream-close26623 ---26624 duration_ms: 107.6370026625 ...26626ok 5109 parallel/test-whatwg-webstreams-transfer26627 ---26628 duration_ms: 135.0730026629 ...26630ok 5110 parallel/test-worker26631 ---26632 duration_ms: 135.1370026633 ...26634ok 5111 parallel/test-worker26635 ---26636 duration_ms: 134.4740026637 ...26638ok 5112 parallel/test-worker-abort-on-uncaught-exception-terminate26639 ---26640 duration_ms: 134.5180026641 ...26642ok 5113 parallel/test-worker-cjs-workerdata26643 ---26644 duration_ms: 109.0680026645 ...26646ok 5114 parallel/test-worker-beforeexit-throw-exit26647 ---26648 duration_ms: 137.3880026649 ...26650ok 5115 parallel/test-worker-broadcastchannel-wpt26651 ---26652 duration_ms: 137.2100026653 ...26654ok 5116 parallel/test-worker-abort-on-uncaught-exception26655 ---26656 duration_ms: 168.6450026657 ...26658ok 5117 parallel/test-worker-broadcastchannel26659 ---26660 duration_ms: 170.4020026661 ...26662ok 5118 parallel/test-worker-cpu-usage26663 ---26664 duration_ms: 143.3320026665 ...26666ok 5119 parallel/test-worker-cleanexit-with-js26667 ---26668 duration_ms: 173.4160026669 ...26670ok 5120 parallel/test-worker-cleanup-handles26671 ---26672 duration_ms: 172.2860026673 ...26674ok 5121 parallel/test-worker-crypto-sign-transfer-result26675 ---26676 duration_ms: 171.0490026677 ...26678ok 5122 parallel/test-worker-dispose26679 ---26680 duration_ms: 140.9750026681 ...26682ok 5123 parallel/test-worker-cwd-race-condition26683 ---26684 duration_ms: 170.5320026685 ...26686ok 5124 parallel/test-worker-data-url26687 ---26688 duration_ms: 170.8630026689 ...26690ok 5125 parallel/test-worker-console-listeners26691 ---26692 duration_ms: 209.9060026693 ...26694ok 5126 parallel/test-worker-cpu-profile26695 ---26696 duration_ms: 213.8440026697 ...26698ok 5127 parallel/test-worker-dns-terminate-during-query26699 ---26700 duration_ms: 152.8720026701 ...26702ok 5128 parallel/test-worker-dns-terminate26703 ---26704 duration_ms: 154.9740026705 ...26706ok 5129 parallel/test-worker-esm-missing-main26707 ---26708 duration_ms: 112.3570026709 ...26710ok 5130 parallel/test-worker-esm-exit26711 ---26712 duration_ms: 114.5150026713 ...26714ok 5131 parallel/test-worker-error-primitive26715 ---26716 duration_ms: 148.1890026717 ...26718ok 5132 parallel/test-worker-error-stack-getter-throws26719 ---26720 duration_ms: 141.8650026721 ...26722ok 5133 parallel/test-worker-cli-options26723 ---26724 duration_ms: 265.1360026725 ...26726ok 5134 parallel/test-worker-event26727 ---26728 duration_ms: 108.1500026729 ...26730ok 5135 parallel/test-worker-esmodule26731 ---26732 duration_ms: 135.0660026733 ...26734ok 5136 parallel/test-worker-arraybuffer-zerofill26735 ---26736 duration_ms: 329.9010026737 ...26738ok 5137 parallel/test-worker-execargv-invalid26739 ---26740 duration_ms: 111.0440026741 ...26742ok 5138 parallel/test-worker-execargv26743 ---26744 duration_ms: 134.8300026745 ...26746ok 5139 parallel/test-worker-environmentdata26747 ---26748 duration_ms: 225.7630026749 ...26750ok 5140 parallel/test-worker-exit-event-error26751 ---26752 duration_ms: 134.3970026753 ...26754ok 5141 parallel/test-worker-exit-from-uncaught-exception26755 ---26756 duration_ms: 134.7670026757 ...26758ok 5142 parallel/test-worker-hasref26759 ---26760 duration_ms: 109.1590026761 ...26762ok 5143 parallel/test-worker-heap-profile26763 ---26764 duration_ms: 110.1910026765 ...26766ok 5144 parallel/test-worker-fs-stat-watcher26767 ---26768 duration_ms: 135.0520026769 ...26770ok 5145 parallel/test-worker-exit-code26771 ---26772 duration_ms: 172.2330026773 ...26774ok 5146 parallel/test-worker-debug26775 ---26776 duration_ms: 328.8020026777 ...26778ok 5147 parallel/test-worker-heap-statistics26779 ---26780 duration_ms: 135.3680026781 ...26782ok 5148 parallel/test-worker-heapdump-failure26783 ---26784 duration_ms: 135.3890026785 ...26786ok 5149 parallel/test-worker-invalid-workerdata26787 ---26788 duration_ms: 108.3990026789 ...26790ok 5150 parallel/test-worker-cleanexit-with-moduleload26791 ---26792 duration_ms: 408.7540026793 ...26794ok 5151 parallel/test-worker-http2-generic-streams-terminate26795 ---26796 duration_ms: 174.3290026797 ...26798ok 5152 parallel/test-worker-load-file-with-extension-other-than-js26799 ---26800 duration_ms: 172.0600026801 ...26802ok 5153 parallel/test-worker-message-event26803 ---26804 duration_ms: 140.9410026805 ...26806ok 5154 parallel/test-watch-mode-kill-signal-default26807 ---26808 duration_ms: 1512.3250026809 ...26810ok 5155 parallel/test-worker-message-port-close26811 ---26812 duration_ms: 120.3190026813 ...26814ok 5156 parallel/test-worker-message-not-serializable26815 ---26816 duration_ms: 140.0050026817 ...26818ok 5157 parallel/test-worker-message-mark-as-uncloneable26819 ---26820 duration_ms: 142.7780026821 ...26822ok 5158 parallel/test-worker-message-channel26823 ---26824 duration_ms: 170.4010026825 ...26826ok 5159 parallel/test-worker-internal-modules26827 ---26828 duration_ms: 211.9380026829 ...26830ok 5160 parallel/test-worker-message-channel-sharedarraybuffer26831 ---26832 duration_ms: 172.2430026833 ...26834ok 5161 parallel/test-worker-message-port-close-while-receiving26835 ---26836 duration_ms: 121.5880026837 ...26838ok 5162 parallel/test-watch-mode-kill-signal-override26839 ---26840 duration_ms: 1512.2840026841 ...26842ok 5163 parallel/test-worker-message-port-arraybuffer26843 ---26844 duration_ms: 143.8520026845 ...26846ok 5164 parallel/test-webstorage26847 ---26848 duration_ms: 1117.9100026849 ...26850ok 5165 parallel/test-worker-message-port-constructor26851 ---26852 duration_ms: 125.3470026853 ...26854ok 5166 parallel/test-worker-message-port-infinite-message-loop26855 ---26856 duration_ms: 116.2040026857 ...26858ok 5167 parallel/test-worker-message-port26859 ---26860 duration_ms: 180.3720026861 ...26862ok 5168 parallel/test-worker-message-port-inspect-during-init-hook26863 ---26864 duration_ms: 136.9740026865 ...26866ok 5169 parallel/test-worker-message-port-drain26867 ---26868 duration_ms: 190.6120026869 ...26870ok 5170 parallel/test-worker-message-port-multiple-sharedarraybuffers26871 ---26872 duration_ms: 109.9900026873 ...26874ok 5171 parallel/test-worker-message-port-message-port-transferring26875 ---26876 duration_ms: 117.7680026877 ...26878ok 5172 parallel/test-worker-message-port-jstransferable-nested-untransferable26879 ---26880 duration_ms: 128.3130026881 ...26882ok 5173 parallel/test-worker-message-port-transfer-closed26883 ---26884 duration_ms: 114.2420026885 ...26886ok 5174 parallel/test-worker-message-port-move26887 ---26888 duration_ms: 129.7870026889 ...26890ok 5175 parallel/test-worker-message-port-receive-message26891 ---26892 duration_ms: 136.5630026893 ...26894ok 5176 parallel/test-worker-message-port-transfer-fake-js-transferable26895 ---26896 duration_ms: 124.2010026897 ...26898ok 5177 parallel/test-worker-message-port-transfer-duplicate26899 ---26900 duration_ms: 127.4200026901 ...26902ok 5178 parallel/test-worker-message-port-transfer-fake-js-transferable-internal26903 ---26904 duration_ms: 127.9110026905 ...26906ok 5179 parallel/test-worker-message-port-transfer-native26907 ---26908 duration_ms: 131.2880026909 ...26910ok 5180 parallel/test-worker-heap-snapshot26911 ---26912 duration_ms: 408.7700026913 ...26914ok 5181 parallel/test-worker-message-port-transfer-self26915 ---26916 duration_ms: 133.4430026917 ...26918ok 5182 parallel/test-worker-message-port-transfer-target26919 ---26920 duration_ms: 127.8000026921 ...26922ok 5183 parallel/test-worker-message-port-transfer-filehandle26923 ---26924 duration_ms: 153.3010026925 ...26926ok 5184 parallel/test-worker-eval-typescript26927 ---26928 duration_ms: 510.4590026929 ...26930ok 5185 parallel/test-worker-message-port-transfer-terminate26931 ---26932 duration_ms: 135.3800026933 ...26934ok 5186 parallel/test-worker-message-transfer-port-mark-as-untransferable26935 ---26936 duration_ms: 111.6290026937 ...26938ok 5187 parallel/test-worker-message-port-wasm-module26939 ---26940 duration_ms: 156.3780026941 ...26942ok 5188 parallel/test-worker-message-port-wasm-threads26943 ---26944 duration_ms: 143.2570026945 ...26946ok 5189 parallel/test-worker-exit-heapsnapshot26947 ---26948 duration_ms: 525.2630026949 ...26950ok 5190 parallel/test-worker-messageport-hasref26951 ---26952 duration_ms: 438.1470026953 ...26954ok 5191 parallel/test-worker-http2-stream-terminate26955 ---26956 duration_ms: 769.0670026957 ...26958ok 5192 parallel/test-worker-messaging-errors-invalid26959 ---26960 duration_ms: 417.0450026961 ...26962ok 5193 parallel/test-worker-mjs-workerdata26963 ---26964 duration_ms: 413.0000026965 ...26966ok 5194 parallel/test-worker-messaging-errors-handler26967 ---26968 duration_ms: 426.3780026969 ...26970ok 5195 parallel/test-worker-memory26971 ---26972 duration_ms: 730.8540026973 ...26974ok 5196 parallel/test-webcrypto-sign-verify26975 ---26976 duration_ms: 1706.5320026977 ...26978ok 5197 parallel/test-worker-onmessage26979 ---26980 duration_ms: 302.9310026981 ...26982ok 5198 parallel/test-worker-on-process-exit26983 ---26984 duration_ms: 314.9180026985 ...26986ok 5199 parallel/test-worker-non-fatal-uncaught-exception26987 ---26988 duration_ms: 339.8220026989 ...26990ok 5200 parallel/test-worker-no-stdin-stdout-interaction26991 ---26992 duration_ms: 386.2030026993 ...26994ok 5201 parallel/test-worker-node-options26995 ---26996 duration_ms: 381.2510026997 ...26998ok 5202 parallel/test-worker-nexttick-terminate26999 ---27000 duration_ms: 406.0690027001 ...27002ok 5203 parallel/test-worker-no-sab27003 ---27004 duration_ms: 400.5800027005 ...27006ok 5204 parallel/test-worker-nested-uncaught27007 ---27008 duration_ms: 412.8920027009 ...27010ok 5205 parallel/test-worker-name27011 ---27012 duration_ms: 431.8890027013 ...27014ok 5206 parallel/test-worker-nested-on-process-exit27015 ---27016 duration_ms: 415.0350027017 ...27018ok 5207 parallel/test-worker-nearheaplimit-deadlock27019 ---27020 duration_ms: 418.9260027021 ...27022ok 5208 parallel/test-worker-messaging27023 ---27024 duration_ms: 458.8120027025 ...27026ok 5209 parallel/test-worker-message-type-unknown27027 ---27028 duration_ms: 481.4530027029 ...27030ok 5210 parallel/test-worker-message-port-terminate-transfer-list27031 ---27032 duration_ms: 610.3500027033 ...27034ok 5211 parallel/test-worker-message-port-message-before-close27035 ---27036 duration_ms: 632.5240027037 ...27038ok 5212 parallel/test-worker-init-failure27039 ---27040 duration_ms: 857.2950027041 ...27042ok 5213 parallel/test-worker-ref-onexit27043 ---27044 duration_ms: 108.5720027045 ...27046ok 5214 parallel/test-worker-ref27047 ---27048 duration_ms: 108.3470027049 ...27050ok 5215 parallel/test-worker-process-exit-async-module27051 ---27052 duration_ms: 110.8280027053 ...27054ok 5216 parallel/test-worker-process-env-shared27055 ---27056 duration_ms: 111.5440027057 ...27058ok 5217 parallel/test-worker-parent-port-ref27059 ---27060 duration_ms: 136.2250027061 ...27062ok 5218 parallel/test-worker-onmessage-not-a-function27063 ---27064 duration_ms: 138.1250027065 ...27066ok 5219 parallel/test-worker-process-argv27067 ---27068 duration_ms: 136.7420027069 ...27070ok 5220 parallel/test-worker-relative-path27071 ---27072 duration_ms: 135.6130027073 ...27074ok 5221 parallel/test-worker-relative-path-double-dot27075 ---27076 duration_ms: 136.8600027077 ...27078ok 5222 parallel/test-worker-safe-getters27079 ---27080 duration_ms: 135.6350027081 ...27082ok 5223 parallel/test-worker-sharedarraybuffer-from-worker-thread27083 ---27084 duration_ms: 135.1020027085 ...27086ok 5224 parallel/test-worker-stdio-flush27087 ---27088 duration_ms: 136.6870027089 ...27090ok 5225 parallel/test-worker-stdio-flush-inflight27091 ---27092 duration_ms: 136.8440027093 ...27094ok 5226 parallel/test-worker-process-cwd27095 ---27096 duration_ms: 169.1900027097 ...27098ok 5227 parallel/test-worker-stdio-from-preload-module27099 ---27100 duration_ms: 135.8090027101 ...27102ok 5228 parallel/test-worker-spec-differences27103 ---27104 duration_ms: 168.6440027105 ...27106ok 5229 parallel/test-worker-stack-overflow27107 ---27108 duration_ms: 168.5560027109 ...27110ok 5230 parallel/test-worker-stdio27111 ---27112 duration_ms: 170.8360027113 ...27114ok 5231 parallel/test-worker-syntax-error-file27115 ---27116 duration_ms: 137.6720027117 ...27118ok 5232 parallel/test-worker-process-env27119 ---27120 duration_ms: 210.3950027121 ...27122ok 5233 parallel/test-worker-terminate-microtask-loop27123 ---27124 duration_ms: 109.8790027125 ...27126ok 5234 parallel/test-worker-terminate-ref-public-port27127 ---27128 duration_ms: 110.9280027129 ...27130ok 5235 parallel/test-worker-terminate-null-handler27131 ---27132 duration_ms: 114.1620027133 ...27134ok 5236 parallel/test-worker-syntax-error27135 ---27136 duration_ms: 168.5680027137 ...27138ok 5237 parallel/test-worker-type-check27139 ---27140 duration_ms: 86.6480027141 ...27142ok 5238 parallel/test-worker-thread-name27143 ---27144 duration_ms: 107.8980027145 ...27146ok 5239 parallel/test-worker-terminate-nested27147 ---27148 duration_ms: 137.8980027149 ...27150ok 5240 parallel/test-worker-unsupported-eval-on-url27151 ---27152 duration_ms: 86.8570027153 ...27154ok 5241 parallel/test-worker-unsupported-path27155 ---27156 duration_ms: 86.9460027157 ...27158ok 5242 parallel/test-worker-terminate-http2-respond-with-file27159 ---27160 duration_ms: 168.3550027161 ...27162ok 5243 parallel/test-worker-messaging-errors-timeout27163 ---27164 duration_ms: 685.4010027165 ...27166ok 5244 parallel/test-worker-terminate-source-map27167 ---27168 duration_ms: 134.9850027169 ...27170ok 5245 parallel/test-worker-terminate-timers27171 ---27172 duration_ms: 135.5180027173 ...27174ok 5246 parallel/test-worker-terminate-unrefed27175 ---27176 duration_ms: 134.8500027177 ...27178ok 5247 parallel/test-worker-resource-limits27179 ---27180 duration_ms: 263.2290027181 ...27182ok 5248 parallel/test-worker-stack-overflow-stack-size27183 ---27184 duration_ms: 262.0180027185 ...27186ok 5249 parallel/test-worker-uncaught-exception27187 ---27188 duration_ms: 134.1830027189 ...27190ok 5250 parallel/test-trace-events-http27191 ---27192 duration_ms: 4297.4100027193 ...27194ok 5251 parallel/test-worker-uncaught-exception-async27195 ---27196 duration_ms: 135.0600027197 ...27198ok 5252 parallel/test-worker-track-unmanaged-fds27199 ---27200 duration_ms: 168.0290027201 ...27202ok 5253 parallel/test-worker-workerdata-messageport27203 ---27204 duration_ms: 107.8310027205 ...27206ok 5254 parallel/test-worker-unsupported-things27207 ---27208 duration_ms: 135.0990027209 ...27210ok 5255 parallel/test-wrap-js-stream-read-stop27211 ---27212 duration_ms: 86.5930027213 ...27214ok 5256 parallel/test-worker-voluntarily-exit-followed-by-addition27215 ---27216 duration_ms: 134.3600027217 ...27218ok 5257 parallel/test-wrap-js-stream-destroy27219 ---27220 duration_ms: 108.0180027221 ...27222ok 5258 parallel/test-wrap-js-stream-duplex27223 ---27224 duration_ms: 108.0480027225 ...27226ok 5259 parallel/test-worker-voluntarily-exit-followed-by-throw27227 ---27228 duration_ms: 134.8960027229 ...27230ok 5260 parallel/test-wrap-js-stream-exceptions27231 ---27232 duration_ms: 107.7350027233 ...27234ok 5261 parallel/test-worker-workerdata-sharedarraybuffer27235 ---27236 duration_ms: 134.4360027237 ...27238ok 5262 parallel/test-zlib-brotli-flush27239 ---27240 duration_ms: 87.4720027241 ...27242ok 5263 parallel/test-zlib-brotli-flush-invalid-kind27243 ---27244 duration_ms: 87.1070027245 ...27246ok 5264 parallel/test-zlib-brotli-from-string27247 ---27248 duration_ms: 86.6920027249 ...27250ok 5265 parallel/test-zlib-brotli-from-brotli27251 ---27252 duration_ms: 88.8000027253 ...27254ok 5266 parallel/test-zlib-brotli-kmaxlength-rangeerror27255 ---27256 duration_ms: 87.1710027257 ...27258ok 5267 parallel/test-zlib-close-after-error27259 ---27260 duration_ms: 86.7210027261 ...27262ok 5268 parallel/test-zlib-brotli-dictionary27263 ---27264 duration_ms: 108.0210027265 ...27266ok 5269 parallel/test-zlib-brotli27267 ---27268 duration_ms: 134.2280027269 ...27270ok 5270 parallel/test-zlib-close-after-write27271 ---27272 duration_ms: 108.2580027273 ...27274ok 5271 parallel/test-worker-vm-context-terminate27275 ---27276 duration_ms: 209.1950027277 ...27278ok 5272 parallel/test-zlib-const27279 ---27280 duration_ms: 107.6440027281 ...27282ok 5273 parallel/test-zlib-create-raw27283 ---27284 duration_ms: 87.2550027285 ...27286ok 5274 parallel/test-zlib-deflate-constructors27287 ---27288 duration_ms: 87.0810027289 ...27290ok 5275 parallel/test-zlib-deflate-raw-inherits27291 ---27292 duration_ms: 87.0970027293 ...27294ok 5276 parallel/test-zlib-dictionary-fail27295 ---27296 duration_ms: 86.4930027297 ...27298ok 5277 parallel/test-zlib-crc3227299 ---27300 duration_ms: 108.5950027301 ...27302ok 5278 parallel/test-worker-unref-from-message-during-exit27303 ---27304 duration_ms: 261.4420027305 ...27306ok 5279 parallel/test-zlib-destroy27307 ---27308 duration_ms: 108.4390027309 ...27310ok 5280 parallel/test-zlib-empty-buffer27311 ---27312 duration_ms: 87.0240027313 ...27314ok 5281 parallel/test-zlib-failed-init27315 ---27316 duration_ms: 86.8560027317 ...27318ok 5282 parallel/test-zlib-dictionary27319 ---27320 duration_ms: 108.6720027321 ...27322ok 5283 parallel/test-zlib-flush-drain27323 ---27324 duration_ms: 87.5630027325 ...27326ok 5284 parallel/test-zlib-flush-drain-longblock27327 ---27328 duration_ms: 87.0510027329 ...27330ok 5285 parallel/test-zlib-flush-write-sync-interleaved27331 ---27332 duration_ms: 87.0730027333 ...27334ok 5286 parallel/test-zlib-flush27335 ---27336 duration_ms: 108.2610027337 ...27338ok 5287 parallel/test-zlib-flush-flags27339 ---27340 duration_ms: 108.2440027341 ...27342ok 5288 parallel/test-zlib-from-concatenated-gzip27343 ---27344 duration_ms: 107.6380027345 ...27346ok 5289 parallel/test-zlib-from-gzip-with-trailing-garbage27347 ---27348 duration_ms: 86.8250027349 ...27350ok 5290 parallel/test-zlib-no-stream27351 ---27352 duration_ms: 56.1470027353 ...27354ok 5291 parallel/test-zlib-from-string27355 ---27356 duration_ms: 87.4310027357 ...27358ok 5292 parallel/test-zlib-invalid-arg-value-brotli-compress27359 ---27360 duration_ms: 86.9990027361 ...27362ok 5293 parallel/test-zlib-from-gzip27363 ---27364 duration_ms: 108.5730027365 ...27366ok 5294 parallel/test-zlib-destroy-pipe27367 ---27368 duration_ms: 168.6160027369 ...27370ok 5295 parallel/test-zlib-close-in-ondata27371 ---27372 duration_ms: 209.2590027373 ...27374ok 5296 parallel/test-zlib-maxOutputLength27375 ---27376 duration_ms: 87.2210027377 ...27378ok 5297 parallel/test-zlib-invalid-input27379 ---27380 duration_ms: 108.1630027381 ...27382ok 5298 parallel/test-zlib-convenience-methods27383 ---27384 duration_ms: 209.6100027385 ...27386ok 5299 parallel/test-zlib-invalid-input-memory27387 ---27388 duration_ms: 110.3220027389 ...27390ok 5300 parallel/test-zlib-kmaxlength-rangeerror27391 ---27392 duration_ms: 108.4390027393 ...27394ok 5301 parallel/test-zlib-object-write27395 ---27396 duration_ms: 88.0950027397 ...27398ok 5302 parallel/test-zlib-params27399 ---27400 duration_ms: 87.3500027401 ...27402ok 5303 parallel/test-zlib-premature-end27403 ---27404 duration_ms: 87.4540027405 ...27406ok 5304 parallel/test-zlib-negative-zero27407 ---27408 duration_ms: 108.0080027409 ...27410ok 5305 parallel/test-zlib-reset-before-write27411 ---27412 duration_ms: 86.8480027413 ...27414ok 5306 parallel/test-zlib-not-string-or-buffer27415 ---27416 duration_ms: 108.3970027417 ...27418ok 5307 parallel/test-zlib-reset-during-write27419 ---27420 duration_ms: 86.8800027421 ...27422ok 5308 parallel/test-zlib-random-byte-pipes27423 ---27424 duration_ms: 108.2760027425 ...27426ok 5309 parallel/test-zlib-unzip-one-byte-chunks27427 ---27428 duration_ms: 86.8810027429 ...27430ok 5310 parallel/test-zlib-sync-no-event27431 ---27432 duration_ms: 107.8820027433 ...27434ok 5311 parallel/test-zlib-reject-garbage-after-end27435 ---27436 duration_ms: 134.9080027437 ...27438ok 5312 parallel/test-zlib-write-after-flush27439 ---27440 duration_ms: 86.6750027441 ...27442ok 5313 parallel/test-zlib-truncated27443 ---27444 duration_ms: 109.1260027445 ...27446ok 5314 parallel/test-zlib-write-after-close27447 ---27448 duration_ms: 108.1520027449 ...27450ok 5315 parallel/test-zlib-write-after-end27451 ---27452 duration_ms: 108.0770027453 ...27454ok 5316 parallel/test-zlib-zero-byte27455 ---27456 duration_ms: 108.0050027457 ...27458ok 5317 parallel/test-zlib-type-error27459 ---27460 duration_ms: 134.7870027461 ...27462ok 5318 parallel/test-zlib-unused-weak27463 ---27464 duration_ms: 134.4740027465 ...27466ok 5319 parallel/test-zlib-zero-windowBits27467 ---27468 duration_ms: 108.0690027469 ...27470ok 5320 parallel/test-zlib-zip27471 ---27472 duration_ms: 135.2470027473 ...27474ok 5321 parallel/test-zlib-zip-edgecases27475 ---27476 duration_ms: 134.3220027477 ...27478ok 5322 parallel/test-zlib27479 ---27480 duration_ms: 407.0340027481 ...27482ok 5323 parallel/test-zlib-zip-internals27483 ---27484 duration_ms: 109.6810027485 ...27486ok 5324 parallel/test-zlib-zip-encoding27487 ---27488 duration_ms: 134.6200027489 ...27490ok 5325 parallel/test-zlib-zip-metadata27491 ---27492 duration_ms: 135.8140027493 ...27494ok 5326 parallel/test-zlib-zip-file-lifecycle27495 ---27496 duration_ms: 168.2850027497 ...27498ok 5327 parallel/test-zlib-zstd27499 ---27500 duration_ms: 108.7640027501 ...27502ok 5328 parallel/test-zlib-zip-sync27503 ---27504 duration_ms: 134.8200027505 ...27506ok 5329 parallel/test-zlib-zstd-dictionary27507 ---27508 duration_ms: 108.6860027509 ...27510ok 5330 parallel/test-zlib-zstd-flush27511 ---27512 duration_ms: 108.9710027513 ...27514ok 5331 parallel/test-zlib-zstd-from-string27515 ---27516 duration_ms: 108.3920027517 ...27518ok 5332 parallel/test-zlib-zip-files27519 ---27520 duration_ms: 209.9480027521 ...27522ok 5333 parallel/test-x509-escaping27523 ---27524 duration_ms: 507.2210027525 ...27526ok 5334 parallel/test-zlib-zip-hardening27527 ---27528 duration_ms: 209.3760027529 ...27530ok 5335 parallel/test-zlib-zip-vfs27531 ---27532 duration_ms: 168.2670027533 ...27534ok 5336 parallel/test-zlib-zip-interop27535 ---27536 duration_ms: 209.2780027537 ...27538ok 5337 parallel/test-zlib-zstd-from-zstd27539 ---27540 duration_ms: 109.6230027541 ...27542ok 5338 parallel/test-zlib-zstd-kmaxlength-rangeerror27543 ---27544 duration_ms: 110.1790027545 ...27546ok 5339 parallel/test-zlib-zip-property27547 ---27548 duration_ms: 210.0020027549 ...27550ok 5340 parallel/test-zlib-zstd-pledged-src-size27551 ---27552 duration_ms: 136.3350027553 ...27554ok 5341 parallel/test-zlib-zip-writable27555 ---27556 duration_ms: 210.0350027557 ...27558ok 5342 parallel/test-zlib-zip-security-hardening27559 ---27560 duration_ms: 261.6600027561 ...27562ok 5343 module-hooks/test-async-loader-hooks-called-with-expected-args27563 ---27564 duration_ms: 210.7610027565 ...27566ok 5344 module-hooks/test-async-loader-hooks-called-with-register27567 ---27568 duration_ms: 210.2950027569 ...27570ok 5345 module-hooks/test-async-loader-hooks-globalpreload-no-warning-with-initialize27571 ---27572 duration_ms: 210.2380027573 ...27574ok 5346 module-hooks/test-async-loader-hooks-initialize-in-sequence27575 ---27576 duration_ms: 210.0760027577 ...27578ok 5347 module-hooks/test-async-loader-hooks-initialize-never-settling27579 ---27580 duration_ms: 211.8860027581 ...27582ok 5348 module-hooks/test-async-loader-hooks-initialize-process-exit27583 ---27584 duration_ms: 211.0500027585 ...27586ok 5349 module-hooks/test-async-loader-hooks-initialize-rejecting27587 ---27588 duration_ms: 211.3440027589 ...27590ok 5350 module-hooks/test-async-loader-hooks-initialize-invoke27591 ---27592 duration_ms: 215.5010027593 ...27594ok 5351 parallel/test-zlib-zip-fuzz27595 ---27596 duration_ms: 406.8610027597 ...27598ok 5352 module-hooks/test-async-loader-hooks-globalpreload-warning27599 ---27600 duration_ms: 261.0520027601 ...27602ok 5353 module-hooks/test-async-loader-hooks-mixed-opt-in27603 ---27604 duration_ms: 209.9860027605 ...27606ok 5354 module-hooks/test-async-loader-hooks-never-settling-import-meta-resolve27607 ---27608 duration_ms: 209.7160027609 ...27610ok 5355 module-hooks/test-async-loader-hooks-never-settling-load-cjs27611 ---27612 duration_ms: 209.3330027613 ...27614ok 5356 module-hooks/test-async-loader-hooks-never-settling-load-esm-no-warning27615 ---27616 duration_ms: 209.6150027617 ...27618ok 5357 module-hooks/test-async-loader-hooks-never-settling-load-esm-with-warning27619 ---27620 duration_ms: 210.4450027621 ...27622ok 5358 module-hooks/test-async-loader-hooks-never-settling-race-cjs27623 ---27624 duration_ms: 208.7900027625 ...27626ok 5359 module-hooks/test-async-loader-hooks-never-settling-race-esm27627 ---27628 duration_ms: 210.1860027629 ...27630ok 5360 parallel/test-v8-take-coverage27631 ---27632 duration_ms: 4336.0000027633 ...27634ok 5361 parallel/test-v8-take-coverage-noop27635 ---27636 duration_ms: 4328.0460027637 ...27638ok 5362 module-hooks/test-async-loader-hooks-initialize-throw-null27639 ---27640 duration_ms: 261.4870027641 ...27642ok 5363 module-hooks/test-async-loader-hooks-never-settling-resolve-cjs27643 ---27644 duration_ms: 214.3540027645 ...27646ok 5364 module-hooks/test-async-loader-hooks-never-settling-resolve-esm-no-warning27647 ---27648 duration_ms: 210.2980027649 ...27650ok 5365 parallel/test-zlib-zip-experimental-warning27651 ---27652 duration_ms: 506.8960027653 ...27654ok 5366 module-hooks/test-async-loader-hooks-never-settling-resolve-esm-with-warning27655 ---27656 duration_ms: 210.4320027657 ...27658ok 5367 parallel/test-zlib-brotli-16GB27659 ---27660 duration_ms: 806.8680027661 ...27662ok 5368 module-hooks/test-async-loader-hooks-no-leak-internals27663 ---27664 duration_ms: 209.5880027665 ...27666ok 5369 module-hooks/test-async-loader-hooks-process-exit-async27667 ---27668 duration_ms: 209.2280027669 ...27670ok 5370 module-hooks/test-async-loader-hooks-register-with-import27671 ---27672 duration_ms: 168.5680027673 ...27674ok 5371 module-hooks/test-async-loader-hooks-process-exit-sync27675 ---27676 duration_ms: 209.0650027677 ...27678ok 5372 parallel/test-zlib-zip-coverage27679 ---27680 duration_ms: 608.7580027681 ...27682ok 5373 module-hooks/test-async-loader-hooks-source-maps-cjs27683 ---27684 duration_ms: 167.9790027685 ...27686ok 5374 module-hooks/test-async-loader-hooks-process-exit-top-level27687 ---27688 duration_ms: 210.4020027689 ...27690ok 5375 module-hooks/test-async-loader-hooks-register-with-cjs27691 ---27692 duration_ms: 210.1160027693 ...27694ok 5376 module-hooks/test-async-loader-hooks-register-with-ports27695 ---27696 duration_ms: 210.3480027697 ...27698ok 5377 module-hooks/test-async-loader-hooks-register-with-require27699 ---27700 duration_ms: 209.6590027701 ...27702ok 5378 module-hooks/test-async-loader-hooks-register-with-url-parenturl27703 ---27704 duration_ms: 210.7650027705 ...27706ok 5379 module-hooks/test-async-loader-hooks-throw-number27707 ---27708 duration_ms: 167.6750027709 ...27710ok 5380 module-hooks/test-async-loader-hooks-require-resolve-opt-in27711 ---27712 duration_ms: 209.1200027713 ...27714ok 5381 module-hooks/test-async-loader-hooks-throw-bigint27715 ---27716 duration_ms: 209.6630027717 ...27718ok 5382 module-hooks/test-async-loader-hooks-throw-boolean27719 ---27720 duration_ms: 209.0180027721 ...27722ok 5383 module-hooks/test-async-loader-hooks-throw-empty-object27723 ---27724 duration_ms: 209.1700027725 ...27726ok 5384 parallel/test-zlib-zip-security27727 ---27728 duration_ms: 607.0180027729 ...27730ok 5385 module-hooks/test-async-loader-hooks-throw-function27731 ---27732 duration_ms: 209.8490027733 ...27734ok 5386 module-hooks/test-async-loader-hooks-throw-null27735 ---27736 duration_ms: 209.2920027737 ...27738ok 5387 module-hooks/test-async-loader-hooks-throw-error27739 ---27740 duration_ms: 213.4290027741 ...27742ok 5388 module-hooks/test-module-hooks-create-require-with-url27743 ---27744 duration_ms: 88.2420027745 ...27746ok 5389 module-hooks/test-module-hooks-builtin-require27747 ---27748 duration_ms: 108.4800027749 ...27750ok 5390 module-hooks/test-async-loader-hooks-throw-object27751 ---27752 duration_ms: 211.6380027753 ...27754ok 5391 module-hooks/test-async-loader-hooks-throw-undefined27755 ---27756 duration_ms: 167.4340027757 ...27758ok 5392 module-hooks/test-async-loader-hooks-require-resolve-default27759 ---27760 duration_ms: 262.2500027761 ...27762ok 5393 module-hooks/test-module-hooks-custom-conditions-cjs27763 ---27764 duration_ms: 86.8600027765 ...27766ok 5394 module-hooks/test-async-loader-hooks-throw-string27767 ---27768 duration_ms: 209.8870027769 ...27770ok 5395 module-hooks/test-module-hooks-custom-conditions-special-values27771 ---27772 duration_ms: 86.8960027773 ...27774ok 5396 module-hooks/test-module-hooks-dispose27775 ---27776 duration_ms: 87.2510027777 ...27778ok 5397 module-hooks/test-module-hooks-import-wasm27779 ---27780 duration_ms: 87.6670027781 ...27782ok 5398 module-hooks/test-module-hooks-custom-conditions27783 ---27784 duration_ms: 107.8440027785 ...27786ok 5399 module-hooks/test-async-loader-hooks-throw-symbol27787 ---27788 duration_ms: 209.0570027789 ...27790ok 5400 module-hooks/test-async-loader-hooks-with-worker-permission-restricted27791 ---27792 duration_ms: 168.0790027793 ...27794ok 5401 module-hooks/test-module-hooks-load-buffers27795 ---27796 duration_ms: 86.7710027797 ...27798ok 5402 module-hooks/test-module-hooks-load-builtin-override-json27799 ---27800 duration_ms: 86.7790027801 ...27802ok 5403 module-hooks/test-async-loader-hooks-without-worker-permission27803 ---27804 duration_ms: 168.0880027805 ...27806ok 5404 module-hooks/test-async-loader-hooks-use-hooks-require-esm27807 ---27808 duration_ms: 209.3540027809 ...27810ok 5405 module-hooks/test-module-hooks-load-builtin-import27811 ---27812 duration_ms: 107.9680027813 ...27814ok 5406 module-hooks/test-async-loader-hooks-remove-beforeexit-listener27815 ---27816 duration_ms: 326.2320027817 ...27818ok 5407 module-hooks/test-async-loader-hooks-with-worker-permission-allowed27819 ---27820 duration_ms: 209.4670027821 ...27822ok 5408 module-hooks/test-module-hooks-load-builtin-override-commonjs27823 ---27824 duration_ms: 108.1990027825 ...27826ok 5409 module-hooks/test-module-hooks-load-builtin-override-module27827 ---27828 duration_ms: 107.8440027829 ...27830ok 5410 module-hooks/test-module-hooks-load-context-merged27831 ---27832 duration_ms: 86.9700027833 ...27834ok 5411 module-hooks/test-module-hooks-load-builtin-require27835 ---27836 duration_ms: 108.1720027837 ...27838ok 5412 module-hooks/test-module-hooks-load-context-merged-esm27839 ---27840 duration_ms: 87.1600027841 ...27842ok 5413 module-hooks/test-module-hooks-load-context-optional-esm27843 ---27844 duration_ms: 87.2090027845 ...27846ok 5414 module-hooks/test-module-hooks-load-detection27847 ---27848 duration_ms: 86.8720027849 ...27850ok 5415 module-hooks/test-module-hooks-load-esm27851 ---27852 duration_ms: 86.7190027853 ...27854ok 5416 module-hooks/test-module-hooks-load-esm-mock27855 ---27856 duration_ms: 86.8370027857 ...27858ok 5417 module-hooks/test-module-hooks-load-chained27859 ---27860 duration_ms: 108.5110027861 ...27862ok 5418 module-hooks/test-module-hooks-load-import-cjs27863 ---27864 duration_ms: 86.7090027865 ...27866ok 5419 module-hooks/test-module-hooks-load-context-optional27867 ---27868 duration_ms: 108.3560027869 ...27870ok 5420 module-hooks/test-module-hooks-load-short-circuit-required-middle27871 ---27872 duration_ms: 86.5330027873 ...27874ok 5421 module-hooks/test-module-hooks-load-short-circuit-required-start27875 ---27876 duration_ms: 87.1710027877 ...27878ok 5422 module-hooks/test-module-hooks-load-url-change-import27879 ---27880 duration_ms: 87.2510027881 ...27882ok 5423 module-hooks/test-module-hooks-load-import-cjs-custom-source27883 ---27884 duration_ms: 107.6740027885 ...27886ok 5424 module-hooks/test-module-hooks-load-invalid27887 ---27888 duration_ms: 108.3940027889 ...27890ok 5425 module-hooks/test-module-hooks-load-url-change-require27891 ---27892 duration_ms: 86.6890027893 ...27894ok 5426 module-hooks/test-module-hooks-load-mock27895 ---27896 duration_ms: 108.1120027897 ...27898ok 5427 module-hooks/test-module-hooks-load-short-circuit27899 ---27900 duration_ms: 108.2130027901 ...27902ok 5428 module-hooks/test-module-hooks-require-wasm27903 ---27904 duration_ms: 88.1620027905 ...27906ok 5429 module-hooks/test-module-hooks-resolve-context-merged27907 ---27908 duration_ms: 87.4350027909 ...27910ok 5430 module-hooks/test-module-hooks-resolve-context-optional27911 ---27912 duration_ms: 87.2450027913 ...27914ok 5431 module-hooks/test-module-hooks-resolve-builtin-builtin-import27915 ---27916 duration_ms: 108.4150027917 ...27918ok 5432 module-hooks/test-module-hooks-resolve-context-optional-esm27919 ---27920 duration_ms: 87.3510027921 ...27922ok 5433 module-hooks/test-module-hooks-resolve-builtin-builtin-require27923 ---27924 duration_ms: 108.3820027925 ...27926ok 5434 module-hooks/test-module-hooks-resolve-builtin-on-disk-import27927 ---27928 duration_ms: 108.4330027929 ...27930ok 5435 module-hooks/test-module-hooks-resolve-builtin-on-disk-require27931 ---27932 duration_ms: 108.4740027933 ...27934ok 5436 module-hooks/test-module-hooks-resolve-load-builtin-override-both27935 ---27936 duration_ms: 87.7860027937 ...27938ok 5437 module-hooks/test-module-hooks-resolve-builtin-on-disk-require-with-prefix27939 ---27940 duration_ms: 108.3000027941 ...27942ok 5438 module-hooks/test-module-hooks-resolve-load-builtin-override-both-prefix27943 ---27944 duration_ms: 87.9710027945 ...27946ok 5439 module-hooks/test-module-hooks-resolve-context-merged-esm27947 ---27948 duration_ms: 108.4520027949 ...27950ok 5440 module-hooks/test-module-hooks-resolve-import-cjs27951 ---27952 duration_ms: 107.7160027953 ...27954ok 5441 module-hooks/test-module-hooks-resolve-invalid27955 ---27956 duration_ms: 107.8500027957 ...27958ok 5442 module-hooks/test-module-hooks-resolve-load-builtin-redirect27959 ---27960 duration_ms: 107.9180027961 ...27962ok 5443 module-hooks/test-module-hooks-resolve-require-resolve-consistency27963 ---27964 duration_ms: 89.1220027965 ...27966ok 5444 module-hooks/test-module-hooks-resolve-load-builtin-redirect-prefix27967 ---27968 duration_ms: 109.9240027969 ...27970ok 5445 module-hooks/test-module-hooks-resolve-require-resolve-create-require27971 ---27972 duration_ms: 89.6830027973 ...27974ok 5446 module-hooks/test-module-hooks-resolve-require-resolve-builtin27975 ---27976 duration_ms: 109.3850027977 ...27978ok 5447 module-hooks/test-module-hooks-resolve-require-resolve-fallthrough27979 ---27980 duration_ms: 108.4170027981 ...27982ok 5448 module-hooks/test-module-hooks-resolve-require-resolve-imported-cjs27983 ---27984 duration_ms: 108.6520027985 ...27986ok 5449 module-hooks/test-module-hooks-resolve-require-resolve-paths27987 ---27988 duration_ms: 108.1080027989 ...27990ok 5450 sea/test-build-sea-custom-argv0 # skip Running the resultant binary fails with `/home/iojs/node-tmp/.tmp.2379/sea: error while loading shared libraries: libicui18n.so.71: cannot open shared object file: No such file or directory`.27991 ---27992 duration_ms: 89.5900027993 ...27994ok 5451 module-hooks/test-module-hooks-resolve-require-resolve-redirect27995 ---27996 duration_ms: 108.1230027997 ...27998ok 5452 module-hooks/test-module-hooks-resolve-short-circuit27999 ---28000 duration_ms: 108.8830028001 ...28002ok 5453 module-hooks/test-module-hooks-resolve-short-circuit-required-middle28003 ---28004 duration_ms: 108.5760028005 ...28006ok 5454 module-hooks/test-module-hooks-resolve-short-circuit-required-start28007 ---28008 duration_ms: 108.2330028009 ...28010ok 5455 sea/test-build-sea-invalid-assets # skip Running the resultant binary fails with `/home/iojs/node-tmp/.tmp.2379/sea: error while loading shared libraries: libicui18n.so.71: cannot open shared object file: No such file or directory`.28011 ---28012 duration_ms: 89.9280028013 ...28014ok 5456 sea/test-build-sea-already-exists # skip Running the resultant binary fails with `/home/iojs/node-tmp/.tmp.2379/sea: error while loading shared libraries: libicui18n.so.71: cannot open shared object file: No such file or directory`.28015 ---28016 duration_ms: 108.4630028017 ...28018ok 5457 sea/test-build-sea-config-not-found # skip Running the resultant binary fails with `/home/iojs/node-tmp/.tmp.2379/sea: error while loading shared libraries: libicui18n.so.71: cannot open shared object file: No such file or directory`.28019 ---28020 duration_ms: 108.2090028021 ...28022ok 5458 sea/test-build-sea # skip Running the resultant binary fails with `/home/iojs/node-tmp/.tmp.2379/sea: error while loading shared libraries: libicui18n.so.71: cannot open shared object file: No such file or directory`.28023 ---28024 duration_ms: 111.2440028025 ...28026ok 5459 sea/test-build-sea-elf-segments # skip Running the resultant binary fails with `/home/iojs/node-tmp/.tmp.2379/sea: error while loading shared libraries: libicui18n.so.71: cannot open shared object file: No such file or directory`.28027 ---28028 duration_ms: 108.8430028029 ...28030ok 5460 module-hooks/test-module-hooks-resolve-require-resolve-loaded-with-source28031 ---28032 duration_ms: 134.6480028033 ...28034ok 5461 sea/test-build-sea-executable-field # skip Running the resultant binary fails with `/home/iojs/node-tmp/.tmp.2379/sea: error while loading shared libraries: libicui18n.so.71: cannot open shared object file: No such file or directory`.28035 ---28036 duration_ms: 108.1850028037 ...28038ok 5462 sea/test-build-sea-invalid-executable # skip Running the resultant binary fails with `/home/iojs/node-tmp/.tmp.2379/sea: error while loading shared libraries: libicui18n.so.71: cannot open shared object file: No such file or directory`.28039 ---28040 duration_ms: 88.7680028041 ...28042ok 5463 sea/test-build-sea-invalid-boolean-fields # skip Running the resultant binary fails with `/home/iojs/node-tmp/.tmp.2379/sea: error while loading shared libraries: libicui18n.so.71: cannot open shared object file: No such file or directory`.28043 ---28044 duration_ms: 108.2830028045 ...28046ok 5464 module-hooks/test-module-hooks-require-esm28047 ---28048 duration_ms: 261.2290028049 ...28050ok 5465 sea/test-build-sea-invalid-exec-argv # skip Running the resultant binary fails with `/home/iojs/node-tmp/.tmp.2379/sea: error while loading shared libraries: libicui18n.so.71: cannot open shared object file: No such file or directory`.28051 ---28052 duration_ms: 110.2190028053 ...28054ok 5466 sea/test-build-sea-invalid-json # skip Running the resultant binary fails with `/home/iojs/node-tmp/.tmp.2379/sea: error while loading shared libraries: libicui18n.so.71: cannot open shared object file: No such file or directory`.28055 ---28056 duration_ms: 111.2750028057 ...28058ok 5467 sea/test-build-sea-missing-main # skip Running the resultant binary fails with `/home/iojs/node-tmp/.tmp.2379/sea: error while loading shared libraries: libicui18n.so.71: cannot open shared object file: No such file or directory`.28059 ---28060 duration_ms: 108.0290028061 ...28062ok 5468 sea/test-build-sea-vfs-incompatible-options # skip Running the resultant binary fails with `/home/iojs/node-tmp/.tmp.2379/sea: error while loading shared libraries: libicui18n.so.71: cannot open shared object file: No such file or directory`.28063 ---28064 duration_ms: 87.6360028065 ...28066ok 5469 sea/test-build-sea-missing-output # skip Running the resultant binary fails with `/home/iojs/node-tmp/.tmp.2379/sea: error while loading shared libraries: libicui18n.so.71: cannot open shared object file: No such file or directory`.28067 ---28068 duration_ms: 110.5990028069 ...28070ok 5470 sea/test-single-executable-application-asset-keys # skip Running the resultant binary fails with `/home/iojs/node-tmp/.tmp.2379/sea: error while loading shared libraries: libicui18n.so.71: cannot open shared object file: No such file or directory`.28071 ---28072 duration_ms: 87.1930028073 ...28074ok 5471 sea/test-single-executable-application # skip Running the resultant binary fails with `/home/iojs/node-tmp/.tmp.2379/sea: error while loading shared libraries: libicui18n.so.71: cannot open shared object file: No such file or directory`.28075 ---28076 duration_ms: 89.2550028077 ...28078ok 5472 sea/test-single-executable-application-assets # skip Running the resultant binary fails with `/home/iojs/node-tmp/.tmp.2379/sea: error while loading shared libraries: libicui18n.so.71: cannot open shared object file: No such file or directory`.28079 ---28080 duration_ms: 88.3870028081 ...28082ok 5473 sea/test-single-executable-application-empty # skip Running the resultant binary fails with `/home/iojs/node-tmp/.tmp.2379/sea: error while loading shared libraries: libicui18n.so.71: cannot open shared object file: No such file or directory`.28083 ---28084 duration_ms: 87.1890028085 ...28086ok 5474 sea/test-single-executable-application-asset-keys-empty # skip Running the resultant binary fails with `/home/iojs/node-tmp/.tmp.2379/sea: error while loading shared libraries: libicui18n.so.71: cannot open shared object file: No such file or directory`.28087 ---28088 duration_ms: 109.3680028089 ...28090ok 5475 sea/test-single-executable-application-exec-argv-extension-cli # skip Running the resultant binary fails with `/home/iojs/node-tmp/.tmp.2379/sea: error while loading shared libraries: libicui18n.so.71: cannot open shared object file: No such file or directory`.28091 ---28092 duration_ms: 89.4250028093 ...28094ok 5476 sea/test-single-executable-application-assets-raw # skip Running the resultant binary fails with `/home/iojs/node-tmp/.tmp.2379/sea: error while loading shared libraries: libicui18n.so.71: cannot open shared object file: No such file or directory`.28095 ---28096 duration_ms: 109.0750028097 ...28098ok 5477 sea/test-single-executable-application-disable-experimental-sea-warning # skip Running the resultant binary fails with `/home/iojs/node-tmp/.tmp.2379/sea: error while loading shared libraries: libicui18n.so.71: cannot open shared object file: No such file or directory`.28099 ---28100 duration_ms: 110.7670028101 ...28102ok 5478 sea/test-single-executable-application-esm # skip Running the resultant binary fails with `/home/iojs/node-tmp/.tmp.2379/sea: error while loading shared libraries: libicui18n.so.71: cannot open shared object file: No such file or directory`.28103 ---28104 duration_ms: 109.7090028105 ...28106ok 5479 sea/test-single-executable-application-esm-code-cache # skip Running the resultant binary fails with `/home/iojs/node-tmp/.tmp.2379/sea: error while loading shared libraries: libicui18n.so.71: cannot open shared object file: No such file or directory`.28107 ---28108 duration_ms: 108.8080028109 ...28110ok 5480 sea/test-single-executable-application-exec-argv # skip Running the resultant binary fails with `/home/iojs/node-tmp/.tmp.2379/sea: error while loading shared libraries: libicui18n.so.71: cannot open shared object file: No such file or directory`.28111 ---28112 duration_ms: 110.1530028113 ...28114ok 5481 sea/test-single-executable-application-inspect # skip Running the resultant binary fails with `/home/iojs/node-tmp/.tmp.2379/sea: error while loading shared libraries: libicui18n.so.71: cannot open shared object file: No such file or directory`.28115 ---28116 duration_ms: 87.7450028117 ...28118ok 5482 sea/test-single-executable-application-exec-argv-empty # skip Running the resultant binary fails with `/home/iojs/node-tmp/.tmp.2379/sea: error while loading shared libraries: libicui18n.so.71: cannot open shared object file: No such file or directory`.28119 ---28120 duration_ms: 112.6950028121 ...28122ok 5483 sea/test-single-executable-application-assets-invalid-type28123 ---28124 duration_ms: 135.6920028125 ...28126ok 5484 sea/test-single-executable-application-assets-nonexistent-file28127 ---28128 duration_ms: 136.1320028129 ...28130ok 5485 sea/test-single-executable-application-exec-argv-extension-env # skip Running the resultant binary fails with `/home/iojs/node-tmp/.tmp.2379/sea: error while loading shared libraries: libicui18n.so.71: cannot open shared object file: No such file or directory`.28131 ---28132 duration_ms: 109.2890028133 ...28134ok 5486 sea/test-single-executable-application-exec-argv-extension-none # skip Running the resultant binary fails with `/home/iojs/node-tmp/.tmp.2379/sea: error while loading shared libraries: libicui18n.so.71: cannot open shared object file: No such file or directory`.28135 ---28136 duration_ms: 108.1980028137 ...28138ok 5487 sea/test-single-executable-application-snapshot-worker # skip Running the resultant binary fails with `/home/iojs/node-tmp/.tmp.2379/sea: error while loading shared libraries: libicui18n.so.71: cannot open shared object file: No such file or directory`.28139 ---28140 duration_ms: 88.2240028141 ...28142ok 5488 sea/test-single-executable-application-inspect-in-sea-flags # skip Running the resultant binary fails with `/home/iojs/node-tmp/.tmp.2379/sea: error while loading shared libraries: libicui18n.so.71: cannot open shared object file: No such file or directory`.28143 ---28144 duration_ms: 107.8200028145 ...28146ok 5489 module-hooks/test-module-hooks-resolve-load-require-inline-typescript-override28147 ---28148 duration_ms: 326.0890028149 ...28150ok 5490 module-hooks/test-module-hooks-resolve-load-require-inline-typescript28151 ---28152 duration_ms: 330.2890028153 ...28154ok 5491 sea/test-single-executable-application-use-code-cache # skip Running the resultant binary fails with `/home/iojs/node-tmp/.tmp.2379/sea: error while loading shared libraries: libicui18n.so.71: cannot open shared object file: No such file or directory`.28155 ---28156 duration_ms: 87.3410028157 ...28158ok 5492 sea/test-single-executable-application-vfs # skip Running the resultant binary fails with `/home/iojs/node-tmp/.tmp.2379/sea: error while loading shared libraries: libicui18n.so.71: cannot open shared object file: No such file or directory`.28159 ---28160 duration_ms: 87.4780028161 ...28162ok 5493 sea/test-single-executable-application-snapshot # skip Running the resultant binary fails with `/home/iojs/node-tmp/.tmp.2379/sea: error while loading shared libraries: libicui18n.so.71: cannot open shared object file: No such file or directory`.28163 ---28164 duration_ms: 108.6310028165 ...28166ok 5494 sea/test-single-executable-application-snapshot-and-code-cache # skip Running the resultant binary fails with `/home/iojs/node-tmp/.tmp.2379/sea: error while loading shared libraries: libicui18n.so.71: cannot open shared object file: No such file or directory`.28167 ---28168 duration_ms: 108.0280028169 ...28170ok 5495 sea/test-single-executable-application-vfs-esm # skip Running the resultant binary fails with `/home/iojs/node-tmp/.tmp.2379/sea: error while loading shared libraries: libicui18n.so.71: cannot open shared object file: No such file or directory`.28171 ---28172 duration_ms: 108.3400028173 ...28174ok 5496 wasi/test-return-on-exit28175 ---28176 duration_ms: 87.1360028177 ...28178ok 5497 module-hooks/test-module-hooks-resolve-load-import-inline-typescript28179 ---28180 duration_ms: 409.2420028181 ...28182ok 5498 module-hooks/test-module-hooks-resolve-load-import-inline-typescript-override28183 ---28184 duration_ms: 409.6020028185 ...28186ok 5499 wasi/test-wasi-initialize-validation28187 ---28188 duration_ms: 111.7110028189 ...28190ok 5500 module-hooks/test-module-hooks-load-async-and-sync28191 ---28192 duration_ms: 606.3390028193 ...28194ok 5501 wasi/test-wasi-options-validation28195 ---28196 duration_ms: 108.9630028197 ...28198ok 5502 parallel/test-v8-collect-gc-profile-in-worker28199 ---28200 duration_ms: 5237.1500028201 ...28202ok 5503 parallel/test-v8-collect-gc-profile28203 ---28204 duration_ms: 5253.1520028205 ...28206ok 5504 wasi/test-wasi-start-validation28207 ---28208 duration_ms: 112.0430028209 ...28210ok 5505 wasi/test-wasi-stdio28211 ---28212 duration_ms: 108.5490028213 ...28214ok 5506 wasi/test-wasi-not-started28215 ---28216 duration_ms: 210.2880028217 ...28218ok 5507 sea/test-single-executable-blob-config28219 ---28220 duration_ms: 326.7450028221 ...28222ok 5508 wasi/test-wasi-cant_dotdot28223 ---28224 duration_ms: 326.7680028225 ...28226ok 5509 wasi/test-wasi-clock_getres28227 ---28228 duration_ms: 327.4180028229 ...28230ok 5510 wasi/test-wasi-fd_prestat_get_refresh28231 ---28232 duration_ms: 329.1310028233 ...28234ok 5511 wasi/test-wasi-ftruncate28235 ---28236 duration_ms: 326.3130028237 ...28238ok 5512 wasi/test-wasi-getentropy28239 ---28240 duration_ms: 325.9700028241 ...28242ok 5513 wasi/test-wasi-getrusage28243 ---28244 duration_ms: 326.9120028245 ...28246ok 5514 wasi/test-wasi-worker-terminate28247 ---28248 duration_ms: 210.1600028249 ...28250ok 5515 wasi/test-wasi-gettimeofday28251 ---28252 duration_ms: 327.5610028253 ...28254ok 5516 wasi/test-wasi-main_args28255 ---28256 duration_ms: 333.1080028257 ...28258ok 5517 wasi/test-wasi-readdir28259 ---28260 duration_ms: 327.2460028261 ...28262ok 5518 wasi/test-wasi-stat28263 ---28264 duration_ms: 328.7170028265 ...28266ok 5519 wasi/test-wasi-notdir28267 ---28268 duration_ms: 408.1030028269 ...28270ok 5520 wasi/test-wasi-preopen_populates28271 ---28272 duration_ms: 406.7150028273 ...28274ok 5521 wasi/test-wasi-sock28275 ---28276 duration_ms: 407.2360028277 ...28278ok 5522 wasi/test-wasi-write_file28279 ---28280 duration_ms: 325.3810028281 ...28282ok 5523 sea/test-single-executable-blob-config-errors28283 ---28284 duration_ms: 509.7970028285 ...28286ok 5524 pummel/test-array-hash-collision28287 ---28288 duration_ms: 325.4950028289 ...28290ok 5525 wasi/test-wasi-symlinks28291 ---28292 duration_ms: 509.6040028293 ...28294ok 5526 wasi/test-wasi-exitcode28295 ---28296 duration_ms: 708.7440028297 ...28298ok 5527 module-hooks/test-module-hooks-preload28299 ---28300 duration_ms: 1107.7350028301 ...28302ok 5528 wasi/test-wasi-io28303 ---28304 duration_ms: 806.8040028305 ...28306ok 5529 parallel/test-zlib-zip-zip6428307 ---28308 duration_ms: 2408.8190028309 ...28310ok 5530 parallel/test-stream-iter-broadcast-from28311 ---28312 duration_ms: 10285.7820028313 ...28314ok 5531 pummel/test-blob-slice-with-large-size28315 ---28316 duration_ms: 1507.0340028317 ...28318ok 5532 wasi/test-wasi-pthread28319 ---28320 duration_ms: 2412.9150028321 ...28322ok 5533 pummel/test-buffer-large-size-buffer-alloc28323 ---28324 duration_ms: 1507.0750028325 ...28326ok 5534 pummel/test-buffer-large-size-buffer-alloc-unsafe28327 ---28328 duration_ms: 1507.2660028329 ...28330ok 5535 wasi/test-wasi-poll28331 ---28332 duration_ms: 6417.9750028333 ...28334ok 5536 pummel/test-buffer-large-size-buffer-alloc-unsafe-slow28335 ---28336 duration_ms: 1506.9960028337 ...28338ok 5537 pummel/test-buffer-large-size-buffer-write28339 ---28340 duration_ms: 69.4090028341 ...28342ok 5538 pummel/test-buffer-large-size-copy28343 ---28344 duration_ms: 2508.2880028345 ...28346ok 5539 pummel/test-buffer-large-size-slowbuffer28347 ---28348 duration_ms: 1507.1910028349 ...28350ok 5540 pummel/test-child-process-spawn-loop28351 ---28352 duration_ms: 806.4180028353 ...28354ok 5541 pummel/test-crypto-argon2-nonblocking-constructor28355 ---28356 duration_ms: 1307.1020028357 ...28358ok 5542 pummel/test-crypto-dh-hash28359 ---28360 duration_ms: 134.4420028361 ...28362ok 5543 pummel/test-crypto-dh-keys28363 ---28364 duration_ms: 208.8580028365 ...28366ok 5544 parallel/test-runner-execution-ordered-bypass28367 ---28368 duration_ms: 30372.9930028369 ...28370ok 5545 pummel/test-crypto-pqc-sign-verify-slh-dsa28371 ---28372 duration_ms: 7110.8610028373 ...28374ok 5546 pummel/test-dh-regr28375 ---28376 duration_ms: 15718.8400028377 ...28378ok 5547 pummel/test-fs-largefile28379 ---28380 duration_ms: 69.4790028381 ...28382ok 5548 pummel/test-fs-read-file-sync-utf8-memory28383 ---28384 duration_ms: 606.3620028385 ...28386ok 5549 pummel/test-fs-readfile-tostring-fail28387 ---28388 duration_ms: 806.6740028389 ...28390ok 5550 pummel/test-heap-profile-and-snapshot-near-heap-limit28391 ---28392 duration_ms: 706.5920028393 ...28394ok 5551 pummel/test-heap-profile-near-heap-limit28395 ---28396 duration_ms: 606.6740028397 ...28398ok 5552 pummel/test-heapdump-dns28399 ---28400 duration_ms: 1207.3320028401 ...28402ok 5553 pummel/test-heapdump-env28403 ---28404 duration_ms: 606.7090028405 ...28406ok 5554 pummel/test-heapdump-fs-promise28407 ---28408 duration_ms: 906.8810028409 ...28410ok 5555 pummel/test-heapdump-http228411 ---28412 duration_ms: 1607.4340028413 ...28414ok 5556 pummel/test-heapdump-inspector28415 ---28416 duration_ms: 906.9700028417 ...28418ok 5557 pummel/test-heapdump-shadow-realm28419 ---28420 duration_ms: 2107.9980028421 ...28422ok 5558 pummel/test-heapdump-tls28423 ---28424 duration_ms: 1007.0590028425 ...28426ok 5559 pummel/test-heapdump-urlpattern28427 ---28428 duration_ms: 906.8590028429 ...28430ok 5560 pummel/test-heapdump-vm-script28431 ---28432 duration_ms: 606.6670028433 ...28434ok 5561 pummel/test-heapdump-worker28435 ---28436 duration_ms: 906.9080028437 ...28438ok 5562 pummel/test-heapdump-zlib28439 ---28440 duration_ms: 8213.4560028441 ...28442ok 5563 pummel/test-heapdump-zstd28443 ---28444 duration_ms: 1307.0190028445 ...28446ok 5564 pummel/test-heapsnapshot-near-heap-limit28447 ---28448 duration_ms: 1907.7510028449 ...28450ok 5565 pummel/test-heapsnapshot-near-heap-limit-big28451 ---28452 duration_ms: 2107.7460028453 ...28454ok 5566 pummel/test-heapsnapshot-near-heap-limit-bounded28455 ---28456 duration_ms: 1706.6370028457 ...28458ok 5567 pummel/test-heapsnapshot-near-heap-limit-by-api28459 ---28460 duration_ms: 2607.1730028461 ...28462ok 5568 pummel/test-http-many-keep-alive-connections28463 ---28464 duration_ms: 706.3170028465 ...28466ok 5569 pummel/test-http-upload-timeout28467 ---28468 duration_ms: 3308.4480028469 ...28470ok 5570 pummel/test-https-large-response28471 ---28472 duration_ms: 167.7490028473 ...28474ok 5571 pummel/test-https-no-reader28475 ---28476 duration_ms: 2307.5370028477 ...28478ok 5572 pummel/test-keep-alive # skip test requires `wrk` to be installed first28479 ---28480 duration_ms: 69.2990028481 ...28482ok 5573 pummel/test-net-many-clients28483 ---28484 duration_ms: 167.2200028485 ...28486ok 5574 pummel/test-net-pause28487 ---28488 duration_ms: 2207.6630028489 ...28490ok 5575 pummel/test-net-pingpong28491 ---28492 duration_ms: 209.7970028493 ...28494ok 5576 pummel/test-net-pingpong-delay28495 ---28496 duration_ms: 406.2820028497 ...28498ok 5577 pummel/test-net-timeout28499 ---28500 duration_ms: 3708.5920028501 ...28502ok 5578 pummel/test-net-timeout228503 ---28504 duration_ms: 5210.0810028505 ...28506ok 5579 pummel/test-net-write-callbacks28507 ---28508 duration_ms: 706.8390028509 ...28510ok 5580 pummel/test-next-tick-infinite-calls28511 ---28512 duration_ms: 4007.9060028513 ...28514ok 5581 pummel/test-process-cpuUsage28515 ---28516 duration_ms: 706.5090028517 ...28518ok 5582 pummel/test-process-hrtime28519 ---28520 duration_ms: 2207.8080028521 ...28522ok 5583 pummel/test-regress-GH-89228523 ---28524 duration_ms: 260.9660028525 ...28526ok 5584 pummel/test-repl-paste-big-data28527 ---28528 duration_ms: 506.4660028529 ...28530ok 5585 pummel/test-stream-pipe-multi28531 ---28532 duration_ms: 821.8500028533 ...28534ok 5586 pummel/test-string-decoder-large-buffer28535 ---28536 duration_ms: 69.3890028537 ...28538ok 5587 pummel/test-structuredclone-jstransferable28539 ---28540 duration_ms: 806.9630028541 ...28542ok 5588 pummel/test-timers28543 ---28544 duration_ms: 3208.1890028545 ...28546ok 5589 pummel/test-tls-server-large-request28547 ---28548 duration_ms: 209.0150028549 ...28550ok 5590 pummel/test-tls-throttle28551 ---28552 duration_ms: 134.5010028553 ...28554ok 5591 pummel/test-vm-memleak28555 ---28556 duration_ms: 5410.3820028557 ...28558ok 5592 pummel/test-vm-race28559 ---28560 duration_ms: 5210.5830028561 ...28562ok 5593 pummel/test-watch-file28563 ---28564 duration_ms: 5209.8950028565 ...28566ok 5594 pummel/test-webcrypto-derivebits-pbkdf228567 ---28568 duration_ms: 2707.2640028569 ...28570ok 5595 pummel/test-webcrypto-kangarootwelve-32bit-overflow # skip only relevant when kMaxLength < 2^3228571 ---28572 duration_ms: 69.7620028573 ...28574ok 5596 pummel/test-worker-take-heapsnapshot28575 ---28576 duration_ms: 406.2360028577 ...28578ok 5597 pummel/test-zlib-zip-slow28579 ---28580 duration_ms: 11216.3140028581 ...28582ok 5598 known_issues/test-cli-print-var-crypto28583 ---28584 duration_ms: 167.5940028585 ...28586ok 5599 known_issues/test-cwd-enoent-file28587 ---28588 duration_ms: 134.4940028589 ...28590ok 5600 known_issues/test-dgram-bind-shared-ports-after-port-028591 ---28592 duration_ms: 208.8150028593 ...28594ok 5601 known_issues/test-fs-cp-async-buffer28595 ---28596 duration_ms: 69.3490028597 ...28598ok 5602 known_issues/test-fs-cp-filter28599 ---28600 duration_ms: 69.3820028601 ...28602ok 5603 known_issues/test-fs-cp-non-utf828603 ---28604 duration_ms: 69.3190028605 ...28606ok 5604 known_issues/test-fs-writeFileSync-invalid-windows28607 ---28608 duration_ms: 69.4350028609 ...28610ok 5605 known_issues/test-http-clientrequest-end-contentlength28611 ---28612 duration_ms: 86.4110028613 ...28614ok 5606 known_issues/test-http-clientrequest-end-empty-response-body28615 ---28616 duration_ms: 86.3120028617 ...28618ok 5607 known_issues/test-http-clientrequest-write-chunked28619 ---28620 duration_ms: 86.3580028621 ...28622ok 5608 known_issues/test-http-path-contains-unicode28623 ---28624 duration_ms: 69.3380028625 ...28626ok 5609 known_issues/test-inspector-cluster-port-clash28627 ---28628 duration_ms: 167.3060028629 ...28630ok 5610 known_issues/test-inspector-instrumentation-breakpoint28631 ---28632 duration_ms: 15319.0210028633 ...28634ok 5611 known_issues/test-repl-require-context28635 ---28636 duration_ms: 86.5760028637 ...28638ok 5612 known_issues/test-stdin-is-always-net.socket28639 ---28640 duration_ms: 134.2710028641 ...28642ok 5613 known_issues/test-stream-writable-sync-error28643 ---28644 duration_ms: 69.3700028645 ...28646ok 5614 known_issues/test-url-parse-conformance28647 ---28648 duration_ms: 107.6640028649 ...28650ok 5615 known_issues/test-vm-function-declaration-uses-define28651 ---28652 duration_ms: 69.3110028653 ...28654ok 5616 known_issues/test-vm-timeout-escape-nexttick28655 ---28656 duration_ms: 806.3050028657 ...28658ok 5617 abort/test-abort-backtrace28659 ---28660 duration_ms: 212.8560028661 ...28662ok 5618 abort/test-abort-fatal-error28663 ---28664 duration_ms: 264.6290028665 ...28666ok 5619 abort/test-abort-uncaught-exception28667 ---28668 duration_ms: 264.8560028669 ...28670ok 5620 abort/test-addon-register-signal-handler # skip binding not built yet28671 ---28672 duration_ms: 73.1280028673 ...28674ok 5621 abort/test-addon-uv-handle-leak # skip binding not built yet28675 ---28676 duration_ms: 73.3570028677 ...28678ok 5622 abort/test-http-parser-consume28679 ---28680 duration_ms: 212.8260028681 ...28682ok 5623 abort/test-process-abort-exitcode28683 ---28684 duration_ms: 212.9220028685 ...28686ok 5624 abort/test-signal-handler28687 ---28688 duration_ms: 212.4490028689 ...28690ok 5625 abort/test-worker-abort-uncaught-exception28691 ---28692 duration_ms: 264.3670028693 ...28694ok 5626 abort/test-zlib-invalid-internals-usage28695 ---28696 duration_ms: 212.7460028697 ...28698ok 5627 wpt/test-abort28699 ---28700 duration_ms: 2307.8790028701 ...28702ok 5628 wpt/test-atob28703 ---28704 duration_ms: 167.8790028705 ...28706ok 5629 wpt/test-blob28707 ---28708 duration_ms: 260.9420028709 ...28710ok 5630 wpt/test-broadcastchannel28711 ---28712 duration_ms: 167.4550028713 ...28714ok 5631 wpt/test-compression28715 ---28716 duration_ms: 710.0310028717 ...28718ok 5632 wpt/test-console28719 ---28720 duration_ms: 209.0250028721 ...28722ok 5633 wpt/test-encoding28723 ---28724 duration_ms: 509.4940028725 ...28726ok 5634 wpt/test-events28727 ---28728 duration_ms: 208.9660028729 ...28730ok 5635 wpt/test-file28731 ---28732 duration_ms: 134.6540028733 ...28734ok 5636 wpt/test-hr-time28735 ---28736 duration_ms: 2207.8140028737 ...28738ok 5637 wpt/test-microtask-queuing28739 ---28740 duration_ms: 134.3300028741 ...28742ok 5638 wpt/test-performance-timeline28743 ---28744 duration_ms: 2307.6340028745 ...28746ok 5639 wpt/test-resource-timing28747 ---28748 duration_ms: 260.8380028749 ...28750ok 5640 wpt/test-streams28751 ---28752 duration_ms: 2608.8080028753 ...28754ok 5641 wpt/test-structured-clone28755 ---28756 duration_ms: 134.2840028757 ...28758ok 5642 wpt/test-timers28759 ---28760 duration_ms: 706.3290028761 ...28762ok 5643 wpt/test-url # skip Different versions of Ada affect the WPT tests28763 ---28764 duration_ms: 69.4650028765 ...28766ok 5644 wpt/test-urlpattern28767 ---28768 duration_ms: 209.2130028769 ...28770ok 5645 wpt/test-wasm-jsapi28771 ---28772 duration_ms: 907.3340028773 ...28774ok 5646 wpt/test-wasm-webapi28775 ---28776 duration_ms: 208.9640028777 ...28778ok 5647 wpt/test-web-locks28779 ---28780 duration_ms: 1507.3820028781 ...28782ok 5648 wpt/test-webcrypto28783 ---28784 duration_ms: 5158.4680028785 ...28786ok 5649 wpt/test-webidl28787 ---28788 duration_ms: 326.8730028789 ...28790ok 5650 wpt/test-webstorage28791 ---28792 duration_ms: 1507.6580028793 ...28794ok 5651 wpt/test-workers28795 ---28796 duration_ms: 606.6510028797 ...28798ok 5652 wasm-allocation/test-wasm-allocation28799 ---28800 duration_ms: 90.4830028801 ...28802ok 5653 wasm-allocation/test-wasm-allocation-auto-adapt28803 ---28804 duration_ms: 73.7290028805 ...28806ok 5654 wasm-allocation/test-wasm-allocation-disable-trap-handler28807 ---28808 duration_ms: 73.7340028809 ...28810ok 5655 wasm-allocation/test-wasm-allocation-memory6428811 ---28812 duration_ms: 90.4350028813 ...28814ok 5656 sequential/test-async-wrap-getasyncid28815 ---28816 duration_ms: 260.8550028817 ...28818ok 5657 sequential/test-buffer-creation-regression28819 ---28820 duration_ms: 69.4360028821 ...28822ok 5658 sequential/test-child-process-emfile28823 ---28824 duration_ms: 134.1490028825 ...28826ok 5659 sequential/test-child-process-execsync28827 ---28828 duration_ms: 606.2520028829 ...28830ok 5660 sequential/test-child-process-exit28831 ---28832 duration_ms: 406.2830028833 ...28834ok 5661 sequential/test-child-process-pass-fd28835 ---28836 duration_ms: 507.5300028837 ...28838ok 5662 sequential/test-cli-syntax-bad28839 ---28840 duration_ms: 506.4110028841 ...28842ok 5663 sequential/test-cli-syntax-file-not-found28843 ---28844 duration_ms: 134.3120028845 ...28846ok 5664 sequential/test-cli-syntax-good28847 ---28848 duration_ms: 134.1210028849 ...28850ok 5665 sequential/test-cli-syntax-require28851 ---28852 duration_ms: 260.5200028853 ...28854ok 5666 sequential/test-cluster-inspect-brk28855 ---28856 duration_ms: 134.1530028857 ...28858ok 5667 sequential/test-cluster-net-listen-ipv6only-none28859 ---28860 duration_ms: 167.3070028861 ...28862ok 5668 sequential/test-cluster-net-listen-ipv6only-rr28863 ---28864 duration_ms: 167.3180028865 ...28866ok 5669 sequential/test-cluster-port-reuse-between-workers28867 ---28868 duration_ms: 260.6630028869 ...28870ok 5670 sequential/test-cluster-send-handle-large-payload28871 ---28872 duration_ms: 167.4890028873 ...28874ok 5671 sequential/test-cpu-prof-default28875 ---28876 duration_ms: 906.5190028877 ...28878ok 5672 sequential/test-cpu-prof-dir-absolute28879 ---28880 duration_ms: 906.7400028881 ...28882ok 5673 sequential/test-cpu-prof-dir-and-name28883 ---28884 duration_ms: 906.6090028885 ...28886ok 5674 sequential/test-cpu-prof-dir-relative28887 ---28888 duration_ms: 906.6850028889 ...28890ok 5675 sequential/test-cpu-prof-drained28891 ---28892 duration_ms: 906.2900028893 ...28894ok 5676 sequential/test-cpu-prof-exit28895 ---28896 duration_ms: 208.9470028897 ...28898ok 5677 sequential/test-cpu-prof-invalid-options28899 ---28900 duration_ms: 167.3890028901 ...28902ok 5678 sequential/test-cpu-prof-kill28903 ---28904 duration_ms: 208.6930028905 ...28906ok 5679 sequential/test-cpu-prof-name28907 ---28908 duration_ms: 1606.9100028909 ...28910ok 5680 sequential/test-cpu-prof-worker-argv28911 ---28912 duration_ms: 906.5750028913 ...28914ok 5681 sequential/test-crypto-timing-safe-equal28915 ---28916 duration_ms: 69.5650028917 ...28918ok 5682 sequential/test-crypto-timing-safe-equal-fast28919 ---28920 duration_ms: 86.3880028921 ...28922ok 5683 sequential/test-debug-prompt28923 ---28924 duration_ms: 606.2780028925 ...28926ok 5684 sequential/test-debugger-custom-port28927 ---28928 duration_ms: 606.3740028929 ...28930ok 5685 sequential/test-debugger-debug-brk28931 ---28932 duration_ms: 134.2970028933 ...28934ok 5686 sequential/test-debugger-invalid-args28935 ---28936 duration_ms: 5309.9510028937 ...28938ok 5687 sequential/test-debugger-launch28939 ---28940 duration_ms: 606.5090028941 ...28942ok 5688 sequential/test-debugger-pid28943 ---28944 duration_ms: 406.2590028945 ...28946ok 5689 sequential/test-deprecation-flags28947 ---28948 duration_ms: 134.2210028949 ...28950ok 5690 sequential/test-dgram-bind-shared-ports28951 ---28952 duration_ms: 208.9520028953 ...28954ok 5691 sequential/test-dgram-implicit-bind-failure28955 ---28956 duration_ms: 69.6400028957 ...28958ok 5692 sequential/test-dgram-pingpong28959 ---28960 duration_ms: 86.6270028961 ...28962ok 5693 sequential/test-diagnostic-dir-cpu-prof28963 ---28964 duration_ms: 1707.0850028965 ...28966ok 5694 sequential/test-diagnostic-dir-heap-prof28967 ---28968 duration_ms: 1206.9650028969 ...28970ok 5695 sequential/test-dtls-interop-openssl-client # skip DTLS is not enabled28971 ---28972 duration_ms: 69.5180028973 ...28974ok 5696 sequential/test-dtls-interop-openssl-server # skip DTLS is not enabled28975 ---28976 duration_ms: 69.2710028977 ...28978ok 5697 sequential/test-error-serdes28979 ---28980 duration_ms: 86.2590028981 ...28982ok 5698 sequential/test-fs-opendir-recursive28983 ---28984 duration_ms: 134.1500028985 ...28986ok 5699 sequential/test-fs-readdir-recursive28987 ---28988 duration_ms: 107.6150028989 ...28990ok 5700 sequential/test-fs-stat-sync-overflow28991 ---28992 duration_ms: 167.3060028993 ...28994ok 5701 sequential/test-gc-http-client28995 ---28996 duration_ms: 506.2460028997 ...28998ok 5702 sequential/test-gc-http-client-onerror28999 ---29000 duration_ms: 506.5870029001 ...29002ok 5703 sequential/test-gc-http-client-timeout29003 ---29004 duration_ms: 406.5600029005 ...29006ok 5704 sequential/test-get-heapsnapshot-options29007 ---29008 duration_ms: 1106.8260029009 ...29010ok 5705 sequential/test-heapdump29011 ---29012 duration_ms: 506.5000029013 ...29014ok 5706 sequential/test-heapdump-flag29015 ---29016 duration_ms: 406.2580029017 ...29018ok 5707 sequential/test-heapdump-flag-custom-dir29019 ---29020 duration_ms: 406.2990029021 ...29022ok 5708 sequential/test-http-econnrefused29023 ---29024 duration_ms: 86.4870029025 ...29026ok 5709 sequential/test-http-keep-alive-large-write29027 ---29028 duration_ms: 86.2920029029 ...29030ok 5710 sequential/test-http-keepalive-maxsockets29031 ---29032 duration_ms: 406.1230029033 ...29034ok 5711 sequential/test-http-regr-gh-292829035 ---29036 duration_ms: 86.4700029037 ...29038ok 5712 sequential/test-http-server-keep-alive-timeout-slow-client-headers29039 ---29040 duration_ms: 1906.9080029041 ...29042ok 5713 sequential/test-http-server-keep-alive-timeout-slow-server29043 ---29044 duration_ms: 706.5790029045 ...29046ok 5714 sequential/test-http2-max-session-memory29047 ---29048 duration_ms: 86.4650029049 ...29050ok 5715 sequential/test-http2-ping-flood29051 ---29052 duration_ms: 107.6070029053 ...29054ok 5716 sequential/test-http2-settings-flood29055 ---29056 duration_ms: 107.5390029057 ...29058ok 5717 sequential/test-http2-timeout-large-write29059 ---29060 duration_ms: 2808.0130029061 ...29062ok 5718 sequential/test-http2-timeout-large-write-file29063 ---29064 duration_ms: 2807.6450029065 ...29066ok 5719 sequential/test-https-connect-localport29067 ---29068 duration_ms: 6209.3110029069 ...29070ok 5720 sequential/test-https-server-keep-alive-timeout29071 ---29072 duration_ms: 1806.9350029073 ...29074ok 5721 sequential/test-init29075 ---29076 duration_ms: 167.5500029077 ...29078ok 5722 sequential/test-inspector-network-resource29079 ---29080 duration_ms: 1506.9790029081 ...29082ok 5723 sequential/test-inspector-open-dispose29083 ---29084 duration_ms: 167.3310029085 ...29086ok 5724 sequential/test-inspector-port-cluster29087 ---29088 duration_ms: 406.3940029089 ...29090ok 5725 sequential/test-module-loading29091 ---29092 duration_ms: 86.7310029093 ...29094ok 5726 sequential/test-net-GH-550429095 ---29096 duration_ms: 260.7060029097 ...29098ok 5727 sequential/test-net-better-error-messages-port29099 ---29100 duration_ms: 86.4730029101 ...29102ok 5728 sequential/test-net-connect-econnrefused29103 ---29104 duration_ms: 134.1320029105 ...29106ok 5729 sequential/test-net-connect-handle-econnrefused29107 ---29108 duration_ms: 86.3000029109 ...29110ok 5730 sequential/test-net-connect-local-error29111 ---29112 duration_ms: 86.3360029113 ...29114ok 5731 sequential/test-net-listen-ipv6only29115 ---29116 duration_ms: 69.3090029117 ...29118ok 5732 sequential/test-net-listen-shared-ports29119 ---29120 duration_ms: 260.7090029121 ...29122ok 5733 sequential/test-net-localport29123 ---29124 duration_ms: 69.3930029125 ...29126ok 5734 sequential/test-net-reconnect-error29127 ---29128 duration_ms: 86.3970029129 ...29130ok 5735 sequential/test-net-response-size29131 ---29132 duration_ms: 1306.7530029133 ...29134ok 5736 sequential/test-net-server-address29135 ---29136 duration_ms: 86.5320029137 ...29138ok 5737 sequential/test-net-server-bind29139 ---29140 duration_ms: 208.6900029141 ...29142ok 5738 sequential/test-net-server-listen-ipv6-link-local29143 ---29144 duration_ms: 86.3550029145 ...29146ok 5739 sequential/test-next-tick-error-spin29147 ---29148 duration_ms: 134.2770029149 ...29150ok 5740 sequential/test-perf-hooks29151 ---29152 duration_ms: 1206.7870029153 ...29154ok 5741 sequential/test-performance-eventloopdelay29155 ---29156 duration_ms: 7210.9610029157 ...29158ok 5742 sequential/test-pipe29159 ---29160 duration_ms: 4308.7730029161 ...29162ok 5743 sequential/test-process-title29163 ---29164 duration_ms: 107.6840029165 ...29166ok 5744 sequential/test-process-warnings29167 ---29168 duration_ms: 134.0840029169 ...29170ok 5745 sequential/test-repl-timeout-throw29171 ---29172 duration_ms: 260.5220029173 ...29174ok 5746 sequential/test-require-cache-without-stat29175 ---29176 duration_ms: 69.3670029177 ...29178ok 5747 sequential/test-resolution-inspect-brk29179 ---29180 duration_ms: 107.5330029181 ...29182ok 5748 sequential/test-stream2-fs29183 ---29184 duration_ms: 69.3490029185 ...29186ok 5749 sequential/test-stream2-stderr-sync29187 ---29188 duration_ms: 167.2090029189 ...29190ok 5750 sequential/test-timers-block-eventloop29191 ---29192 duration_ms: 107.6600029193 ...29194ok 5751 sequential/test-timers-set-interval-excludes-callback-duration29195 ---29196 duration_ms: 506.1310029197 ...29198ok 5752 sequential/test-tls-connect29199 ---29200 duration_ms: 86.6430029201 ...29202ok 5753 sequential/test-tls-lookup29203 ---29204 duration_ms: 86.3400029205 ...29206ok 5754 sequential/test-tls-psk-client # skip missing openssl cli29207 ---29208 duration_ms: 69.4880029209 ...29210ok 5755 sequential/test-tls-session-timeout # skip node compiled without OpenSSL CLI.29211 ---29212 duration_ms: 69.3380029213 ...29214ok 5756 sequential/test-util-debug29215 ---29216 duration_ms: 325.5650029217 ...29218ok 5757 sequential/test-vm-break-on-sigint29219 ---29220 duration_ms: 134.1420029221 ...29222ok 5758 sequential/test-vm-timeout-escape-promise-module-229223 ---29224 duration_ms: 86.5040029225 ...29226ok 5759 sequential/test-vm-timeout-rethrow29227 ---29228 duration_ms: 134.1590029229 ...29230ok 5760 sequential/test-watch-mode-restart-esm-loading-error29231 ---29232 duration_ms: 2307.2780029233 ...29234ok 5761 sequential/test-watch-mode-watch-flags29235 ---29236 duration_ms: 260.6710029237 ...29238ok 5762 sequential/test-watch-mode-worker29239 ---29240 duration_ms: 2207.7270029241 ...29242ok 5763 sequential/test-without-async-context-frame29243 ---29244 duration_ms: 1108.7090029245 ...29246ok 5764 sequential/test-worker-eventlooputil29247 ---29248 duration_ms: 260.8250029249 ...29250ok 5765 sequential/test-worker-fshandles-error-on-termination29251 ---29252 duration_ms: 208.9090029253 ...29254ok 5766 sequential/test-worker-fshandles-open-close-on-termination29255 ---29256 duration_ms: 260.7920029257 ...29258ok 5767 sequential/test-worker-heapsnapshot-options29259 ---29260 duration_ms: 606.1050029261 ...29262ok 5768 sequential/test-worker-prof29263 ---29264 duration_ms: 1906.7780029265 ...29266ok 5769 sequential/test-write-heapsnapshot-options29267 ---29268 duration_ms: 1006.3850029269 ...29270ok 5770 sequential/test-zlib-crc32-fast-api29271 ---29272 duration_ms: 86.3260029273 ...2927429275Failed tests:29276out/Release/node /build/node-v26.9.0/test/parallel/test-fs-cp-async-file-modes.mjs29277make: *** [Makefile:631: test-ci-js] Error 1