zero/project-zero build #64 failed ← #63 #65 →
eval warnings
11 kinds
· 18 occurrences
- warn nixfmt-rfc-style is now the same as pkgs.nixfmt which should be used instead. ×2
- warn Missing manifest.readme for clanService 'self/zero-monitoring' ×4
- warn Missing manifest.readme for clanService 'self/zero-internal-ca' ×4
- warn Missing manifest.readme for clanService 'self/zero-hetzner-proxy' ×1
- warn 'system' has been renamed to/replaced by 'stdenv.hostPlatform.system' ×1
- warn Missing manifest.readme for clanService 'self/zero-fabro' ×1
- warn Missing manifest.readme for clanService 'self/zero-clanker' ×1
- warn Missing manifest.readme for clanService 'self/zero-agents' ×1
- warn directive-poll.service is ordered after 'network-online.target' but doesn't depend on it ×1
- warn drift-audit.service is ordered after 'network-online.target' but doesn't depend on it ×1
- warn health-poll.service is ordered after 'network-online.target' but doesn't depend on it ×1
2 failed
| status | attribute | duration |
|---|---|---|
default.checks.x86_64-linux.clanker
|
9s | |
clanker-0.1.0: 2026/08/20 15:26:23 INFO replied conversation=stream:77/deploy message_id=100 sender=Mic92 reply_message_id=1001 --- FAIL: TestSessionTheAgentCan …clanker-0.1.0:
2026/08/20 15:26:23 INFO replied conversation=stream:77/deploy message_id=100 sender=Mic92 reply_message_id=1001
--- FAIL: TestSessionTheAgentCannotWriteIsRetired (0.00s)
runner_test.go:945: chmod /build/TestSessionTheAgentCannotWriteIsRetired3835395725/002/conv/e4fba25064ae8ac1: operation not permitted
--- FAIL: TestConvDirIsSetgidForASeparateAgent (0.00s)
runner_test.go:1020: chmod /build/TestConvDirIsSetgidForASeparateAgent3628793422/001/conv/17e62e85630bdcab: operation not permitted
FAIL
FAIL project-zero/clanker 0.655s
FAIL
|
||
default.checks.x86_64-linux.machine-fabro01
|
— | |
4 succeeded
| status | attribute | duration |
|---|---|---|
| loading… | ||
4 already built
| status | attribute | duration |
|---|---|---|
| loading… | ||