nixbot

builds

zero/project-zero build #325 failed

branch main · PR #406 · commit 835067535b · · took 14m 18s · eval 3m 13s

eval warnings 37 kinds · 153 occurrences
  • error unable to download 'https://cache.geninf.io/…': HTTP error 503 ×5
  • error unable to download 'https://cache.clan.lol/…': HTTP error 503 ×9
  • warn nixfmt-rfc-style is now the same as pkgs.nixfmt which should be used instead. ×2
  • warn Scripted initrd is deprecated and scheduled for removal in 26.11. See the NixOS 26.05 release notes. ×2
  • warn Missing manifest.readme for clanService 'self/zero-monitoring' ×9
  • warn Missing manifest.readme for clanService 'self/zero-internal-ca' ×9
  • warn Missing manifest.readme for clanService 'self/zero-hetzner-proxy' ×1
  • warn Missing manifest.readme for clanService 'self/zero-jitsi' ×3
  • warn Missing manifest.readme for clanService 'self/zero-stalwart' ×1
  • warn Missing manifest.readme for clanService 'self/zero-matrix' ×2
  • warn Missing manifest.readme for clanService 'self/zero-mailserver' ×1
  • warn Missing manifest.readme for clanService 'self/zero-calendar-bot' ×1
  • warn Missing manifest.readme for clanService 'self/zero-fabro' ×1
  • warn Missing manifest.readme for clanService 'self/zero-covibe' ×1
  • warn Missing manifest.readme for clanService 'self/zero-clanker' ×1
  • warn Missing manifest.readme for clanService 'self/zero-agents' ×1
  • warn deploy-main.service is ordered after 'network-online.target' but doesn't depend on it ×1
  • warn directive-poll.service is ordered after 'network-online.target' but doesn't depend on it ×1
  • warn drift-audit.service is ordered after 'network-online.target' but doesn't depend on it ×1
  • warn flake-update.service is ordered after 'network-online.target' but doesn't depend on it ×1
  • warn flake-update-poll.service is ordered after 'network-online.target' but doesn't depend on it ×1
  • warn health-poll.service is ordered after 'network-online.target' but doesn't depend on it ×1
  • warn The xorg package set has been deprecated, 'xorg.libX11' has been renamed to 'libx11' ×1
  • warn The xorg package set has been deprecated, 'xorg.libXcomposite' has been renamed to 'libxcomposite' ×1
  • warn The xorg package set has been deprecated, 'xorg.libXcursor' has been renamed to 'libxcursor' ×1
  • warn The xorg package set has been deprecated, 'xorg.libXdamage' has been renamed to 'libxdamage' ×1
  • warn The xorg package set has been deprecated, 'xorg.libXext' has been renamed to 'libxext' ×1
  • warn The xorg package set has been deprecated, 'xorg.libXfixes' has been renamed to 'libxfixes' ×1
  • warn The xorg package set has been deprecated, 'xorg.libXi' has been renamed to 'libxi' ×1
  • warn The xorg package set has been deprecated, 'xorg.libXrandr' has been renamed to 'libxrandr' ×1
  • warn The xorg package set has been deprecated, 'xorg.libXrender' has been renamed to 'libxrender' ×1
  • warn The xorg package set has been deprecated, 'xorg.libXScrnSaver' has been renamed to 'libxscrnsaver' ×1
  • warn The xorg package set has been deprecated, 'xorg.libxcb' has been renamed to 'libxcb' ×1
  • warn The xorg package set has been deprecated, 'xorg.libXtst' has been renamed to 'libxtst' ×1
  • warn Missing manifest.readme for clanService 'self/zero-idp' ×1
  • warn unable to download 'https://cache.clan.lol/…': HTTP error 503 ×50
  • warn unable to download 'https://cache.geninf.io/…': HTTP error 503 ×35

5 failed ⚠ 5
failed attributes
status attribute duration
failed checks.aarch64-linux.machine-builder01
  • Missing manifest.readme for clanService 'self/zero-monitoring'
  • Missing manifest.readme for clanService 'self/zero-internal-ca'
10s
setup: don't know how to build these paths: /nix/store/p3z8a7ldvp9pxnv73hzjp2znq1aj8x31-nixos-system-builder01-26.11.20260923.4975466.drv warning: ignoring th …
setup:
don't know how to build these paths:
  /nix/store/p3z8a7ldvp9pxnv73hzjp2znq1aj8x31-nixos-system-builder01-26.11.20260923.4975466.drv
warning: ignoring the client-specified setting 'store', because it is a restricted setting and you are not a trusted user
error: gRPC QueryValidPaths on 'nix-store.geninf.io:50051' failed: error: substituter 'https://cache.clan.lol' is disabled
failed checks.x86_64-linux.machine-fabro01
  • Missing manifest.readme for clanService 'self/zero-monitoring'
  • Missing manifest.readme for clanService 'self/zero-internal-ca'
  • Missing manifest.readme for clanService 'self/zero-fabro'
  • Missing manifest.readme for clanService 'self/zero-covibe'
  • Missing manifest.readme for clanService 'self/zero-clanker'
  • Missing manifest.readme for clanService 'self/zero-agents'
  • deploy-main.service is ordered after 'network-online.target' but doesn't depend on it
  • directive-poll.service is ordered after 'network-online.target' but doesn't depend on it
  • drift-audit.service is ordered after 'network-online.target' but doesn't depend on it
  • flake-update.service is ordered after 'network-online.target' but doesn't depend on it
  • flake-update-poll.service is ordered after 'network-online.target' but doesn't depend on it
  • health-poll.service is ordered after 'network-online.target' but doesn't depend on it
  • The xorg package set has been deprecated, 'xorg.libX11' has been renamed to 'libx11'
  • The xorg package set has been deprecated, 'xorg.libXcomposite' has been renamed to 'libxcomposite'
  • The xorg package set has been deprecated, 'xorg.libXcursor' has been renamed to 'libxcursor'
  • The xorg package set has been deprecated, 'xorg.libXdamage' has been renamed to 'libxdamage'
  • The xorg package set has been deprecated, 'xorg.libXext' has been renamed to 'libxext'
  • The xorg package set has been deprecated, 'xorg.libXfixes' has been renamed to 'libxfixes'
  • The xorg package set has been deprecated, 'xorg.libXi' has been renamed to 'libxi'
  • The xorg package set has been deprecated, 'xorg.libXrandr' has been renamed to 'libxrandr'
  • The xorg package set has been deprecated, 'xorg.libXrender' has been renamed to 'libxrender'
  • The xorg package set has been deprecated, 'xorg.libXScrnSaver' has been renamed to 'libxscrnsaver'
  • The xorg package set has been deprecated, 'xorg.libxcb' has been renamed to 'libxcb'
  • The xorg package set has been deprecated, 'xorg.libXtst' has been renamed to 'libxtst'
9m 7s
setup: don't know how to build these paths: /nix/store/0k5imx5s1jnqy4zab1722zh87nj9w9y7-nixos-system-fabro01-26.11.20260923.4975466.drv warning: ignoring the …
setup:
don't know how to build these paths:
  /nix/store/0k5imx5s1jnqy4zab1722zh87nj9w9y7-nixos-system-fabro01-26.11.20260923.4975466.drv
warning: ignoring the client-specified setting 'store', because it is a restricted setting and you are not a trusted user
error: gRPC QueryValidPaths on 'nix-store.geninf.io:50051' failed: error: substituter 'https://cache.clan.lol' is disabled
failed checks.x86_64-linux.machine-ipfs01
  • Missing manifest.readme for clanService 'self/zero-monitoring'
  • Missing manifest.readme for clanService 'self/zero-internal-ca'
9m 7s
setup: don't know how to build these paths: /nix/store/j9pxnp575h9dnm3yjgf3gsx6npball8z-nixos-system-ipfs01-26.11.20260923.4975466.drv warning: ignoring the c …
setup:
don't know how to build these paths:
  /nix/store/j9pxnp575h9dnm3yjgf3gsx6npball8z-nixos-system-ipfs01-26.11.20260923.4975466.drv
warning: ignoring the client-specified setting 'store', because it is a restricted setting and you are not a trusted user
error: gRPC QueryValidPaths on 'nix-store.geninf.io:50051' failed: error: substituter 'https://cache.clan.lol' is disabled
failed checks.x86_64-linux.machine-proxy01
  • Missing manifest.readme for clanService 'self/zero-monitoring'
  • Missing manifest.readme for clanService 'self/zero-internal-ca'
  • Missing manifest.readme for clanService 'self/zero-hetzner-proxy'
2m 12s
setup: don't know how to build these paths: /nix/store/4kj322xap8xbdn07r5micc7v0xmkl907-nixos-system-proxy01-26.11.20260923.4975466.drv warning: ignoring the …
setup:
don't know how to build these paths:
  /nix/store/4kj322xap8xbdn07r5micc7v0xmkl907-nixos-system-proxy01-26.11.20260923.4975466.drv
warning: ignoring the client-specified setting 'store', because it is a restricted setting and you are not a trusted user
error: gRPC QueryValidPaths on 'nix-store.geninf.io:50051' failed: error: unable to download 'https://cache.geninf.io/lcfypwf6qlk6fbiyd81zbg5i810x10vf.narinfo': HTTP error 503

              response body:

              <?xml version="1.0" encoding="UTF-8" standalone="yes"?>
              <Error>
                  <Code>SlowDown</Code>
                  <Message>Your account has made too many requests; try again later.</Message>
              </Error>
failed checks.x86_64-linux.machine-pubproxy01
  • Scripted initrd is deprecated and scheduled for removal in 26.11. See the NixOS 26.05 release notes.
  • Missing manifest.readme for clanService 'self/zero-monitoring'
  • Missing manifest.readme for clanService 'self/zero-matrix'
  • Missing manifest.readme for clanService 'self/zero-jitsi'
  • Missing manifest.readme for clanService 'self/zero-internal-ca'
  • Missing manifest.readme for clanService 'self/zero-idp'
32s
setup: /nix/store/nfpgv2vkhsijpnmllnz32ma76b96p31n-boot.json.drv /nix/store/qxai9ag16zy3dk8s4bww22zc2b77b0xn-nixos-system-pubproxy01-26.11.20260923.4975466. …
setup:
  /nix/store/nfpgv2vkhsijpnmllnz32ma76b96p31n-boot.json.drv
  /nix/store/qxai9ag16zy3dk8s4bww22zc2b77b0xn-nixos-system-pubproxy01-26.11.20260923.4975466.drv
these 3 paths will be fetched (0.0 KiB download, 74.5 MiB unpacked):
  /nix/store/ik3y3r7gx1sbjbc4aczk1gpr1bxra9vi-nginx.conf
  /nix/store/2jcp5pw35zl0lj6g40s7n648l5j1j0pv-trynixos-site
  /nix/store/aac6cb7xpwkgc8g87k9ia33qpa2kpbw8-unit-script-nginx-pre-start
warning: ignoring the client-specified setting 'store', because it is a restricted setting and you are not a trusted user
error: gRPC QueryValidPaths on 'nix-store.geninf.io:50051' failed: error: unable to download 'https://cache.geninf.io/dydscmhvizh4p5wmsk4hc7c9z2mr3il8.narinfo': HTTP error 503

              response body:

              <?xml version="1.0" encoding="UTF-8" standalone="yes"?>
              <Error>
                  <Code>SlowDown</Code>
                  <Message>Your account has made too many requests; try again later.</Message>
              </Error>
13 succeeded ⚠ 7
succeeded attributes
status attribute duration
succeeded checks.aarch64-linux.format
  • nixfmt-rfc-style is now the same as pkgs.nixfmt which should be used instead.
10s
succeeded checks.x86_64-linux.format
  • nixfmt-rfc-style is now the same as pkgs.nixfmt which should be used instead.
17s
succeeded checks.x86_64-linux.machine-dialogue01
  • Missing manifest.readme for clanService 'self/zero-monitoring'
  • Missing manifest.readme for clanService 'self/zero-internal-ca'
10m 58s
succeeded checks.x86_64-linux.machine-inference
  • Missing manifest.readme for clanService 'self/zero-monitoring'
  • Missing manifest.readme for clanService 'self/zero-internal-ca'
10m 40s
succeeded checks.x86_64-linux.machine-jvb-us01
  • Missing manifest.readme for clanService 'self/zero-monitoring'
  • Missing manifest.readme for clanService 'self/zero-jitsi'
  • Missing manifest.readme for clanService 'self/zero-internal-ca'
10m 56s
succeeded checks.x86_64-linux.machine-monitor01
  • Missing manifest.readme for clanService 'self/zero-stalwart'
  • Missing manifest.readme for clanService 'self/zero-monitoring'
  • Missing manifest.readme for clanService 'self/zero-matrix'
  • Missing manifest.readme for clanService 'self/zero-mailserver'
  • Missing manifest.readme for clanService 'self/zero-jitsi'
  • Missing manifest.readme for clanService 'self/zero-internal-ca'
  • Missing manifest.readme for clanService 'self/zero-calendar-bot'
10m 40s
succeeded checks.x86_64-linux.trynixos-minimal
  • Scripted initrd is deprecated and scheduled for removal in 26.11. See the NixOS 26.05 release notes.
0s
succeeded checks.aarch64-linux.agents-tests 7s
succeeded checks.aarch64-linux.autopilot-herdr-prompt 11s
succeeded checks.aarch64-linux.autopilot-run 11s
succeeded checks.aarch64-linux.clan-cli 1s
succeeded checks.x86_64-linux.agents-tests 6s
succeeded checks.x86_64-linux.clan-cli 2s
20 already built
skipped attributes
status attribute duration
loading…