nixbot

builds

zero/project-zero build #321 failed

branch main · PR #408 · commit 2d3620286a · · took 26m 35s · eval 8m 37s

12 failed ⚠ 4
failed attributes
status attribute duration
failed checks.x86_64-linux.machine-fabro01
  • Missing manifest.readme for clanService 'self/zero-monitoring'
  • Missing manifest.readme for clanService 'self/zero-internal-ca'
  • Missing manifest.readme for clanService 'self/zero-fabro'
  • Missing manifest.readme for clanService 'self/zero-covibe'
  • Missing manifest.readme for clanService 'self/zero-clanker'
  • Missing manifest.readme for clanService 'self/zero-agents'
  • deploy-main.service is ordered after 'network-online.target' but doesn't depend on it
  • directive-poll.service is ordered after 'network-online.target' but doesn't depend on it
  • drift-audit.service is ordered after 'network-online.target' but doesn't depend on it
  • flake-update.service is ordered after 'network-online.target' but doesn't depend on it
  • flake-update-poll.service is ordered after 'network-online.target' but doesn't depend on it
  • health-poll.service is ordered after 'network-online.target' but doesn't depend on it
  • The xorg package set has been deprecated, 'xorg.libX11' has been renamed to 'libx11'
  • The xorg package set has been deprecated, 'xorg.libXcomposite' has been renamed to 'libxcomposite'
  • The xorg package set has been deprecated, 'xorg.libXcursor' has been renamed to 'libxcursor'
  • The xorg package set has been deprecated, 'xorg.libXdamage' has been renamed to 'libxdamage'
  • The xorg package set has been deprecated, 'xorg.libXext' has been renamed to 'libxext'
  • The xorg package set has been deprecated, 'xorg.libXfixes' has been renamed to 'libxfixes'
  • The xorg package set has been deprecated, 'xorg.libXi' has been renamed to 'libxi'
  • The xorg package set has been deprecated, 'xorg.libXrandr' has been renamed to 'libxrandr'
  • The xorg package set has been deprecated, 'xorg.libXrender' has been renamed to 'libxrender'
  • The xorg package set has been deprecated, 'xorg.libXScrnSaver' has been renamed to 'libxscrnsaver'
  • The xorg package set has been deprecated, 'xorg.libxcb' has been renamed to 'libxcb'
  • The xorg package set has been deprecated, 'xorg.libXtst' has been renamed to 'libxtst'
1m 35s
setup: don't know how to build these paths: /nix/store/a7w20cj70qa0f1332v5gjgamj6xbzwla-nixos-system-fabro01-26.11.20260922.6774f7b.drv warning: ignoring the …
setup:
don't know how to build these paths:
  /nix/store/a7w20cj70qa0f1332v5gjgamj6xbzwla-nixos-system-fabro01-26.11.20260922.6774f7b.drv
warning: ignoring the client-specified setting 'store', because it is a restricted setting and you are not a trusted user
zjiqxnyhq9an8mkrw683c1khrfx05x12-unit-age-decrypt-secrets.service.drv: error: gRPC QueryValidPaths on 'nix-store.geninf.io:50051' failed: error: unable to download 'https://cache.clan.lol/zjiqxnyhq9an8mkrw683c1khrfx05x12.narinfo': HTTP error 503

              response body:

              <?xml version="1.0" encoding="UTF-8" standalone="yes"?>
              <Error>
                  <Code>SlowDown</Code>
                  <Message>Your account has made too many requests; try again later.</Message>
              </Error>
arwswaghp9647xxyz055yr2i0vw35a7d-root-authorized_keys.drv: build-x86-01: not scheduled here: arwswaghp9647xxyz055yr2i0vw35a7d-root-authorized_keys.drv, asking the scheduler again
error: dependency 'wdpgnp7pp3cr8n3c21lla5sd1c8vnq8j-etc.drv' failed
failed checks.x86_64-linux.machine-ipfs01
  • Missing manifest.readme for clanService 'self/zero-monitoring'
  • Missing manifest.readme for clanService 'self/zero-internal-ca'
1m 35s
setup: don't know how to build these paths: /nix/store/h93280p4sy84z0jm8yr98m8h1z0zf64p-nixos-system-ipfs01-26.11.20260922.6774f7b.drv warning: ignoring the c …
setup:
don't know how to build these paths:
  /nix/store/h93280p4sy84z0jm8yr98m8h1z0zf64p-nixos-system-ipfs01-26.11.20260922.6774f7b.drv
warning: ignoring the client-specified setting 'store', because it is a restricted setting and you are not a trusted user
ycqr8xpm5rm409px0bm05lpz7wwcnfwl-unit-age-decrypt-secrets.service.drv: error: gRPC QueryValidPaths on 'nix-store.geninf.io:50051' failed: error: unable to download 'https://cache.clan.lol/ycqr8xpm5rm409px0bm05lpz7wwcnfwl.narinfo': HTTP error 503

              response body:

              <?xml version="1.0" encoding="UTF-8" standalone="yes"?>
              <Error>
                  <Code>SlowDown</Code>
                  <Message>Your account has made too many requests; try again later.</Message>
              </Error>
arwswaghp9647xxyz055yr2i0vw35a7d-root-authorized_keys.drv: build-x86-01: not scheduled here: arwswaghp9647xxyz055yr2i0vw35a7d-root-authorized_keys.drv, asking the scheduler again
error: dependency '9yywnjsdzz7ia89i3j88963ac6wkggx0-etc.drv' failed
failed checks.x86_64-linux.machine-monitor01
  • Missing manifest.readme for clanService 'self/zero-stalwart'
  • Missing manifest.readme for clanService 'self/zero-monitoring'
  • Missing manifest.readme for clanService 'self/zero-matrix'
  • Missing manifest.readme for clanService 'self/zero-mailserver'
  • Missing manifest.readme for clanService 'self/zero-jitsi'
  • Missing manifest.readme for clanService 'self/zero-internal-ca'
  • Missing manifest.readme for clanService 'self/zero-calendar-bot'
1m 25s
setup: don't know how to build these paths: /nix/store/dy1yz2azv9l9c46bxwrx33xbg26rvarz-nixos-system-monitor01-26.11.20260922.6774f7b.drv warning: ignoring th …
setup:
don't know how to build these paths:
  /nix/store/dy1yz2azv9l9c46bxwrx33xbg26rvarz-nixos-system-monitor01-26.11.20260922.6774f7b.drv
warning: ignoring the client-specified setting 'store', because it is a restricted setting and you are not a trusted user
error: gRPC QueryValidPaths on 'nix-store.geninf.io:50051' failed: error: unable to download 'https://cache.geninf.io/g6lbp0rlw7r2hpc6fr6db3l54958ww04.narinfo': HTTP error 503

              response body:

              <?xml version="1.0" encoding="UTF-8" standalone="yes"?>
              <Error>
                  <Code>SlowDown</Code>
                  <Message>Your account has made too many requests; try again later.</Message>
              </Error>
failed checks.x86_64-linux.machine-proxy01
  • Missing manifest.readme for clanService 'self/zero-monitoring'
  • Missing manifest.readme for clanService 'self/zero-internal-ca'
  • Missing manifest.readme for clanService 'self/zero-hetzner-proxy'
1m 28s
setup: don't know how to build these paths: /nix/store/p2z32j0fr1ldsnk0b1abp4mbf2hc7p54-nixos-system-proxy01-26.11.20260922.6774f7b.drv warning: ignoring the …
setup:
don't know how to build these paths:
  /nix/store/p2z32j0fr1ldsnk0b1abp4mbf2hc7p54-nixos-system-proxy01-26.11.20260922.6774f7b.drv
warning: ignoring the client-specified setting 'store', because it is a restricted setting and you are not a trusted user
n9l9hf8z08n2gikq59wi51df2r6nxnjv-unit-age-decrypt-secrets.service.drv: error: gRPC QueryValidPaths on 'nix-store.geninf.io:50051' failed: error: unable to download 'https://cache.clan.lol/n9l9hf8z08n2gikq59wi51df2r6nxnjv.narinfo': HTTP error 503

              response body:

              <?xml version="1.0" encoding="UTF-8" standalone="yes"?>
              <Error>
                  <Code>SlowDown</Code>
                  <Message>Your account has made too many requests; try again later.</Message>
              </Error>
q2aysnn6b4xlgrb9kdqdgvbi5054xzn7-etc-ssh-ssh_known_hosts.drv: build-x86-01: not scheduled here: q2aysnn6b4xlgrb9kdqdgvbi5054xzn7-etc-ssh-ssh_known_hosts.drv, asking the scheduler again
arwswaghp9647xxyz055yr2i0vw35a7d-root-authorized_keys.drv: build-x86-01: not scheduled here: arwswaghp9647xxyz055yr2i0vw35a7d-root-authorized_keys.drv, asking the scheduler again
error: dependency 'f17vr6nhgcahny4gg7mgis21lhxllvf4-etc.drv' failed
failed checks.aarch64-darwin.autopilot-herdr-prompt 9m 24s
setup: /nix/store/jqxhgcps9gsyrvhpl68r3zccyvs26fvq-zlib-1.3.2-dev /nix/store/6lxilazl9wndzj1p4d9v915rxmdrq5kq-zlib-1.3.2-static /nix/store/4587dyc5sizbhsx …
setup:
  /nix/store/jqxhgcps9gsyrvhpl68r3zccyvs26fvq-zlib-1.3.2-dev
  /nix/store/6lxilazl9wndzj1p4d9v915rxmdrq5kq-zlib-1.3.2-static
  /nix/store/4587dyc5sizbhsx8wl7r8kxgaprrwm5c-zlib-ng-2.3.3
  /nix/store/6l30l0dgk1vscbvbrbg4nj6889c74ci1-zstd-1.5.7
  /nix/store/1ak7kh6gxirfpwj19n4pz7qcyvs8x8ii-zstd-1.5.7-bin
  /nix/store/dspjlswq96vlaqqxrx9giajgcqs0b785-zstd-1.5.7-dev
warning: ignoring the client-specified setting 'store', because it is a restricted setting and you are not a trusted user
error: dependency 'g8b94yfjgx27yg4pkzcyjgn4zqbiqwhh-herdr-0.9.1.drv' failed
failed checks.aarch64-darwin.autopilot-run 11m 4s
setup: n9n5dkyf02mgdfh9bylrz5iz7chji44y-bun-pkg--opentelemetry-core-2.9.0.drv: build04: not scheduled here: n9n5dkyf02mgdfh9bylrz5iz7chji44y-bun-pkg--openteleme …
setup:
n9n5dkyf02mgdfh9bylrz5iz7chji44y-bun-pkg--opentelemetry-core-2.9.0.drv: build04: not scheduled here: n9n5dkyf02mgdfh9bylrz5iz7chji44y-bun-pkg--opentelemetry-core-2.9.0.drv, asking the scheduler again
ndy5xh64d46srsgwfmsj7grb5wyzic21-bun-pkg--napi-rs-wasm-tools-win32-arm64-msvc-1.1.0.drv: build04: not scheduled here: ndy5xh64d46srsgwfmsj7grb5wyzic21-bun-pkg--napi-rs-wasm-tools-win32-arm64-msvc-1.1.0.drv, asking the scheduler again
ngpx5smwa897ly73blrmwri8v6rm410b-bun-pkg-json-stringify-safe-5.0.1.drv: build04: not scheduled here: ngpx5smwa897ly73blrmwri8v6rm410b-bun-pkg-json-stringify-safe-5.0.1.drv, asking the scheduler again
nkkhzaq5hsz5s7vyg8l5x9lkfz3w8isz-bun-pkg--bufbuild-protobuf-2.15.0.drv: build04: not scheduled here: nkkhzaq5hsz5s7vyg8l5x9lkfz3w8isz-bun-pkg--bufbuild-protobuf-2.15.0.drv, asking the scheduler again
nm0n7p1l55z29jd2vj2xyx6jdqg9nbrn-bun-pkg-sherpa-onnx-1.13.2.drv: build04: not scheduled here: nm0n7p1l55z29jd2vj2xyx6jdqg9nbrn-bun-pkg-sherpa-onnx-1.13.2.drv, asking the scheduler again
nrl9l8ngi1wv6r92prla4jrlgmh3sjpd-bun-pkg--ark-schema-0.56.2.drv: build04: not scheduled here: nrl9l8ngi1wv6r92prla4jrlgmh3sjpd-bun-pkg--ark-schema-0.56.2.drv, asking the scheduler again
nw8ibjblhysfrkzc722jdifxgrvsq3ac-bun-pkg--opentelemetry-sdk-trace-node-2.11.0.drv: build04: not scheduled here: nw8ibjblhysfrkzc722jdifxgrvsq3ac-bun-pkg--opentelemetry-sdk-trace-node-2.11.0.drv, asking the scheduler again
error: dependency 'g8b94yfjgx27yg4pkzcyjgn4zqbiqwhh-herdr-0.9.1.drv' failed
failed checks.aarch64-darwin.calendar 13s
calendar-0.1.0: project-zero/calendar.TestHome.func1(0x1f1fcfaf2d88) /nix/var/nix/builds/nix-45771-3562534512/calendar/caldav_test.go:95 +0xac testing.tRunner( …
calendar-0.1.0:
project-zero/calendar.TestHome.func1(0x1f1fcfaf2d88)
	/nix/var/nix/builds/nix-45771-3562534512/calendar/caldav_test.go:95 +0xac
testing.tRunner(0x1f1fcfaf2d88, 0x1f1fcfa86410)
	/nix/store/ynhaddwnkhvlr6qn7scbrj1515k52gnw-go-1.26.7/share/go/src/testing/testing.go:2036 +0xc4
created by testing.(*T).Run in goroutine 24
	/nix/store/ynhaddwnkhvlr6qn7scbrj1515k52gnw-go-1.26.7/share/go/src/testing/testing.go:2101 +0x3a8
FAIL	project-zero/calendar	0.167s
FAIL
failed checks.aarch64-darwin.clanker 1m 27s
clanker-0.1.0: build02: building m1lhfdn8hz6png6al3saxpx3aphg5m18-clanker-0.1.0.drv unpacking source archive /nix/store/gcwxx0y06vdmhiq4f6lh352g99qzvkri-clanker …
clanker-0.1.0:
build02: building m1lhfdn8hz6png6al3saxpx3aphg5m18-clanker-0.1.0.drv
unpacking source archive /nix/store/gcwxx0y06vdmhiq4f6lh352g99qzvkri-clanker
source root is clanker
Building subPackage .
# project-zero/clanker
./runner.go:173:11: undefined: syscall.SYS_PRCTL
./runner.go:183:11: undefined: syscall.SYS_PRCTL
failed checks.aarch64-darwin.deploy-trigger 1m 24s
deploy-trigger-0.1.0: project-zero/deploy-trigger.TestValidTriggerStartsTheDeployOnce(0x5326e6b8488) /nix/var/nix/builds/nix-46668-2898895075/deploy-trigger/ma …
deploy-trigger-0.1.0:
project-zero/deploy-trigger.TestValidTriggerStartsTheDeployOnce(0x5326e6b8488)
	/nix/var/nix/builds/nix-46668-2898895075/deploy-trigger/main_test.go:37 +0x24
testing.tRunner(0x5326e6b8488, 0x104766610)
	/nix/store/ynhaddwnkhvlr6qn7scbrj1515k52gnw-go-1.26.7/share/go/src/testing/testing.go:2036 +0xc4
created by testing.(*T).Run in goroutine 1
	/nix/store/ynhaddwnkhvlr6qn7scbrj1515k52gnw-go-1.26.7/share/go/src/testing/testing.go:2101 +0x3a8
FAIL	project-zero/deploy-trigger	0.442s
FAIL
failed checks.aarch64-darwin.hetzner-proxy 16s
hetzner-proxy-0.1.0: project-zero/hetzner-proxy.TestProxyEndToEnd(0x391c061f6d88) /nix/var/nix/builds/nix-62068-935733636/hetzner-proxy/proxy_test.go:13 +0x9c …
hetzner-proxy-0.1.0:
project-zero/hetzner-proxy.TestProxyEndToEnd(0x391c061f6d88)
	/nix/var/nix/builds/nix-62068-935733636/hetzner-proxy/proxy_test.go:13 +0x9c
testing.tRunner(0x391c061f6d88, 0x104cd6b60)
	/nix/store/ynhaddwnkhvlr6qn7scbrj1515k52gnw-go-1.26.7/share/go/src/testing/testing.go:2036 +0xc4
created by testing.(*T).Run in goroutine 1
	/nix/store/ynhaddwnkhvlr6qn7scbrj1515k52gnw-go-1.26.7/share/go/src/testing/testing.go:2101 +0x3a8
FAIL	project-zero/hetzner-proxy	0.171s
FAIL
failed checks.aarch64-darwin.workon 2m 41s
setup: don't know how to build these paths: /nix/store/svx0yq823vpgs8ld0p4gnpfi7d78ypn9-workon-check.drv warning: ignoring the client-specified setting 'store …
setup:
don't know how to build these paths:
  /nix/store/svx0yq823vpgs8ld0p4gnpfi7d78ypn9-workon-check.drv
warning: ignoring the client-specified setting 'store', because it is a restricted setting and you are not a trusted user
error: dependency 'g8b94yfjgx27yg4pkzcyjgn4zqbiqwhh-herdr-0.9.1.drv' failed
failed checks.aarch64-darwin.workon-guard 2m 41s
setup: don't know how to build these paths: /nix/store/d2lv1j6631qwz667znh70jhvf4yx1agh-workon-guard-check.drv warning: ignoring the client-specified setting …
setup:
don't know how to build these paths:
  /nix/store/d2lv1j6631qwz667znh70jhvf4yx1agh-workon-guard-check.drv
warning: ignoring the client-specified setting 'store', because it is a restricted setting and you are not a trusted user
error: dependency 'g8b94yfjgx27yg4pkzcyjgn4zqbiqwhh-herdr-0.9.1.drv' failed
40 succeeded ⚠ 9
succeeded attributes
status attribute duration
succeeded checks.aarch64-darwin.format
  • nixfmt-rfc-style is now the same as pkgs.nixfmt which should be used instead.
1m 24s
succeeded checks.aarch64-linux.format
  • nixfmt-rfc-style is now the same as pkgs.nixfmt which should be used instead.
1m 39s
succeeded checks.aarch64-linux.machine-builder01
  • Missing manifest.readme for clanService 'self/zero-monitoring'
  • Missing manifest.readme for clanService 'self/zero-internal-ca'
23m 12s
succeeded checks.x86_64-linux.format
  • nixfmt-rfc-style is now the same as pkgs.nixfmt which should be used instead.
36s
succeeded checks.x86_64-linux.machine-dialogue01
  • Missing manifest.readme for clanService 'self/zero-monitoring'
  • Missing manifest.readme for clanService 'self/zero-internal-ca'
11m 51s
succeeded checks.x86_64-linux.machine-inference
  • Missing manifest.readme for clanService 'self/zero-monitoring'
  • Missing manifest.readme for clanService 'self/zero-internal-ca'
9m 46s
succeeded checks.x86_64-linux.machine-jvb-us01
  • Missing manifest.readme for clanService 'self/zero-monitoring'
  • Missing manifest.readme for clanService 'self/zero-jitsi'
  • Missing manifest.readme for clanService 'self/zero-internal-ca'
7m 28s
succeeded checks.x86_64-linux.machine-pubproxy01
  • Scripted initrd is deprecated and scheduled for removal in 26.11. See the NixOS 26.05 release notes.
  • Missing manifest.readme for clanService 'self/zero-monitoring'
  • Missing manifest.readme for clanService 'self/zero-matrix'
  • Missing manifest.readme for clanService 'self/zero-jitsi'
  • Missing manifest.readme for clanService 'self/zero-internal-ca'
  • Missing manifest.readme for clanService 'self/zero-idp'
10m 21s
succeeded checks.x86_64-linux.trynixos-minimal
  • Scripted initrd is deprecated and scheduled for removal in 26.11. See the NixOS 26.05 release notes.
14s
succeeded checks.aarch64-darwin.agents-tests 5s
succeeded checks.aarch64-darwin.clan-cli 1m 38s
succeeded checks.aarch64-darwin.fabro 8m 14s
succeeded checks.aarch64-darwin.shared-checkout-barrier 1m 11s
succeeded checks.aarch64-darwin.vars 3s
succeeded checks.aarch64-linux.agents-tests 1m 10s
succeeded checks.aarch64-linux.autopilot-herdr-prompt 26m 34s
succeeded checks.aarch64-linux.autopilot-run 26m 27s
succeeded checks.aarch64-linux.calendar 4s
succeeded checks.aarch64-linux.clan-cli 1m 53s
succeeded checks.aarch64-linux.clanker 1m 50s
succeeded checks.aarch64-linux.deploy-trigger 1m 9s
succeeded checks.aarch64-linux.fabro 9m 38s
succeeded checks.aarch64-linux.hetzner-proxy 1m 37s
succeeded checks.aarch64-linux.shared-checkout-barrier 1m 38s
succeeded checks.aarch64-linux.vars 6s
succeeded checks.aarch64-linux.workon 19m 12s
succeeded checks.aarch64-linux.workon-guard 19m 38s
succeeded checks.x86_64-linux.agents-tests 1m 19s
succeeded checks.x86_64-linux.autopilot-herdr-prompt 29s
succeeded checks.x86_64-linux.autopilot-run 5s
succeeded checks.x86_64-linux.calendar 0s
succeeded checks.x86_64-linux.clan-cli 52s
succeeded checks.x86_64-linux.clanker 7s
succeeded checks.x86_64-linux.deploy-trigger 1s
succeeded checks.x86_64-linux.fabro 6s
succeeded checks.x86_64-linux.hetzner-proxy 55s
succeeded checks.x86_64-linux.shared-checkout-barrier 1s
succeeded checks.x86_64-linux.vars 2s
succeeded checks.x86_64-linux.workon 1s
succeeded checks.x86_64-linux.workon-guard 3s