zero/project-zero build #317 failed ← #316 #318 →
eval warnings
33 kinds
· 55 occurrences
- warn nixfmt-rfc-style is now the same as pkgs.nixfmt which should be used instead. ×3
- warn Missing manifest.readme for clanService 'self/zero-monitoring' ×9
- warn Missing manifest.readme for clanService 'self/zero-internal-ca' ×9
- warn Missing manifest.readme for clanService 'self/zero-jitsi' ×3
- warn Scripted initrd is deprecated and scheduled for removal in 26.11. See the NixOS 26.05 release notes. ×2
- warn Missing manifest.readme for clanService 'self/zero-hetzner-proxy' ×1
- warn Missing manifest.readme for clanService 'self/zero-stalwart' ×1
- warn Missing manifest.readme for clanService 'self/zero-matrix' ×2
- warn Missing manifest.readme for clanService 'self/zero-mailserver' ×1
- warn Missing manifest.readme for clanService 'self/zero-calendar-bot' ×1
- warn Missing manifest.readme for clanService 'self/zero-fabro' ×1
- warn Missing manifest.readme for clanService 'self/zero-covibe' ×1
- warn Missing manifest.readme for clanService 'self/zero-clanker' ×1
- warn Missing manifest.readme for clanService 'self/zero-agents' ×1
- warn deploy-main.service is ordered after 'network-online.target' but doesn't depend on it ×1
- warn directive-poll.service is ordered after 'network-online.target' but doesn't depend on it ×1
- warn drift-audit.service is ordered after 'network-online.target' but doesn't depend on it ×1
- warn flake-update.service is ordered after 'network-online.target' but doesn't depend on it ×1
- warn flake-update-poll.service is ordered after 'network-online.target' but doesn't depend on it ×1
- warn health-poll.service is ordered after 'network-online.target' but doesn't depend on it ×1
- warn The xorg package set has been deprecated, 'xorg.libX11' has been renamed to 'libx11' ×1
- warn The xorg package set has been deprecated, 'xorg.libXcomposite' has been renamed to 'libxcomposite' ×1
- warn The xorg package set has been deprecated, 'xorg.libXcursor' has been renamed to 'libxcursor' ×1
- warn The xorg package set has been deprecated, 'xorg.libXdamage' has been renamed to 'libxdamage' ×1
- warn The xorg package set has been deprecated, 'xorg.libXext' has been renamed to 'libxext' ×1
- warn The xorg package set has been deprecated, 'xorg.libXfixes' has been renamed to 'libxfixes' ×1
- warn The xorg package set has been deprecated, 'xorg.libXi' has been renamed to 'libxi' ×1
- warn The xorg package set has been deprecated, 'xorg.libXrandr' has been renamed to 'libxrandr' ×1
- warn The xorg package set has been deprecated, 'xorg.libXrender' has been renamed to 'libxrender' ×1
- warn The xorg package set has been deprecated, 'xorg.libXScrnSaver' has been renamed to 'libxscrnsaver' ×1
- warn The xorg package set has been deprecated, 'xorg.libxcb' has been renamed to 'libxcb' ×1
- warn The xorg package set has been deprecated, 'xorg.libXtst' has been renamed to 'libxtst' ×1
- warn Missing manifest.readme for clanService 'self/zero-idp' ×1
39 failed ⚠ 12
| status | attribute | duration |
|---|---|---|
checks.aarch64-darwin.format
|
0s | |
setup: error: gRPC QueryMissing on 'nix-store.geninf.io:50051' failed: no access rule matches 'oidc:nixbot:repo:gitea:zero/project-zero:pull_request'setup: error: gRPC QueryMissing on 'nix-store.geninf.io:50051' failed: no access rule matches 'oidc:nixbot:repo:gitea:zero/project-zero:pull_request' |
||
checks.aarch64-linux.format
|
0s | |
setup: error: gRPC QueryMissing on 'nix-store.geninf.io:50051' failed: no access rule matches 'oidc:nixbot:repo:gitea:zero/project-zero:pull_request'setup: error: gRPC QueryMissing on 'nix-store.geninf.io:50051' failed: no access rule matches 'oidc:nixbot:repo:gitea:zero/project-zero:pull_request' |
||
checks.aarch64-linux.machine-builder01
|
0s | |
setup: error: gRPC QueryMissing on 'nix-store.geninf.io:50051' failed: no access rule matches 'oidc:nixbot:repo:gitea:zero/project-zero:pull_request'setup: error: gRPC QueryMissing on 'nix-store.geninf.io:50051' failed: no access rule matches 'oidc:nixbot:repo:gitea:zero/project-zero:pull_request' |
||
checks.x86_64-linux.format
|
0s | |
setup: error: gRPC QueryMissing on 'nix-store.geninf.io:50051' failed: no access rule matches 'oidc:nixbot:repo:gitea:zero/project-zero:pull_request'setup: error: gRPC QueryMissing on 'nix-store.geninf.io:50051' failed: no access rule matches 'oidc:nixbot:repo:gitea:zero/project-zero:pull_request' |
||
checks.x86_64-linux.machine-dialogue01
|
0s | |
setup: error: gRPC QueryMissing on 'nix-store.geninf.io:50051' failed: no access rule matches 'oidc:nixbot:repo:gitea:zero/project-zero:pull_request'setup: error: gRPC QueryMissing on 'nix-store.geninf.io:50051' failed: no access rule matches 'oidc:nixbot:repo:gitea:zero/project-zero:pull_request' |
||
checks.x86_64-linux.machine-fabro01
|
0s | |
setup: error: gRPC QueryMissing on 'nix-store.geninf.io:50051' failed: no access rule matches 'oidc:nixbot:repo:gitea:zero/project-zero:pull_request'setup: error: gRPC QueryMissing on 'nix-store.geninf.io:50051' failed: no access rule matches 'oidc:nixbot:repo:gitea:zero/project-zero:pull_request' |
||
checks.x86_64-linux.machine-inference
|
0s | |
setup: error: gRPC QueryMissing on 'nix-store.geninf.io:50051' failed: no access rule matches 'oidc:nixbot:repo:gitea:zero/project-zero:pull_request'setup: error: gRPC QueryMissing on 'nix-store.geninf.io:50051' failed: no access rule matches 'oidc:nixbot:repo:gitea:zero/project-zero:pull_request' |
||
checks.x86_64-linux.machine-ipfs01
|
0s | |
setup: error: gRPC QueryMissing on 'nix-store.geninf.io:50051' failed: no access rule matches 'oidc:nixbot:repo:gitea:zero/project-zero:pull_request'setup: error: gRPC QueryMissing on 'nix-store.geninf.io:50051' failed: no access rule matches 'oidc:nixbot:repo:gitea:zero/project-zero:pull_request' |
||
checks.x86_64-linux.machine-jvb-us01
|
0s | |
setup: error: gRPC QueryMissing on 'nix-store.geninf.io:50051' failed: no access rule matches 'oidc:nixbot:repo:gitea:zero/project-zero:pull_request'setup: error: gRPC QueryMissing on 'nix-store.geninf.io:50051' failed: no access rule matches 'oidc:nixbot:repo:gitea:zero/project-zero:pull_request' |
||
checks.x86_64-linux.machine-monitor01
|
0s | |
setup: error: gRPC QueryMissing on 'nix-store.geninf.io:50051' failed: no access rule matches 'oidc:nixbot:repo:gitea:zero/project-zero:pull_request'setup: error: gRPC QueryMissing on 'nix-store.geninf.io:50051' failed: no access rule matches 'oidc:nixbot:repo:gitea:zero/project-zero:pull_request' |
||
checks.x86_64-linux.machine-proxy01
|
0s | |
setup: error: gRPC QueryMissing on 'nix-store.geninf.io:50051' failed: no access rule matches 'oidc:nixbot:repo:gitea:zero/project-zero:pull_request'setup: error: gRPC QueryMissing on 'nix-store.geninf.io:50051' failed: no access rule matches 'oidc:nixbot:repo:gitea:zero/project-zero:pull_request' |
||
checks.x86_64-linux.machine-pubproxy01
|
0s | |
setup: error: gRPC QueryMissing on 'nix-store.geninf.io:50051' failed: no access rule matches 'oidc:nixbot:repo:gitea:zero/project-zero:pull_request'setup: error: gRPC QueryMissing on 'nix-store.geninf.io:50051' failed: no access rule matches 'oidc:nixbot:repo:gitea:zero/project-zero:pull_request' |
||
checks.aarch64-darwin.agents-tests
|
0s | |
setup: error: gRPC QueryMissing on 'nix-store.geninf.io:50051' failed: no access rule matches 'oidc:nixbot:repo:gitea:zero/project-zero:pull_request'setup: error: gRPC QueryMissing on 'nix-store.geninf.io:50051' failed: no access rule matches 'oidc:nixbot:repo:gitea:zero/project-zero:pull_request' |
||
checks.aarch64-darwin.autopilot-herdr-prompt
|
— | |
skipped due to cached failure, first failed at 2026-09-24 07:06:29.315898+00:00: https://ci.geninf.io/repos/gitea/zero/project-zero/builds/314skipped due to cached failure, first failed at 2026-09-24 07:06:29.315898+00:00: https://ci.geninf.io/repos/gitea/zero/project-zero/builds/314 |
||
checks.aarch64-darwin.autopilot-run
|
— | |
skipped due to cached failure, first failed at 2026-09-24 07:06:29.315211+00:00: https://ci.geninf.io/repos/gitea/zero/project-zero/builds/314skipped due to cached failure, first failed at 2026-09-24 07:06:29.315211+00:00: https://ci.geninf.io/repos/gitea/zero/project-zero/builds/314 |
||
checks.aarch64-darwin.calendar
|
— | |
skipped due to cached failure, first failed at 2026-09-24 05:06:11.444697+00:00: https://ci.geninf.io/repos/gitea/zero/project-zero/builds/313skipped due to cached failure, first failed at 2026-09-24 05:06:11.444697+00:00: https://ci.geninf.io/repos/gitea/zero/project-zero/builds/313 |
||
checks.aarch64-darwin.clan-cli
|
— | |
skipped due to cached failure, first failed at 2026-09-24 06:57:59.944277+00:00: https://ci.geninf.io/repos/gitea/zero/project-zero/builds/314skipped due to cached failure, first failed at 2026-09-24 06:57:59.944277+00:00: https://ci.geninf.io/repos/gitea/zero/project-zero/builds/314 |
||
checks.aarch64-darwin.clanker
|
— | |
skipped due to cached failure, first failed at 2026-09-24 05:06:11.469171+00:00: https://ci.geninf.io/repos/gitea/zero/project-zero/builds/313skipped due to cached failure, first failed at 2026-09-24 05:06:11.469171+00:00: https://ci.geninf.io/repos/gitea/zero/project-zero/builds/313 |
||
checks.aarch64-darwin.deploy-trigger
|
— | |
skipped due to cached failure, first failed at 2026-09-24 05:06:11.488646+00:00: https://ci.geninf.io/repos/gitea/zero/project-zero/builds/313skipped due to cached failure, first failed at 2026-09-24 05:06:11.488646+00:00: https://ci.geninf.io/repos/gitea/zero/project-zero/builds/313 |
||
checks.aarch64-darwin.fabro
|
— | |
skipped due to cached failure, first failed at 2026-09-24 05:07:28.312186+00:00: https://ci.geninf.io/repos/gitea/zero/project-zero/builds/313skipped due to cached failure, first failed at 2026-09-24 05:07:28.312186+00:00: https://ci.geninf.io/repos/gitea/zero/project-zero/builds/313 |
||
checks.aarch64-darwin.hetzner-proxy
|
— | |
skipped due to cached failure, first failed at 2026-09-24 05:06:11.487631+00:00: https://ci.geninf.io/repos/gitea/zero/project-zero/builds/313skipped due to cached failure, first failed at 2026-09-24 05:06:11.487631+00:00: https://ci.geninf.io/repos/gitea/zero/project-zero/builds/313 |
||
checks.aarch64-darwin.shared-checkout-barrier
|
— | |
skipped due to cached failure, first failed at 2026-09-24 05:07:28.351758+00:00: https://ci.geninf.io/repos/gitea/zero/project-zero/builds/313skipped due to cached failure, first failed at 2026-09-24 05:07:28.351758+00:00: https://ci.geninf.io/repos/gitea/zero/project-zero/builds/313 |
||
checks.aarch64-darwin.vars
|
— | |
skipped due to cached failure, first failed at 2026-09-24 05:06:11.444027+00:00: https://ci.geninf.io/repos/gitea/zero/project-zero/builds/313skipped due to cached failure, first failed at 2026-09-24 05:06:11.444027+00:00: https://ci.geninf.io/repos/gitea/zero/project-zero/builds/313 |
||
checks.aarch64-darwin.workon
|
— | |
skipped due to cached failure, first failed at 2026-09-24 05:19:02.123364+00:00: https://ci.geninf.io/repos/gitea/zero/project-zero/builds/313skipped due to cached failure, first failed at 2026-09-24 05:19:02.123364+00:00: https://ci.geninf.io/repos/gitea/zero/project-zero/builds/313 |
||
checks.aarch64-darwin.workon-guard
|
— | |
skipped due to cached failure, first failed at 2026-09-24 05:19:02.126496+00:00: https://ci.geninf.io/repos/gitea/zero/project-zero/builds/313skipped due to cached failure, first failed at 2026-09-24 05:19:02.126496+00:00: https://ci.geninf.io/repos/gitea/zero/project-zero/builds/313 |
||
checks.aarch64-linux.agents-tests
|
0s | |
setup: error: gRPC QueryMissing on 'nix-store.geninf.io:50051' failed: no access rule matches 'oidc:nixbot:repo:gitea:zero/project-zero:pull_request'setup: error: gRPC QueryMissing on 'nix-store.geninf.io:50051' failed: no access rule matches 'oidc:nixbot:repo:gitea:zero/project-zero:pull_request' |
||
checks.aarch64-linux.autopilot-herdr-prompt
|
— | |
skipped due to cached failure, first failed at 2026-09-24 07:06:29.245857+00:00: https://ci.geninf.io/repos/gitea/zero/project-zero/builds/314skipped due to cached failure, first failed at 2026-09-24 07:06:29.245857+00:00: https://ci.geninf.io/repos/gitea/zero/project-zero/builds/314 |
||
checks.aarch64-linux.autopilot-run
|
— | |
skipped due to cached failure, first failed at 2026-09-24 07:06:29.238342+00:00: https://ci.geninf.io/repos/gitea/zero/project-zero/builds/314skipped due to cached failure, first failed at 2026-09-24 07:06:29.238342+00:00: https://ci.geninf.io/repos/gitea/zero/project-zero/builds/314 |
||
checks.aarch64-linux.calendar
|
— | |
skipped due to cached failure, first failed at 2026-09-24 05:06:11.448337+00:00: https://ci.geninf.io/repos/gitea/zero/project-zero/builds/313skipped due to cached failure, first failed at 2026-09-24 05:06:11.448337+00:00: https://ci.geninf.io/repos/gitea/zero/project-zero/builds/313 |
||
checks.aarch64-linux.clan-cli
|
— | |
skipped due to cached failure, first failed at 2026-09-24 06:56:48.977892+00:00: https://ci.geninf.io/repos/gitea/zero/project-zero/builds/314skipped due to cached failure, first failed at 2026-09-24 06:56:48.977892+00:00: https://ci.geninf.io/repos/gitea/zero/project-zero/builds/314 |
||
checks.aarch64-linux.clanker
|
— | |
skipped due to cached failure, first failed at 2026-09-24 05:06:11.457850+00:00: https://ci.geninf.io/repos/gitea/zero/project-zero/builds/313skipped due to cached failure, first failed at 2026-09-24 05:06:11.457850+00:00: https://ci.geninf.io/repos/gitea/zero/project-zero/builds/313 |
||
checks.aarch64-linux.deploy-trigger
|
— | |
skipped due to cached failure, first failed at 2026-09-24 05:06:11.494701+00:00: https://ci.geninf.io/repos/gitea/zero/project-zero/builds/313skipped due to cached failure, first failed at 2026-09-24 05:06:11.494701+00:00: https://ci.geninf.io/repos/gitea/zero/project-zero/builds/313 |
||
checks.aarch64-linux.fabro
|
— | |
skipped due to cached failure, first failed at 2026-09-24 05:06:11.431711+00:00: https://ci.geninf.io/repos/gitea/zero/project-zero/builds/313skipped due to cached failure, first failed at 2026-09-24 05:06:11.431711+00:00: https://ci.geninf.io/repos/gitea/zero/project-zero/builds/313 |
||
checks.aarch64-linux.hetzner-proxy
|
— | |
skipped due to cached failure, first failed at 2026-09-24 05:06:11.484489+00:00: https://ci.geninf.io/repos/gitea/zero/project-zero/builds/313skipped due to cached failure, first failed at 2026-09-24 05:06:11.484489+00:00: https://ci.geninf.io/repos/gitea/zero/project-zero/builds/313 |
||
checks.aarch64-linux.shared-checkout-barrier
|
— | |
skipped due to cached failure, first failed at 2026-09-24 05:07:28.355878+00:00: https://ci.geninf.io/repos/gitea/zero/project-zero/builds/313skipped due to cached failure, first failed at 2026-09-24 05:07:28.355878+00:00: https://ci.geninf.io/repos/gitea/zero/project-zero/builds/313 |
||
checks.aarch64-linux.vars
|
— | |
skipped due to cached failure, first failed at 2026-09-24 05:05:34.114943+00:00: https://ci.geninf.io/repos/gitea/zero/project-zero/builds/313skipped due to cached failure, first failed at 2026-09-24 05:05:34.114943+00:00: https://ci.geninf.io/repos/gitea/zero/project-zero/builds/313 |
||
checks.aarch64-linux.workon
|
— | |
skipped due to cached failure, first failed at 2026-09-24 05:07:28.257479+00:00: https://ci.geninf.io/repos/gitea/zero/project-zero/builds/313skipped due to cached failure, first failed at 2026-09-24 05:07:28.257479+00:00: https://ci.geninf.io/repos/gitea/zero/project-zero/builds/313 |
||
checks.aarch64-linux.workon-guard
|
— | |
skipped due to cached failure, first failed at 2026-09-24 05:07:28.245379+00:00: https://ci.geninf.io/repos/gitea/zero/project-zero/builds/313skipped due to cached failure, first failed at 2026-09-24 05:07:28.245379+00:00: https://ci.geninf.io/repos/gitea/zero/project-zero/builds/313 |
||
checks.x86_64-linux.agents-tests
|
0s | |
setup: error: gRPC QueryMissing on 'nix-store.geninf.io:50051' failed: no access rule matches 'oidc:nixbot:repo:gitea:zero/project-zero:pull_request'setup: error: gRPC QueryMissing on 'nix-store.geninf.io:50051' failed: no access rule matches 'oidc:nixbot:repo:gitea:zero/project-zero:pull_request' |
||
13 already built ⚠ 1
| status | attribute | duration |
|---|---|---|
checks.x86_64-linux.trynixos-minimal
|
— | |
checks.x86_64-linux.autopilot-herdr-prompt
|
— | |
checks.x86_64-linux.autopilot-run
|
— | |
checks.x86_64-linux.calendar
|
— | |
checks.x86_64-linux.clan-cli
|
— | |
checks.x86_64-linux.clanker
|
— | |
checks.x86_64-linux.deploy-trigger
|
— | |
checks.x86_64-linux.fabro
|
— | |
checks.x86_64-linux.hetzner-proxy
|
— | |
checks.x86_64-linux.shared-checkout-barrier
|
— | |
checks.x86_64-linux.vars
|
— | |
checks.x86_64-linux.workon
|
— | |
checks.x86_64-linux.workon-guard
|
— |