spaces/spacespkgs build #1 failed #2 →
nix-eval-jobs failed with exit code 1: error: flake 'git+file:///var/lib/nixbot/worktrees/rerun-4' does not provide attribute 'checks' error: flake 'git+file:///var/lib/nixbot/worktrees/rerun-4' does not provide attribute 'checks' error: worker error: error: flake 'git+file:///var/lib/nixbot/worktrees/rerun-4' does not provide attribute 'checks'
eval warnings
2 kinds
· 3 occurrences
- error flake 'git+file:///var/lib/nixbot/worktrees/rerun-4' does not provide attribute 'checks' ×2
- error worker error: error: flake 'git+file:///var/lib/nixbot/worktrees/rerun-4' does not provide attribute 'checks' ×1
no attributes (yet)